You are viewing a plain text version of this content. The canonical link for it is here.
Posted to builds@beam.apache.org by Apache Jenkins Server <je...@builds.apache.org> on 2023/12/02 00:01:37 UTC
Build failed in Jenkins: beam_PostCommit_Java_PVR_Spark_Batch #2793
See <https://ci-beam.apache.org/job/beam_PostCommit_Java_PVR_Spark_Batch/2793/display/redirect>
Changes:
------------------------------------------
[...truncated 44.89 KB...]
Uninstalling setuptools-44.0.0:
Successfully uninstalled setuptools-44.0.0
Successfully installed pip-23.3.1 setuptools-69.0.2 wheel-0.42.0
Collecting beautifulsoup4<5.0,>=4.9.0 (from -r <https://ci-beam.apache.org/job/beam_PostCommit_Java_PVR_Spark_Batch/ws/src/sdks/java/container/license_scripts/requirement.txt> (line 19))
Using cached beautifulsoup4-4.12.2-py3-none-any.whl (142 kB)
Collecting pyyaml<7,>=6.0.1 (from -r <https://ci-beam.apache.org/job/beam_PostCommit_Java_PVR_Spark_Batch/ws/src/sdks/java/container/license_scripts/requirement.txt> (line 20))
Using cached PyYAML-6.0.1-cp38-cp38-manylinux_2_17_x86_64.manylinux2014_x86_64.whl.metadata (2.1 kB)
Collecting tenacity<9.0,>=6.1.0 (from -r <https://ci-beam.apache.org/job/beam_PostCommit_Java_PVR_Spark_Batch/ws/src/sdks/java/container/license_scripts/requirement.txt> (line 21))
Using cached tenacity-8.2.3-py3-none-any.whl.metadata (1.0 kB)
Collecting soupsieve>1.2 (from beautifulsoup4<5.0,>=4.9.0->-r <https://ci-beam.apache.org/job/beam_PostCommit_Java_PVR_Spark_Batch/ws/src/sdks/java/container/license_scripts/requirement.txt> (line 19))
Using cached soupsieve-2.5-py3-none-any.whl.metadata (4.7 kB)
Using cached PyYAML-6.0.1-cp38-cp38-manylinux_2_17_x86_64.manylinux2014_x86_64.whl (736 kB)
Using cached tenacity-8.2.3-py3-none-any.whl (24 kB)
Using cached soupsieve-2.5-py3-none-any.whl (36 kB)
Installing collected packages: tenacity, soupsieve, pyyaml, beautifulsoup4
Successfully installed beautifulsoup4-4.12.2 pyyaml-6.0.1 soupsieve-2.5 tenacity-8.2.3
Executing python <https://ci-beam.apache.org/job/beam_PostCommit_Java_PVR_Spark_Batch/ws/src/sdks/java/container/license_scripts/pull_licenses_java.py> --license_index=<https://ci-beam.apache.org/job/beam_PostCommit_Java_PVR_Spark_Batch/ws/src/sdks/java/container/build/reports/dependency-license/index.json> --output_dir=<https://ci-beam.apache.org/job/beam_PostCommit_Java_PVR_Spark_Batch/ws/src/sdks/java/container/build/target/java_third_party_licenses> --dep_url_yaml=<https://ci-beam.apache.org/job/beam_PostCommit_Java_PVR_Spark_Batch/ws/src/sdks/java/container/license_scripts/dep_urls_java.yaml> --manual_license_path=<https://ci-beam.apache.org/job/beam_PostCommit_Java_PVR_Spark_Batch/ws/src/sdks/java/container/license_scripts/manual_licenses>
INFO:root:Pulling license for 126 dependencies using 16 threads.
INFO:root:Replaced local file URL with file://<https://ci-beam.apache.org/job/beam_PostCommit_Java_PVR_Spark_Batch/ws/src/sdks/java/container/license_scripts/manual_licenses/xz/COPYING> for xz-1.5
INFO:root:pull_licenses_java.py succeed. It took 1.431121 seconds with 16 threads.
Copying licenses from <https://ci-beam.apache.org/job/beam_PostCommit_Java_PVR_Spark_Batch/ws/src/sdks/java/container/build/target/java_third_party_licenses> to <https://ci-beam.apache.org/job/beam_PostCommit_Java_PVR_Spark_Batch/ws/src/sdks/java/container/build/target/third_party_licenses.>
Finished license_scripts.sh
> Task :release:go-licenses:java:dockerRun
+ rm -rf '/output/*'
+ go get github.com/apache/beam/sdks/v2/java/container
go: downloading github.com/apache/beam/sdks/v2 v2.52.0
go: downloading github.com/apache/beam v2.52.0+incompatible
> Task :sdks:java:container:java8:copyJavaThirdPartyLicenses
> Task :sdks:java:container:downloadCloudProfilerAgent
% Total % Received % Xferd Average Speed Time Time Time Current
Dload Upload Total Spent Left Speed
0 0 0 0 0 0 0 0 --:--:-- --:--:-- --:--:-- 0version.txt
NOTICES
profiler_java_agent.so
100 4183k 100 4183k 0 0 20.9M 0 --:--:-- --:--:-- --:--:-- 20.9M
> Task :sdks:java:container:goPrepare UP-TO-DATE
> Task :release:go-licenses:java:dockerRun
go: downloading github.com/golang/protobuf v1.5.3
go: downloading google.golang.org/grpc v1.59.0
go: downloading google.golang.org/protobuf v1.31.0
go: downloading golang.org/x/sys v0.13.0
go: downloading golang.org/x/net v0.17.0
go: downloading google.golang.org/genproto/googleapis/rpc v0.0.0-20231012201019-e917dd12ba7a
go: downloading google.golang.org/genproto v0.0.0-20231002182017-d307bd883b97
go: downloading golang.org/x/text v0.13.0
> Task :sdks:java:container:goBuild
/home/jenkins/go/bin/go1.21.4 build -o ./build/target/linux_amd64/boot boot.go boot_test.go pathingjar.go pathingjar_test.go
> Task :sdks:java:container:java8:copySdkHarnessLauncher
> Task :release:go-licenses:java:dockerRun
go: added github.com/apache/beam/sdks/v2 v2.52.0
go: added github.com/golang/protobuf v1.5.3
go: added golang.org/x/net v0.17.0
go: added golang.org/x/sys v0.13.0
go: added golang.org/x/text v0.13.0
go: added google.golang.org/genproto/googleapis/rpc v0.0.0-20231012201019-e917dd12ba7a
go: added google.golang.org/grpc v1.59.0
go: added google.golang.org/protobuf v1.31.0
+ go-licenses save github.com/apache/beam/sdks/v2/java/container --save_path=/output/licenses
W1201 22:21:07.204616 37 library.go:101] "golang.org/x/sys/unix" contains non-Go code that can't be inspected for further dependencies:
/go/pkg/mod/golang.org/x/sys@v0.13.0/unix/asm_linux_amd64.s
+ go-licenses csv github.com/apache/beam/sdks/v2/java/container
+ tee /output/licenses/list.csv
W1201 22:21:14.486319 82 library.go:101] "golang.org/x/sys/unix" contains non-Go code that can't be inspected for further dependencies:
/go/pkg/mod/golang.org/x/sys@v0.13.0/unix/asm_linux_amd64.s
github.com/apache/beam/sdks/v2/go,https://github.com/apache/beam/blob/sdks/v2.52.0/sdks/go/README.md,Apache-2.0
github.com/apache/beam/sdks/v2/java/container,https://github.com/apache/beam/blob/sdks/v2.52.0/sdks/LICENSE,Apache-2.0
github.com/golang/protobuf,https://github.com/golang/protobuf/blob/v1.5.3/LICENSE,BSD-3-Clause
golang.org/x/net,https://cs.opensource.google/go/x/net/+/v0.17.0:LICENSE,BSD-3-Clause
golang.org/x/sys/unix,https://cs.opensource.google/go/x/sys/+/v0.13.0:LICENSE,BSD-3-Clause
golang.org/x/text,https://cs.opensource.google/go/x/text/+/v0.13.0:LICENSE,BSD-3-Clause
google.golang.org/genproto/googleapis/rpc/status,https://github.com/googleapis/go-genproto/blob/e917dd12ba7a/googleapis/rpc/LICENSE,Apache-2.0
google.golang.org/grpc,https://github.com/grpc/grpc-go/blob/v1.59.0/LICENSE,Apache-2.0
google.golang.org/protobuf,https://github.com/protocolbuffers/protobuf-go/blob/v1.31.0/LICENSE,BSD-3-Clause
+ chmod -R a+w /output/licenses
> Task :runners:spark:3:job-server:validatesPortableRunnerBatch
> Task :release:go-licenses:java:createLicenses
> Task :sdks:java:container:java8:copyGolangLicenses
> Task :sdks:java:container:java8:dockerPrepare
> Task :sdks:java:container:java8:docker
#1 [internal] load build definition from Dockerfile
#1 transferring dockerfile: 2.59kB done
#1 DONE 0.0s
#2 [internal] load .dockerignore
#2 transferring context: 2B done
#2 DONE 0.0s
#3 [internal] load metadata for docker.io/library/eclipse-temurin:8
#3 DONE 0.3s
#4 [ 1/16] FROM docker.io/library/eclipse-temurin:8@sha256:f451165be121bd40cdc1c2ba5e3039fff4021e038b2b03059179368e2b44e0ec
#4 resolve docker.io/library/eclipse-temurin:8@sha256:f451165be121bd40cdc1c2ba5e3039fff4021e038b2b03059179368e2b44e0ec 0.0s done
#4 CACHED
#5 [internal] load build context
#5 transferring context: 47.30MB 0.4s done
#5 DONE 0.5s
#6 [ 2/16] ADD target/slf4j-api.jar /opt/apache/beam/jars/
#6 DONE 3.6s
#7 [ 3/16] ADD target/slf4j-jdk14.jar /opt/apache/beam/jars/
#7 DONE 11.6s
#8 [ 4/16] ADD target/jcl-over-slf4j.jar /opt/apache/beam/jars/
#8 DONE 4.0s
#9 [ 5/16] ADD target/log4j-over-slf4j.jar /opt/apache/beam/jars/
#9 DONE 1.4s
#10 [ 6/16] ADD target/log4j-to-slf4j.jar /opt/apache/beam/jars/
#10 DONE 3.6s
#11 [ 7/16] ADD target/beam-sdks-java-harness.jar /opt/apache/beam/jars/
#11 DONE 4.6s
#12 [ 8/16] COPY target/jamm.jar target/open-module-agent*.jar /opt/apache/beam/jars/
#12 DONE 0.3s
#13 [ 9/16] COPY target/linux_amd64/boot /opt/apache/beam/
#13 DONE 0.2s
#14 [10/16] COPY target/LICENSE /opt/apache/beam/
#14 DONE 0.1s
#15 [11/16] COPY target/NOTICE /opt/apache/beam/
#15 DONE 0.1s
#16 [12/16] ADD target/third_party_licenses /opt/apache/beam/third_party_licenses/
#16 DONE 0.2s
#17 [13/16] COPY target/LICENSE target/options/* /opt/apache/beam/options/
#17 DONE 0.1s
#18 [14/16] COPY target/go-licenses/* /opt/apache/beam/third_party_licenses/golang/
#18 DONE 0.1s
#19 [15/16] RUN if [ "true" = "false" ] ; then rm -rf /opt/apache/beam/third_party_licenses ; fi
#19 DONE 0.6s
#20 [16/16] COPY target/profiler/* /opt/google_cloud_profiler/
#20 DONE 0.1s
#21 exporting to image
#21 exporting layers
#21 exporting layers 0.4s done
#21 writing image sha256:c1ed8d4d2fe4f73573af34e2e825f52d2ab0fdf9651bfb180d0eaa405b305020 done
#21 naming to docker.io/apache/beam_java8_sdk:2.53.0.dev done
#21 DONE 0.4s
> Task :runners:spark:3:job-server:validatesPortableRunnerBatch
org.apache.beam.sdk.transforms.ParDoTest$MultipleInputsAndOutputTests > testMultiOutputParDoWithSideInputs FAILED
java.lang.RuntimeException at ParDoTest.java:1251
org.apache.beam.sdk.transforms.ParDoTest$MultipleInputsAndOutputTests > testParDoEmptyWithTaggedOutput FAILED
java.lang.RuntimeException at ParDoTest.java:765
[shutdown-hook-0] INFO org.apache.spark.util.ShutdownHookManager - Shutdown hook called
[shutdown-hook-0] INFO org.apache.spark.util.ShutdownHookManager - Deleting directory /tmp/spark-fc90eccc-54a6-4cdd-9d3d-99282e4be7b5
> Task :runners:spark:3:job-server:validatesPortableRunnerBatch
org.apache.beam.sdk.transforms.ParDoTest$MultipleInputsAndOutputTests > testParDoWithTaggedOutput FAILED
java.lang.RuntimeException at ParDoTest.java:723
org.apache.beam.sdk.transforms.ParDoTest$MultipleInputsAndOutputTests > testMultiOutputParDoWithSideInputsIsCumulative FAILED
java.lang.RuntimeException at ParDoTest.java:1289
org.apache.beam.sdk.transforms.ParDoTest$MultipleInputsAndOutputTests > testSideInputAnnotationWithMultipleSideInputs FAILED
java.lang.RuntimeException at ParDoTest.java:1179
org.apache.beam.sdk.transforms.ParDoTest$StateTests > testValueStateSameId FAILED
java.lang.RuntimeException at ParDoTest.java:2528
org.apache.beam.sdk.transforms.ParDoTest$StateTests > testValueStateSimple FAILED
java.lang.RuntimeException at ParDoTest.java:2292
org.apache.beam.sdk.transforms.ParDoTest$StateTests > testBagStateSideInput FAILED
java.lang.RuntimeException at ParDoTest.java:3583
org.apache.beam.sdk.transforms.ParDoTest$StateTests > testCombiningStateParameterSuperclass FAILED
java.lang.RuntimeException at ParDoTest.java:3533
org.apache.beam.sdk.transforms.ParDoTest$StateTests > testCoderInferenceOfList FAILED
java.lang.RuntimeException at ParDoTest.java:2429
org.apache.beam.sdk.transforms.ParDoTest$StateTests > testValueStateDedup FAILED
java.lang.RuntimeException at ParDoTest.java:2342
org.apache.beam.sdk.transforms.ParDoTest$StateTests > testValueStateFixedWindows FAILED
java.lang.RuntimeException at ParDoTest.java:2473
org.apache.beam.sdk.transforms.ParDoTest$TimestampTests > testParDoTaggedOutputWithTimestamp FAILED
java.lang.RuntimeException at ParDoTest.java:2030
[shutdown-hook-0] INFO org.apache.spark.util.ShutdownHookManager - Shutdown hook called
[shutdown-hook-0] INFO org.apache.spark.util.ShutdownHookManager - Deleting directory /tmp/spark-9805fad7-ee48-4a29-8af9-258f104f7ac6
> Task :runners:spark:3:job-server:validatesPortableRunnerBatch
org.apache.beam.sdk.transforms.ParDoTest$TimestampTests > testParDoShiftTimestampUnlimited FAILED
java.lang.RuntimeException at ParDoTest.java:2142
[shutdown-hook-0] INFO org.apache.spark.util.ShutdownHookManager - Shutdown hook called
[shutdown-hook-0] INFO org.apache.spark.util.ShutdownHookManager - Deleting directory /tmp/spark-49a50ca0-f640-4388-8133-0e9d31828f3b
[shutdown-hook-0] INFO org.apache.spark.util.ShutdownHookManager - Shutdown hook called
[shutdown-hook-0] INFO org.apache.spark.util.ShutdownHookManager - Deleting directory /tmp/spark-b2863708-d4d0-4cb4-8f44-39e0cf9b0e7d
> Task :runners:spark:3:job-server:validatesPortableRunnerBatch
233 tests completed, 14 failed, 1 skipped
> Task :runners:spark:3:job-server:validatesPortableRunnerBatch FAILED
> Task :runners:spark:3:job-server:validatesPortableRunnerDocker
[shutdown-hook-0] INFO org.apache.spark.util.ShutdownHookManager - Shutdown hook called
[shutdown-hook-0] INFO org.apache.spark.util.ShutdownHookManager - Deleting directory /tmp/spark-8d78437a-f177-4742-b2a1-38ce5bc04e34
FAILURE: Build failed with an exception.
* What went wrong:
Execution failed for task ':runners:spark:3:job-server:validatesPortableRunnerBatch'.
> There were failing tests. See the report at: file://<https://ci-beam.apache.org/job/beam_PostCommit_Java_PVR_Spark_Batch/ws/src/runners/spark/3/job-server/build/reports/tests/validatesPortableRunnerBatch/index.html>
Deprecated Gradle features were used in this build, making it incompatible with Gradle 9.0.
You can use '--warning-mode all' to show the individual deprecation warnings and determine if they come from your own scripts or plugins.
For more on this, please refer to https://docs.gradle.org/8.4/userguide/command_line_interface.html#sec:command_line_warnings in the Gradle documentation.
BUILD FAILED in 1h 41m 12s
121 actionable tasks: 79 executed, 40 from cache, 2 up-to-date
Publishing build scan...
https://ge.apache.org/s/orymsnql6sci4
Build step 'Invoke Gradle script' changed build result to FAILURE
Build step 'Invoke Gradle script' marked build as failure
---------------------------------------------------------------------
To unsubscribe, e-mail: builds-unsubscribe@beam.apache.org
For additional commands, e-mail: builds-help@beam.apache.org
Jenkins build is back to normal : beam_PostCommit_Java_PVR_Spark_Batch #2798
Posted by Apache Jenkins Server <je...@builds.apache.org>.
See <https://ci-beam.apache.org/job/beam_PostCommit_Java_PVR_Spark_Batch/2798/display/redirect?page=changes>
---------------------------------------------------------------------
To unsubscribe, e-mail: builds-unsubscribe@beam.apache.org
For additional commands, e-mail: builds-help@beam.apache.org
Build failed in Jenkins: beam_PostCommit_Java_PVR_Spark_Batch #2797
Posted by Apache Jenkins Server <je...@builds.apache.org>.
See <https://ci-beam.apache.org/job/beam_PostCommit_Java_PVR_Spark_Batch/2797/display/redirect>
Changes:
------------------------------------------
[...truncated 43.34 KB...]
#2 [internal] load .dockerignore
#2 transferring context: 2B done
#2 DONE 0.0s
#3 [internal] load metadata for docker.io/library/golang:1.20-bullseye
#3 DONE 0.3s
#4 [1/5] FROM docker.io/library/golang:1.20-bullseye@sha256:c4c28e1d66ff6e8bfa51543940688d512fc1c128325149021e123bd642a47e55
#4 resolve docker.io/library/golang:1.20-bullseye@sha256:c4c28e1d66ff6e8bfa51543940688d512fc1c128325149021e123bd642a47e55 0.0s done
#4 DONE 0.0s
#5 [internal] load build context
#5 transferring context: 1.96kB 0.0s done
#5 DONE 0.0s
#6 [4/5] RUN go install github.com/google/go-licenses@latest
#6 CACHED
#7 [2/5] WORKDIR /usr/src/app
#7 CACHED
#8 [3/5] COPY go.mod ./
#8 CACHED
#9 [5/5] COPY get-licenses.sh /opt/apache/beam/
#9 CACHED
#10 exporting to image
#10 exporting layers done
#10 writing image sha256:4ac2c2da48ee24f11033f7676d48ead53c53133444d70361f90f16a65f013a3e
#10 writing image sha256:4ac2c2da48ee24f11033f7676d48ead53c53133444d70361f90f16a65f013a3e done
#10 naming to docker.io/library/golicenses-java done
#10 DONE 0.0s
> Task :sdks:java:container:pullLicenses
Collecting setuptools
Using cached setuptools-69.0.2-py3-none-any.whl (819 kB)
Collecting wheel
Using cached wheel-0.42.0-py3-none-any.whl (65 kB)
Installing collected packages: pip, setuptools, wheel
Attempting uninstall: pip
Found existing installation: pip 20.0.2
Uninstalling pip-20.0.2:
Successfully uninstalled pip-20.0.2
Attempting uninstall: setuptools
Found existing installation: setuptools 44.0.0
Uninstalling setuptools-44.0.0:
Successfully uninstalled setuptools-44.0.0
Successfully installed pip-23.3.1 setuptools-69.0.2 wheel-0.42.0
Collecting beautifulsoup4<5.0,>=4.9.0 (from -r <https://ci-beam.apache.org/job/beam_PostCommit_Java_PVR_Spark_Batch/ws/src/sdks/java/container/license_scripts/requirement.txt> (line 19))
Using cached beautifulsoup4-4.12.2-py3-none-any.whl (142 kB)
Collecting pyyaml<7,>=6.0.1 (from -r <https://ci-beam.apache.org/job/beam_PostCommit_Java_PVR_Spark_Batch/ws/src/sdks/java/container/license_scripts/requirement.txt> (line 20))
Using cached PyYAML-6.0.1-cp38-cp38-manylinux_2_17_x86_64.manylinux2014_x86_64.whl.metadata (2.1 kB)
Collecting tenacity<9.0,>=6.1.0 (from -r <https://ci-beam.apache.org/job/beam_PostCommit_Java_PVR_Spark_Batch/ws/src/sdks/java/container/license_scripts/requirement.txt> (line 21))
Using cached tenacity-8.2.3-py3-none-any.whl.metadata (1.0 kB)
Collecting soupsieve>1.2 (from beautifulsoup4<5.0,>=4.9.0->-r <https://ci-beam.apache.org/job/beam_PostCommit_Java_PVR_Spark_Batch/ws/src/sdks/java/container/license_scripts/requirement.txt> (line 19))
Using cached soupsieve-2.5-py3-none-any.whl.metadata (4.7 kB)
Using cached PyYAML-6.0.1-cp38-cp38-manylinux_2_17_x86_64.manylinux2014_x86_64.whl (736 kB)
Using cached tenacity-8.2.3-py3-none-any.whl (24 kB)
Using cached soupsieve-2.5-py3-none-any.whl (36 kB)
Installing collected packages: tenacity, soupsieve, pyyaml, beautifulsoup4
Successfully installed beautifulsoup4-4.12.2 pyyaml-6.0.1 soupsieve-2.5 tenacity-8.2.3
Executing python <https://ci-beam.apache.org/job/beam_PostCommit_Java_PVR_Spark_Batch/ws/src/sdks/java/container/license_scripts/pull_licenses_java.py> --license_index=<https://ci-beam.apache.org/job/beam_PostCommit_Java_PVR_Spark_Batch/ws/src/sdks/java/container/build/reports/dependency-license/index.json> --output_dir=<https://ci-beam.apache.org/job/beam_PostCommit_Java_PVR_Spark_Batch/ws/src/sdks/java/container/build/target/java_third_party_licenses> --dep_url_yaml=<https://ci-beam.apache.org/job/beam_PostCommit_Java_PVR_Spark_Batch/ws/src/sdks/java/container/license_scripts/dep_urls_java.yaml> --manual_license_path=<https://ci-beam.apache.org/job/beam_PostCommit_Java_PVR_Spark_Batch/ws/src/sdks/java/container/license_scripts/manual_licenses>
INFO:root:Pulling license for 126 dependencies using 16 threads.
INFO:root:Replaced local file URL with file://<https://ci-beam.apache.org/job/beam_PostCommit_Java_PVR_Spark_Batch/ws/src/sdks/java/container/license_scripts/manual_licenses/xz/COPYING> for xz-1.5
INFO:root:pull_licenses_java.py succeed. It took 1.431852 seconds with 16 threads.
Copying licenses from <https://ci-beam.apache.org/job/beam_PostCommit_Java_PVR_Spark_Batch/ws/src/sdks/java/container/build/target/java_third_party_licenses> to <https://ci-beam.apache.org/job/beam_PostCommit_Java_PVR_Spark_Batch/ws/src/sdks/java/container/build/target/third_party_licenses.>
Finished license_scripts.sh
> Task :release:go-licenses:java:dockerRun
+ rm -rf '/output/*'
+ go get github.com/apache/beam/sdks/v2/java/container
go: downloading github.com/apache/beam/sdks/v2 v2.52.0
go: downloading github.com/apache/beam v2.52.0+incompatible
> Task :sdks:java:container:java8:copyJavaThirdPartyLicenses
> Task :sdks:java:container:downloadCloudProfilerAgent
% Total % Received % Xferd Average Speed Time Time Time Current
Dload Upload Total Spent Left Speed
0 0 0 0 0 0 0 0 --:--:-- --:--:-- --:--:-- 0version.txt
NOTICES
profiler_java_agent.so
100 4183k 100 4183k 0 0 21.6M 0 --:--:-- --:--:-- --:--:-- 21.6M
> Task :sdks:java:container:goPrepare UP-TO-DATE
> Task :release:go-licenses:java:dockerRun
go: downloading github.com/golang/protobuf v1.5.3
go: downloading google.golang.org/grpc v1.59.0
go: downloading google.golang.org/protobuf v1.31.0
go: downloading golang.org/x/sys v0.13.0
go: downloading golang.org/x/net v0.17.0
go: downloading google.golang.org/genproto/googleapis/rpc v0.0.0-20231012201019-e917dd12ba7a
go: downloading google.golang.org/genproto v0.0.0-20231002182017-d307bd883b97
> Task :sdks:java:container:goBuild
/home/jenkins/go/bin/go1.21.4 build -o ./build/target/linux_amd64/boot boot.go boot_test.go pathingjar.go pathingjar_test.go
> Task :sdks:java:container:java8:copySdkHarnessLauncher
> Task :release:go-licenses:java:dockerRun
go: downloading golang.org/x/text v0.13.0
go: added github.com/apache/beam/sdks/v2 v2.52.0
go: added github.com/golang/protobuf v1.5.3
go: added golang.org/x/net v0.17.0
go: added golang.org/x/sys v0.13.0
go: added golang.org/x/text v0.13.0
go: added google.golang.org/genproto/googleapis/rpc v0.0.0-20231012201019-e917dd12ba7a
go: added google.golang.org/grpc v1.59.0
go: added google.golang.org/protobuf v1.31.0
+ go-licenses save github.com/apache/beam/sdks/v2/java/container --save_path=/output/licenses
W1202 22:21:07.494840 38 library.go:101] "golang.org/x/sys/unix" contains non-Go code that can't be inspected for further dependencies:
/go/pkg/mod/golang.org/x/sys@v0.13.0/unix/asm_linux_amd64.s
+ go-licenses csv github.com/apache/beam/sdks/v2/java/container
+ tee /output/licenses/list.csv
W1202 22:21:14.987431 81 library.go:101] "golang.org/x/sys/unix" contains non-Go code that can't be inspected for further dependencies:
/go/pkg/mod/golang.org/x/sys@v0.13.0/unix/asm_linux_amd64.s
github.com/apache/beam/sdks/v2/go,https://github.com/apache/beam/blob/sdks/v2.52.0/sdks/go/README.md,Apache-2.0
github.com/apache/beam/sdks/v2/java/container,https://github.com/apache/beam/blob/sdks/v2.52.0/sdks/LICENSE,Apache-2.0
github.com/golang/protobuf,https://github.com/golang/protobuf/blob/v1.5.3/LICENSE,BSD-3-Clause
golang.org/x/net,https://cs.opensource.google/go/x/net/+/v0.17.0:LICENSE,BSD-3-Clause
golang.org/x/sys/unix,https://cs.opensource.google/go/x/sys/+/v0.13.0:LICENSE,BSD-3-Clause
golang.org/x/text,https://cs.opensource.google/go/x/text/+/v0.13.0:LICENSE,BSD-3-Clause
google.golang.org/genproto/googleapis/rpc/status,https://github.com/googleapis/go-genproto/blob/e917dd12ba7a/googleapis/rpc/LICENSE,Apache-2.0
google.golang.org/grpc,https://github.com/grpc/grpc-go/blob/v1.59.0/LICENSE,Apache-2.0
google.golang.org/protobuf,https://github.com/protocolbuffers/protobuf-go/blob/v1.31.0/LICENSE,BSD-3-Clause
+ chmod -R a+w /output/licenses
> Task :runners:spark:3:job-server:validatesPortableRunnerBatch
> Task :release:go-licenses:java:createLicenses
> Task :sdks:java:container:java8:copyGolangLicenses
> Task :sdks:java:container:java8:dockerPrepare
> Task :sdks:java:container:java8:docker
#1 [internal] load .dockerignore
#1 transferring context: 2B done
#1 DONE 0.1s
#2 [internal] load build definition from Dockerfile
#2 transferring dockerfile: 2.59kB done
#2 DONE 0.2s
#3 [internal] load metadata for docker.io/library/eclipse-temurin:8
#3 DONE 2.1s
#4 [ 1/16] FROM docker.io/library/eclipse-temurin:8@sha256:fecbe1e760cfe07486c145ee49b16e59bb99bf41bce9aaf52bdd69d0ed406d27
#4 resolve docker.io/library/eclipse-temurin:8@sha256:fecbe1e760cfe07486c145ee49b16e59bb99bf41bce9aaf52bdd69d0ed406d27
#4 resolve docker.io/library/eclipse-temurin:8@sha256:fecbe1e760cfe07486c145ee49b16e59bb99bf41bce9aaf52bdd69d0ed406d27 1.2s done
#4 CACHED
#5 [internal] load build context
#5 transferring context: 47.30MB 0.8s done
#5 DONE 2.1s
#6 [ 2/16] ADD target/slf4j-api.jar /opt/apache/beam/jars/
#6 DONE 3.1s
#7 [ 3/16] ADD target/slf4j-jdk14.jar /opt/apache/beam/jars/
#7 DONE 0.1s
#8 [ 4/16] ADD target/jcl-over-slf4j.jar /opt/apache/beam/jars/
#8 DONE 0.1s
#9 [ 5/16] ADD target/log4j-over-slf4j.jar /opt/apache/beam/jars/
#9 DONE 0.1s
#10 [ 6/16] ADD target/log4j-to-slf4j.jar /opt/apache/beam/jars/
#10 DONE 0.1s
#11 [ 7/16] ADD target/beam-sdks-java-harness.jar /opt/apache/beam/jars/
#11 DONE 0.1s
#12 [ 8/16] COPY target/jamm.jar target/open-module-agent*.jar /opt/apache/beam/jars/
#12 DONE 0.1s
#13 [ 9/16] COPY target/linux_amd64/boot /opt/apache/beam/
#13 DONE 0.2s
#14 [10/16] COPY target/LICENSE /opt/apache/beam/
#14 DONE 0.0s
#15 [11/16] COPY target/NOTICE /opt/apache/beam/
#15 DONE 0.0s
#16 [12/16] ADD target/third_party_licenses /opt/apache/beam/third_party_licenses/
#16 DONE 0.2s
#17 [13/16] COPY target/LICENSE target/options/* /opt/apache/beam/options/
#17 DONE 0.1s
#18 [14/16] COPY target/go-licenses/* /opt/apache/beam/third_party_licenses/golang/
#18 DONE 0.0s
#19 [15/16] RUN if [ "true" = "false" ] ; then rm -rf /opt/apache/beam/third_party_licenses ; fi
#19 DONE 0.6s
#20 [16/16] COPY target/profiler/* /opt/google_cloud_profiler/
#20 DONE 0.1s
#21 exporting to image
#21 exporting layers
#21 exporting layers 0.3s done
#21 writing image sha256:de743d5e51ef869244ef01062482ba26189d8a759817e4a43a22e2b9325262f0 done
#21 naming to docker.io/apache/beam_java8_sdk:2.53.0.dev
#21 naming to docker.io/apache/beam_java8_sdk:2.53.0.dev done
#21 DONE 0.3s
> Task :runners:spark:3:job-server:validatesPortableRunnerBatch
org.apache.beam.sdk.transforms.ParDoTest$MultipleInputsAndOutputTests > testParDoWithOnlyTaggedOutput FAILED
java.lang.RuntimeException at ParDoTest.java:818
[shutdown-hook-0] INFO org.apache.spark.util.ShutdownHookManager - Shutdown hook called
[shutdown-hook-0] INFO org.apache.spark.util.ShutdownHookManager - Deleting directory /tmp/spark-bfbf565d-4918-4f57-b626-7d97db7d14f1
[shutdown-hook-0] INFO org.apache.spark.util.ShutdownHookManager - Shutdown hook called
[shutdown-hook-0] INFO org.apache.spark.util.ShutdownHookManager - Deleting directory /tmp/spark-b1b6ec4a-5fa9-4f46-accc-6ab3a4c7ffe7
[shutdown-hook-0] INFO org.apache.spark.util.ShutdownHookManager - Shutdown hook called
[shutdown-hook-0] INFO org.apache.spark.util.ShutdownHookManager - Deleting directory /tmp/spark-c3e7a718-b477-41b8-845c-add05f9b4edb
[shutdown-hook-0] INFO org.apache.spark.util.ShutdownHookManager - Shutdown hook called
[shutdown-hook-0] INFO org.apache.spark.util.ShutdownHookManager - Deleting directory /tmp/spark-fe0931b7-1741-4a98-88b8-c73002a6c6ca
> Task :runners:spark:3:job-server:validatesPortableRunnerBatch
233 tests completed, 1 failed, 1 skipped
> Task :runners:spark:3:job-server:validatesPortableRunnerBatch FAILED
> Task :runners:spark:3:job-server:validatesPortableRunnerDocker FROM-CACHE
FAILURE: Build failed with an exception.
* What went wrong:
Execution failed for task ':runners:spark:3:job-server:validatesPortableRunnerBatch'.
> There were failing tests. See the report at: file://<https://ci-beam.apache.org/job/beam_PostCommit_Java_PVR_Spark_Batch/ws/src/runners/spark/3/job-server/build/reports/tests/validatesPortableRunnerBatch/index.html>
Deprecated Gradle features were used in this build, making it incompatible with Gradle 9.0.
You can use '--warning-mode all' to show the individual deprecation warnings and determine if they come from your own scripts or plugins.
For more on this, please refer to https://docs.gradle.org/8.4/userguide/command_line_interface.html#sec:command_line_warnings in the Gradle documentation.
BUILD FAILED in 1h 36m
121 actionable tasks: 78 executed, 41 from cache, 2 up-to-date
Publishing build scan...
https://ge.apache.org/s/7i6orppplrrow
Build step 'Invoke Gradle script' changed build result to FAILURE
Build step 'Invoke Gradle script' marked build as failure
---------------------------------------------------------------------
To unsubscribe, e-mail: builds-unsubscribe@beam.apache.org
For additional commands, e-mail: builds-help@beam.apache.org
Build failed in Jenkins: beam_PostCommit_Java_PVR_Spark_Batch #2796
Posted by Apache Jenkins Server <je...@builds.apache.org>.
See <https://ci-beam.apache.org/job/beam_PostCommit_Java_PVR_Spark_Batch/2796/display/redirect?page=changes>
Changes:
[noreply] Adding failure_mode parameter to Spanner Python transforms (#29529)
------------------------------------------
[...truncated 43.51 KB...]
#4 transferring context: 1.96kB done
#4 DONE 0.0s
#5 [1/5] FROM docker.io/library/golang:1.20-bullseye@sha256:c4c28e1d66ff6e8bfa51543940688d512fc1c128325149021e123bd642a47e55
#5 resolve docker.io/library/golang:1.20-bullseye@sha256:c4c28e1d66ff6e8bfa51543940688d512fc1c128325149021e123bd642a47e55 0.0s done
#5 DONE 0.0s
#6 [4/5] RUN go install github.com/google/go-licenses@latest
#6 CACHED
#7 [2/5] WORKDIR /usr/src/app
#7 CACHED
#8 [3/5] COPY go.mod ./
#8 CACHED
#9 [5/5] COPY get-licenses.sh /opt/apache/beam/
#9 CACHED
#10 exporting to image
#10 exporting layers done
#10 writing image sha256:e3d7f4659d6adda8dac0ddf917caef56c4e27f05d3f361955267db76c9ed8f50 done
#10 naming to docker.io/library/golicenses-java done
#10 DONE 0.0s
> Task :sdks:java:container:pullLicenses
Collecting setuptools
Using cached setuptools-69.0.2-py3-none-any.whl (819 kB)
Collecting wheel
Using cached wheel-0.42.0-py3-none-any.whl (65 kB)
Installing collected packages: pip, setuptools, wheel
Attempting uninstall: pip
Found existing installation: pip 20.0.2
Uninstalling pip-20.0.2:
Successfully uninstalled pip-20.0.2
Attempting uninstall: setuptools
Found existing installation: setuptools 44.0.0
Uninstalling setuptools-44.0.0:
Successfully uninstalled setuptools-44.0.0
Successfully installed pip-23.3.1 setuptools-69.0.2 wheel-0.42.0
Collecting beautifulsoup4<5.0,>=4.9.0 (from -r <https://ci-beam.apache.org/job/beam_PostCommit_Java_PVR_Spark_Batch/ws/src/sdks/java/container/license_scripts/requirement.txt> (line 19))
Using cached beautifulsoup4-4.12.2-py3-none-any.whl (142 kB)
Collecting pyyaml<7,>=6.0.1 (from -r <https://ci-beam.apache.org/job/beam_PostCommit_Java_PVR_Spark_Batch/ws/src/sdks/java/container/license_scripts/requirement.txt> (line 20))
Using cached PyYAML-6.0.1-cp38-cp38-manylinux_2_17_x86_64.manylinux2014_x86_64.whl.metadata (2.1 kB)
Collecting tenacity<9.0,>=6.1.0 (from -r <https://ci-beam.apache.org/job/beam_PostCommit_Java_PVR_Spark_Batch/ws/src/sdks/java/container/license_scripts/requirement.txt> (line 21))
Using cached tenacity-8.2.3-py3-none-any.whl.metadata (1.0 kB)
Collecting soupsieve>1.2 (from beautifulsoup4<5.0,>=4.9.0->-r <https://ci-beam.apache.org/job/beam_PostCommit_Java_PVR_Spark_Batch/ws/src/sdks/java/container/license_scripts/requirement.txt> (line 19))
Using cached soupsieve-2.5-py3-none-any.whl.metadata (4.7 kB)
Using cached PyYAML-6.0.1-cp38-cp38-manylinux_2_17_x86_64.manylinux2014_x86_64.whl (736 kB)
Using cached tenacity-8.2.3-py3-none-any.whl (24 kB)
Using cached soupsieve-2.5-py3-none-any.whl (36 kB)
Installing collected packages: tenacity, soupsieve, pyyaml, beautifulsoup4
Successfully installed beautifulsoup4-4.12.2 pyyaml-6.0.1 soupsieve-2.5 tenacity-8.2.3
Executing python <https://ci-beam.apache.org/job/beam_PostCommit_Java_PVR_Spark_Batch/ws/src/sdks/java/container/license_scripts/pull_licenses_java.py> --license_index=<https://ci-beam.apache.org/job/beam_PostCommit_Java_PVR_Spark_Batch/ws/src/sdks/java/container/build/reports/dependency-license/index.json> --output_dir=<https://ci-beam.apache.org/job/beam_PostCommit_Java_PVR_Spark_Batch/ws/src/sdks/java/container/build/target/java_third_party_licenses> --dep_url_yaml=<https://ci-beam.apache.org/job/beam_PostCommit_Java_PVR_Spark_Batch/ws/src/sdks/java/container/license_scripts/dep_urls_java.yaml> --manual_license_path=<https://ci-beam.apache.org/job/beam_PostCommit_Java_PVR_Spark_Batch/ws/src/sdks/java/container/license_scripts/manual_licenses>
INFO:root:Pulling license for 126 dependencies using 16 threads.
INFO:root:Replaced local file URL with file://<https://ci-beam.apache.org/job/beam_PostCommit_Java_PVR_Spark_Batch/ws/src/sdks/java/container/license_scripts/manual_licenses/xz/COPYING> for xz-1.5
INFO:root:pull_licenses_java.py succeed. It took 1.465195 seconds with 16 threads.
Copying licenses from <https://ci-beam.apache.org/job/beam_PostCommit_Java_PVR_Spark_Batch/ws/src/sdks/java/container/build/target/java_third_party_licenses> to <https://ci-beam.apache.org/job/beam_PostCommit_Java_PVR_Spark_Batch/ws/src/sdks/java/container/build/target/third_party_licenses.>
Finished license_scripts.sh
> Task :release:go-licenses:java:dockerRun
+ rm -rf '/output/*'
+ go get github.com/apache/beam/sdks/v2/java/container
go: downloading github.com/apache/beam/sdks/v2 v2.52.0
go: downloading github.com/apache/beam v2.52.0+incompatible
> Task :sdks:java:container:java8:copyJavaThirdPartyLicenses
> Task :sdks:java:container:downloadCloudProfilerAgent
% Total % Received % Xferd Average Speed Time Time Time Current
Dload Upload Total Spent Left Speed
0 0 0 0 0 0 0 0 --:--:-- --:--:-- --:--:-- 0version.txt
NOTICES
profiler_java_agent.so
31 4183k 31 1326k 0 0 8904k 0 --:--:-- --:--:-- --:--:-- 8845k100 4183k 100 4183k 0 0 17.7M 0 --:--:-- --:--:-- --:--:-- 17.6M
> Task :sdks:java:container:goPrepare UP-TO-DATE
> Task :release:go-licenses:java:dockerRun
go: downloading github.com/golang/protobuf v1.5.3
go: downloading google.golang.org/grpc v1.59.0
go: downloading google.golang.org/protobuf v1.31.0
go: downloading golang.org/x/sys v0.13.0
go: downloading golang.org/x/net v0.17.0
go: downloading google.golang.org/genproto/googleapis/rpc v0.0.0-20231012201019-e917dd12ba7a
go: downloading google.golang.org/genproto v0.0.0-20231002182017-d307bd883b97
go: downloading golang.org/x/text v0.13.0
> Task :sdks:java:container:goBuild
/home/jenkins/go/bin/go1.21.4 build -o ./build/target/linux_amd64/boot boot.go boot_test.go pathingjar.go pathingjar_test.go
> Task :sdks:java:container:java8:copySdkHarnessLauncher
> Task :release:go-licenses:java:dockerRun
go: added github.com/apache/beam/sdks/v2 v2.52.0
go: added github.com/golang/protobuf v1.5.3
go: added golang.org/x/net v0.17.0
go: added golang.org/x/sys v0.13.0
go: added golang.org/x/text v0.13.0
go: added google.golang.org/genproto/googleapis/rpc v0.0.0-20231012201019-e917dd12ba7a
go: added google.golang.org/grpc v1.59.0
go: added google.golang.org/protobuf v1.31.0
+ go-licenses save github.com/apache/beam/sdks/v2/java/container --save_path=/output/licenses
W1202 16:21:24.587647 36 library.go:101] "golang.org/x/sys/unix" contains non-Go code that can't be inspected for further dependencies:
/go/pkg/mod/golang.org/x/sys@v0.13.0/unix/asm_linux_amd64.s
+ go-licenses csv github.com/apache/beam/sdks/v2/java/container
+ tee /output/licenses/list.csv
W1202 16:21:34.894480 82 library.go:101] "golang.org/x/sys/unix" contains non-Go code that can't be inspected for further dependencies:
/go/pkg/mod/golang.org/x/sys@v0.13.0/unix/asm_linux_amd64.s
github.com/apache/beam/sdks/v2/go,https://github.com/apache/beam/blob/sdks/v2.52.0/sdks/go/README.md,Apache-2.0
github.com/apache/beam/sdks/v2/java/container,https://github.com/apache/beam/blob/sdks/v2.52.0/sdks/LICENSE,Apache-2.0
github.com/golang/protobuf,https://github.com/golang/protobuf/blob/v1.5.3/LICENSE,BSD-3-Clause
golang.org/x/net,https://cs.opensource.google/go/x/net/+/v0.17.0:LICENSE,BSD-3-Clause
golang.org/x/sys/unix,https://cs.opensource.google/go/x/sys/+/v0.13.0:LICENSE,BSD-3-Clause
golang.org/x/text,https://cs.opensource.google/go/x/text/+/v0.13.0:LICENSE,BSD-3-Clause
google.golang.org/genproto/googleapis/rpc/status,https://github.com/googleapis/go-genproto/blob/e917dd12ba7a/googleapis/rpc/LICENSE,Apache-2.0
google.golang.org/grpc,https://github.com/grpc/grpc-go/blob/v1.59.0/LICENSE,Apache-2.0
google.golang.org/protobuf,https://github.com/protocolbuffers/protobuf-go/blob/v1.31.0/LICENSE,BSD-3-Clause
+ chmod -R a+w /output/licenses
> Task :runners:spark:3:job-server:validatesPortableRunnerBatch
> Task :release:go-licenses:java:createLicenses
> Task :sdks:java:container:java8:copyGolangLicenses
> Task :sdks:java:container:java8:dockerPrepare
> Task :sdks:java:container:java8:docker
#1 [internal] load .dockerignore
#1 transferring context: 2B done
#1 ...
#2 [internal] load build definition from Dockerfile
#2 transferring dockerfile: 2.59kB done
#2 DONE 1.8s
#1 [internal] load .dockerignore
#1 DONE 2.6s
#3 [internal] load metadata for docker.io/library/eclipse-temurin:8
#3 DONE 2.1s
#4 [ 1/16] FROM docker.io/library/eclipse-temurin:8@sha256:fecbe1e760cfe07486c145ee49b16e59bb99bf41bce9aaf52bdd69d0ed406d27
#4 resolve docker.io/library/eclipse-temurin:8@sha256:fecbe1e760cfe07486c145ee49b16e59bb99bf41bce9aaf52bdd69d0ed406d27
#4 resolve docker.io/library/eclipse-temurin:8@sha256:fecbe1e760cfe07486c145ee49b16e59bb99bf41bce9aaf52bdd69d0ed406d27 0.6s done
#4 CACHED
#5 [internal] load build context
#5 transferring context: 27.33MB 0.4s
#5 transferring context: 47.30MB 0.6s done
#5 DONE 1.3s
#6 [ 2/16] ADD target/slf4j-api.jar /opt/apache/beam/jars/
#6 DONE 1.9s
#7 [ 3/16] ADD target/slf4j-jdk14.jar /opt/apache/beam/jars/
#7 DONE 0.1s
#8 [ 4/16] ADD target/jcl-over-slf4j.jar /opt/apache/beam/jars/
#8 DONE 0.1s
#9 [ 5/16] ADD target/log4j-over-slf4j.jar /opt/apache/beam/jars/
#9 DONE 0.1s
#10 [ 6/16] ADD target/log4j-to-slf4j.jar /opt/apache/beam/jars/
#10 DONE 0.1s
#11 [ 7/16] ADD target/beam-sdks-java-harness.jar /opt/apache/beam/jars/
#11 DONE 0.1s
#12 [ 8/16] COPY target/jamm.jar target/open-module-agent*.jar /opt/apache/beam/jars/
#12 DONE 0.1s
#13 [ 9/16] COPY target/linux_amd64/boot /opt/apache/beam/
#13 DONE 0.2s
#14 [10/16] COPY target/LICENSE /opt/apache/beam/
#14 DONE 0.1s
#15 [11/16] COPY target/NOTICE /opt/apache/beam/
#15 DONE 0.1s
#16 [12/16] ADD target/third_party_licenses /opt/apache/beam/third_party_licenses/
#16 DONE 0.2s
#17 [13/16] COPY target/LICENSE target/options/* /opt/apache/beam/options/
#17 DONE 0.1s
#18 [14/16] COPY target/go-licenses/* /opt/apache/beam/third_party_licenses/golang/
#18 DONE 0.0s
#19 [15/16] RUN if [ "true" = "false" ] ; then rm -rf /opt/apache/beam/third_party_licenses ; fi
#19 DONE 0.6s
#20 [16/16] COPY target/profiler/* /opt/google_cloud_profiler/
#20 DONE 0.1s
#21 exporting to image
#21 exporting layers
#21 exporting layers 0.3s done
#21 writing image sha256:38b33805376e8988855ab7095f542c5abb28abbe809de10de286b4de8a143a40 done
#21 naming to docker.io/apache/beam_java8_sdk:2.53.0.dev done
#21 DONE 0.3s
> Task :runners:spark:3:job-server:validatesPortableRunnerBatch
org.apache.beam.sdk.transforms.ParDoTest$TimerCoderInferenceTests > testValueStateCoderInferenceFromInputCoder FAILED
java.lang.RuntimeException at ParDoTest.java:6375
[shutdown-hook-0] INFO org.apache.spark.util.ShutdownHookManager - Shutdown hook called
[shutdown-hook-0] INFO org.apache.spark.util.ShutdownHookManager - Deleting directory /tmp/spark-547c3cb0-52a8-47ce-8bfb-fc64633dbbaa
> Task :runners:spark:3:job-server:validatesPortableRunnerBatch
org.apache.beam.sdk.transforms.ParDoTest$MultipleInputsAndOutputTests > testMultiOutputParDoWithSideInputsIsCumulative FAILED
java.lang.RuntimeException at ParDoTest.java:1289
[shutdown-hook-0] INFO org.apache.spark.util.ShutdownHookManager - Shutdown hook called
[shutdown-hook-0] INFO org.apache.spark.util.ShutdownHookManager - Deleting directory /tmp/spark-c52d7b7b-95a4-4b6b-9f46-690b02c8be6e
[shutdown-hook-0] INFO org.apache.spark.util.ShutdownHookManager - Shutdown hook called
[shutdown-hook-0] INFO org.apache.spark.util.ShutdownHookManager - Deleting directory /tmp/spark-f0658e1e-1334-4f45-ab54-507fb900402f
[shutdown-hook-0] INFO org.apache.spark.util.ShutdownHookManager - Shutdown hook called
[shutdown-hook-0] INFO org.apache.spark.util.ShutdownHookManager - Deleting directory /tmp/spark-ff770fb2-85ef-453a-b447-3852330ef140
> Task :runners:spark:3:job-server:validatesPortableRunnerBatch
233 tests completed, 2 failed, 1 skipped
> Task :runners:spark:3:job-server:validatesPortableRunnerBatch FAILED
> Task :runners:spark:3:job-server:validatesPortableRunnerDocker FROM-CACHE
FAILURE: Build failed with an exception.
* What went wrong:
Execution failed for task ':runners:spark:3:job-server:validatesPortableRunnerBatch'.
> There were failing tests. See the report at: file://<https://ci-beam.apache.org/job/beam_PostCommit_Java_PVR_Spark_Batch/ws/src/runners/spark/3/job-server/build/reports/tests/validatesPortableRunnerBatch/index.html>
Deprecated Gradle features were used in this build, making it incompatible with Gradle 9.0.
You can use '--warning-mode all' to show the individual deprecation warnings and determine if they come from your own scripts or plugins.
For more on this, please refer to https://docs.gradle.org/8.4/userguide/command_line_interface.html#sec:command_line_warnings in the Gradle documentation.
BUILD FAILED in 1h 35m 5s
121 actionable tasks: 78 executed, 41 from cache, 2 up-to-date
Publishing build scan...
https://ge.apache.org/s/wweajyjzk56da
Build step 'Invoke Gradle script' changed build result to FAILURE
Build step 'Invoke Gradle script' marked build as failure
---------------------------------------------------------------------
To unsubscribe, e-mail: builds-unsubscribe@beam.apache.org
For additional commands, e-mail: builds-help@beam.apache.org
Build failed in Jenkins: beam_PostCommit_Java_PVR_Spark_Batch #2795
Posted by Apache Jenkins Server <je...@builds.apache.org>.
See <https://ci-beam.apache.org/job/beam_PostCommit_Java_PVR_Spark_Batch/2795/display/redirect>
Changes:
------------------------------------------
[...truncated 43.83 KB...]
#6 [4/5] RUN go install github.com/google/go-licenses@latest
#6 CACHED
#7 [3/5] COPY go.mod ./
#7 CACHED
#8 [2/5] WORKDIR /usr/src/app
#8 CACHED
#9 [5/5] COPY get-licenses.sh /opt/apache/beam/
#9 CACHED
#10 exporting to image
#10 exporting layers done
#10 writing image sha256:e3d7f4659d6adda8dac0ddf917caef56c4e27f05d3f361955267db76c9ed8f50 done
#10 naming to docker.io/library/golicenses-java done
#10 DONE 0.0s
> Task :sdks:java:container:pullLicenses
Collecting pip
Using cached pip-23.3.1-py3-none-any.whl (2.1 MB)
Collecting setuptools
Using cached setuptools-69.0.2-py3-none-any.whl (819 kB)
Collecting wheel
Using cached wheel-0.42.0-py3-none-any.whl (65 kB)
Installing collected packages: pip, setuptools, wheel
Attempting uninstall: pip
Found existing installation: pip 20.0.2
Uninstalling pip-20.0.2:
Successfully uninstalled pip-20.0.2
Attempting uninstall: setuptools
Found existing installation: setuptools 44.0.0
Uninstalling setuptools-44.0.0:
Successfully uninstalled setuptools-44.0.0
Successfully installed pip-23.3.1 setuptools-69.0.2 wheel-0.42.0
Collecting beautifulsoup4<5.0,>=4.9.0 (from -r <https://ci-beam.apache.org/job/beam_PostCommit_Java_PVR_Spark_Batch/ws/src/sdks/java/container/license_scripts/requirement.txt> (line 19))
Using cached beautifulsoup4-4.12.2-py3-none-any.whl (142 kB)
Collecting pyyaml<7,>=6.0.1 (from -r <https://ci-beam.apache.org/job/beam_PostCommit_Java_PVR_Spark_Batch/ws/src/sdks/java/container/license_scripts/requirement.txt> (line 20))
Using cached PyYAML-6.0.1-cp38-cp38-manylinux_2_17_x86_64.manylinux2014_x86_64.whl.metadata (2.1 kB)
Collecting tenacity<9.0,>=6.1.0 (from -r <https://ci-beam.apache.org/job/beam_PostCommit_Java_PVR_Spark_Batch/ws/src/sdks/java/container/license_scripts/requirement.txt> (line 21))
Using cached tenacity-8.2.3-py3-none-any.whl.metadata (1.0 kB)
Collecting soupsieve>1.2 (from beautifulsoup4<5.0,>=4.9.0->-r <https://ci-beam.apache.org/job/beam_PostCommit_Java_PVR_Spark_Batch/ws/src/sdks/java/container/license_scripts/requirement.txt> (line 19))
Using cached soupsieve-2.5-py3-none-any.whl.metadata (4.7 kB)
Using cached PyYAML-6.0.1-cp38-cp38-manylinux_2_17_x86_64.manylinux2014_x86_64.whl (736 kB)
Using cached tenacity-8.2.3-py3-none-any.whl (24 kB)
Using cached soupsieve-2.5-py3-none-any.whl (36 kB)
Installing collected packages: tenacity, soupsieve, pyyaml, beautifulsoup4
Successfully installed beautifulsoup4-4.12.2 pyyaml-6.0.1 soupsieve-2.5 tenacity-8.2.3
Executing python <https://ci-beam.apache.org/job/beam_PostCommit_Java_PVR_Spark_Batch/ws/src/sdks/java/container/license_scripts/pull_licenses_java.py> --license_index=<https://ci-beam.apache.org/job/beam_PostCommit_Java_PVR_Spark_Batch/ws/src/sdks/java/container/build/reports/dependency-license/index.json> --output_dir=<https://ci-beam.apache.org/job/beam_PostCommit_Java_PVR_Spark_Batch/ws/src/sdks/java/container/build/target/java_third_party_licenses> --dep_url_yaml=<https://ci-beam.apache.org/job/beam_PostCommit_Java_PVR_Spark_Batch/ws/src/sdks/java/container/license_scripts/dep_urls_java.yaml> --manual_license_path=<https://ci-beam.apache.org/job/beam_PostCommit_Java_PVR_Spark_Batch/ws/src/sdks/java/container/license_scripts/manual_licenses>
INFO:root:Pulling license for 126 dependencies using 16 threads.
INFO:root:Replaced local file URL with file://<https://ci-beam.apache.org/job/beam_PostCommit_Java_PVR_Spark_Batch/ws/src/sdks/java/container/license_scripts/manual_licenses/xz/COPYING> for xz-1.5
INFO:root:pull_licenses_java.py succeed. It took 1.404992 seconds with 16 threads.
Copying licenses from <https://ci-beam.apache.org/job/beam_PostCommit_Java_PVR_Spark_Batch/ws/src/sdks/java/container/build/target/java_third_party_licenses> to <https://ci-beam.apache.org/job/beam_PostCommit_Java_PVR_Spark_Batch/ws/src/sdks/java/container/build/target/third_party_licenses.>
Finished license_scripts.sh
> Task :release:go-licenses:java:dockerRun
+ rm -rf '/output/*'
+ go get github.com/apache/beam/sdks/v2/java/container
go: downloading github.com/apache/beam/sdks/v2 v2.52.0
go: downloading github.com/apache/beam v2.52.0+incompatible
go: downloading github.com/golang/protobuf v1.5.3
go: downloading google.golang.org/grpc v1.59.0
go: downloading google.golang.org/protobuf v1.31.0
go: downloading golang.org/x/sys v0.13.0
go: downloading google.golang.org/genproto/googleapis/rpc v0.0.0-20231012201019-e917dd12ba7a
go: downloading golang.org/x/net v0.17.0
go: downloading google.golang.org/genproto v0.0.0-20231002182017-d307bd883b97
go: downloading golang.org/x/text v0.13.0
go: added github.com/apache/beam/sdks/v2 v2.52.0
go: added github.com/golang/protobuf v1.5.3
go: added golang.org/x/net v0.17.0
go: added golang.org/x/sys v0.13.0
go: added golang.org/x/text v0.13.0
go: added google.golang.org/genproto/googleapis/rpc v0.0.0-20231012201019-e917dd12ba7a
go: added google.golang.org/grpc v1.59.0
go: added google.golang.org/protobuf v1.31.0
+ go-licenses save github.com/apache/beam/sdks/v2/java/container --save_path=/output/licenses
> Task :sdks:java:container:java8:copyJavaThirdPartyLicenses
> Task :sdks:java:container:downloadCloudProfilerAgent
% Total % Received % Xferd Average Speed Time Time Time Current
Dload Upload Total Spent Left Speed
0 0 0 0 0 0 0 0 --:--:-- --:--:-- --:--:-- 0version.txt
NOTICES
profiler_java_agent.so
100 4183k 100 4183k 0 0 18.7M 0 --:--:-- --:--:-- --:--:-- 18.8M
> Task :sdks:java:container:goPrepare UP-TO-DATE
> Task :release:go-licenses:java:dockerRun
W1202 10:21:04.970523 37 library.go:101] "golang.org/x/sys/unix" contains non-Go code that can't be inspected for further dependencies:
/go/pkg/mod/golang.org/x/sys@v0.13.0/unix/asm_linux_amd64.s
> Task :sdks:java:container:goBuild
/home/jenkins/go/bin/go1.21.4 build -o ./build/target/linux_amd64/boot boot.go boot_test.go pathingjar.go pathingjar_test.go
> Task :sdks:java:container:java8:copySdkHarnessLauncher
> Task :release:go-licenses:java:dockerRun
+ go-licenses csv github.com/apache/beam/sdks/v2/java/container
+ tee /output/licenses/list.csv
W1202 10:21:12.499350 83 library.go:101] "golang.org/x/sys/unix" contains non-Go code that can't be inspected for further dependencies:
/go/pkg/mod/golang.org/x/sys@v0.13.0/unix/asm_linux_amd64.s
github.com/apache/beam/sdks/v2/go,https://github.com/apache/beam/blob/sdks/v2.52.0/sdks/go/README.md,Apache-2.0
github.com/apache/beam/sdks/v2/java/container,https://github.com/apache/beam/blob/sdks/v2.52.0/sdks/LICENSE,Apache-2.0
github.com/golang/protobuf,https://github.com/golang/protobuf/blob/v1.5.3/LICENSE,BSD-3-Clause
golang.org/x/net,https://cs.opensource.google/go/x/net/+/v0.17.0:LICENSE,BSD-3-Clause
golang.org/x/sys/unix,https://cs.opensource.google/go/x/sys/+/v0.13.0:LICENSE,BSD-3-Clause
golang.org/x/text,https://cs.opensource.google/go/x/text/+/v0.13.0:LICENSE,BSD-3-Clause
google.golang.org/genproto/googleapis/rpc/status,https://github.com/googleapis/go-genproto/blob/e917dd12ba7a/googleapis/rpc/LICENSE,Apache-2.0
google.golang.org/grpc,https://github.com/grpc/grpc-go/blob/v1.59.0/LICENSE,Apache-2.0
google.golang.org/protobuf,https://github.com/protocolbuffers/protobuf-go/blob/v1.31.0/LICENSE,BSD-3-Clause
+ chmod -R a+w /output/licenses
> Task :runners:spark:3:job-server:validatesPortableRunnerBatch
> Task :release:go-licenses:java:createLicenses
> Task :sdks:java:container:java8:copyGolangLicenses
> Task :sdks:java:container:java8:dockerPrepare
> Task :sdks:java:container:java8:docker
#1 [internal] load build definition from Dockerfile
#1 transferring dockerfile:
#1 transferring dockerfile: 2.59kB done
#1 DONE 0.0s
#2 [internal] load .dockerignore
#2 transferring context: 2B done
#2 DONE 0.0s
#3 [internal] load metadata for docker.io/library/eclipse-temurin:8
#3 DONE 0.4s
#4 [ 1/16] FROM docker.io/library/eclipse-temurin:8@sha256:fecbe1e760cfe07486c145ee49b16e59bb99bf41bce9aaf52bdd69d0ed406d27
#4 resolve docker.io/library/eclipse-temurin:8@sha256:fecbe1e760cfe07486c145ee49b16e59bb99bf41bce9aaf52bdd69d0ed406d27 0.0s done
#4 ...
#5 [internal] load build context
#5 transferring context: 47.30MB 0.6s done
#5 DONE 0.6s
#6 [ 2/16] ADD target/slf4j-api.jar /opt/apache/beam/jars/
#6 DONE 16.2s
#4 [ 1/16] FROM docker.io/library/eclipse-temurin:8@sha256:fecbe1e760cfe07486c145ee49b16e59bb99bf41bce9aaf52bdd69d0ed406d27
#4 ...
#7 [ 3/16] ADD target/slf4j-jdk14.jar /opt/apache/beam/jars/
#7 DONE 2.1s
#8 [ 4/16] ADD target/jcl-over-slf4j.jar /opt/apache/beam/jars/
#8 DONE 2.5s
#4 [ 1/16] FROM docker.io/library/eclipse-temurin:8@sha256:fecbe1e760cfe07486c145ee49b16e59bb99bf41bce9aaf52bdd69d0ed406d27
#4 ...
#9 [ 5/16] ADD target/log4j-over-slf4j.jar /opt/apache/beam/jars/
#9 DONE 1.8s
#10 [ 6/16] ADD target/log4j-to-slf4j.jar /opt/apache/beam/jars/
#10 DONE 1.5s
#11 [ 7/16] ADD target/beam-sdks-java-harness.jar /opt/apache/beam/jars/
#11 DONE 0.2s
#12 [ 8/16] COPY target/jamm.jar target/open-module-agent*.jar /opt/apache/beam/jars/
#12 DONE 0.1s
#13 [ 9/16] COPY target/linux_amd64/boot /opt/apache/beam/
#13 DONE 0.2s
#14 [10/16] COPY target/LICENSE /opt/apache/beam/
#14 DONE 0.1s
#4 [ 1/16] FROM docker.io/library/eclipse-temurin:8@sha256:fecbe1e760cfe07486c145ee49b16e59bb99bf41bce9aaf52bdd69d0ed406d27
#4 ...
#15 [11/16] COPY target/NOTICE /opt/apache/beam/
#15 DONE 0.1s
#16 [12/16] ADD target/third_party_licenses /opt/apache/beam/third_party_licenses/
#16 DONE 0.2s
#4 [ 1/16] FROM docker.io/library/eclipse-temurin:8@sha256:fecbe1e760cfe07486c145ee49b16e59bb99bf41bce9aaf52bdd69d0ed406d27
#4 ...
#17 [13/16] COPY target/LICENSE target/options/* /opt/apache/beam/options/
#17 DONE 0.1s
#18 [14/16] COPY target/go-licenses/* /opt/apache/beam/third_party_licenses/golang/
#18 DONE 0.1s
#19 [15/16] RUN if [ "true" = "false" ] ; then rm -rf /opt/apache/beam/third_party_licenses ; fi
#19 DONE 0.5s
#20 [16/16] COPY target/profiler/* /opt/google_cloud_profiler/
#20 DONE 0.1s
#21 exporting to image
#21 exporting layers
#21 exporting layers 0.4s done
#21 writing image sha256:f4e929896e4ebbd2da7be8e184899b683107cef40c011aee2e07c7ac7f699e02 done
#21 naming to docker.io/apache/beam_java8_sdk:2.53.0.dev done
#21 DONE 0.4s
#4 [ 1/16] FROM docker.io/library/eclipse-temurin:8@sha256:fecbe1e760cfe07486c145ee49b16e59bb99bf41bce9aaf52bdd69d0ed406d27
> Task :runners:spark:3:job-server:validatesPortableRunnerBatch
org.apache.beam.sdk.transforms.ParDoTest$MultipleInputsAndOutputTests > testParDoWithOnlyTaggedOutput FAILED
java.lang.RuntimeException at ParDoTest.java:818
[shutdown-hook-0] INFO org.apache.spark.util.ShutdownHookManager - Shutdown hook called
[shutdown-hook-0] INFO org.apache.spark.util.ShutdownHookManager - Deleting directory /tmp/spark-5660d65d-639b-4cf6-bfd3-a58a07da7d95
[shutdown-hook-0] INFO org.apache.spark.util.ShutdownHookManager - Shutdown hook called
[shutdown-hook-0] INFO org.apache.spark.util.ShutdownHookManager - Deleting directory /tmp/spark-d24f9870-c5de-490e-b60e-23a41c7fb319
[shutdown-hook-0] INFO org.apache.spark.util.ShutdownHookManager - Shutdown hook called
[shutdown-hook-0] INFO org.apache.spark.util.ShutdownHookManager - Deleting directory /tmp/spark-0575a247-34d6-4e74-a369-1bdc1c97892f
[shutdown-hook-0] INFO org.apache.spark.util.ShutdownHookManager - Shutdown hook called
[shutdown-hook-0] INFO org.apache.spark.util.ShutdownHookManager - Deleting directory /tmp/spark-b6ce2777-c88d-4e56-8254-14baf96203ec
> Task :runners:spark:3:job-server:validatesPortableRunnerBatch
233 tests completed, 1 failed, 1 skipped
> Task :runners:spark:3:job-server:validatesPortableRunnerBatch FAILED
> Task :runners:spark:3:job-server:validatesPortableRunnerDocker FROM-CACHE
FAILURE: Build failed with an exception.
* What went wrong:
Execution failed for task ':runners:spark:3:job-server:validatesPortableRunnerBatch'.
> There were failing tests. See the report at: file://<https://ci-beam.apache.org/job/beam_PostCommit_Java_PVR_Spark_Batch/ws/src/runners/spark/3/job-server/build/reports/tests/validatesPortableRunnerBatch/index.html>
Deprecated Gradle features were used in this build, making it incompatible with Gradle 9.0.
You can use '--warning-mode all' to show the individual deprecation warnings and determine if they come from your own scripts or plugins.
For more on this, please refer to https://docs.gradle.org/8.4/userguide/command_line_interface.html#sec:command_line_warnings in the Gradle documentation.
BUILD FAILED in 1h 36m 48s
121 actionable tasks: 78 executed, 41 from cache, 2 up-to-date
Publishing build scan...
https://ge.apache.org/s/4i2642izhbieu
Build step 'Invoke Gradle script' changed build result to FAILURE
Build step 'Invoke Gradle script' marked build as failure
---------------------------------------------------------------------
To unsubscribe, e-mail: builds-unsubscribe@beam.apache.org
For additional commands, e-mail: builds-help@beam.apache.org
Build failed in Jenkins: beam_PostCommit_Java_PVR_Spark_Batch #2794
Posted by Apache Jenkins Server <je...@builds.apache.org>.
See <https://ci-beam.apache.org/job/beam_PostCommit_Java_PVR_Spark_Batch/2794/display/redirect>
Changes:
------------------------------------------
[...truncated 43.84 KB...]
#6 [2/5] WORKDIR /usr/src/app
#6 CACHED
#7 [3/5] COPY go.mod ./
#7 CACHED
#8 [4/5] RUN go install github.com/google/go-licenses@latest
#8 CACHED
#9 [5/5] COPY get-licenses.sh /opt/apache/beam/
#9 CACHED
#10 exporting to image
#10 exporting layers done
#10 writing image sha256:4ac2c2da48ee24f11033f7676d48ead53c53133444d70361f90f16a65f013a3e done
#10 naming to docker.io/library/golicenses-java done
#10 DONE 0.0s
> Task :sdks:java:container:pullLicenses
Collecting setuptools
Using cached setuptools-69.0.2-py3-none-any.whl (819 kB)
Collecting wheel
Using cached wheel-0.42.0-py3-none-any.whl (65 kB)
Installing collected packages: pip, setuptools, wheel
Attempting uninstall: pip
Found existing installation: pip 20.0.2
Uninstalling pip-20.0.2:
Successfully uninstalled pip-20.0.2
Attempting uninstall: setuptools
Found existing installation: setuptools 44.0.0
Uninstalling setuptools-44.0.0:
Successfully uninstalled setuptools-44.0.0
Successfully installed pip-23.3.1 setuptools-69.0.2 wheel-0.42.0
Collecting beautifulsoup4<5.0,>=4.9.0 (from -r <https://ci-beam.apache.org/job/beam_PostCommit_Java_PVR_Spark_Batch/ws/src/sdks/java/container/license_scripts/requirement.txt> (line 19))
Using cached beautifulsoup4-4.12.2-py3-none-any.whl (142 kB)
Collecting pyyaml<7,>=6.0.1 (from -r <https://ci-beam.apache.org/job/beam_PostCommit_Java_PVR_Spark_Batch/ws/src/sdks/java/container/license_scripts/requirement.txt> (line 20))
Using cached PyYAML-6.0.1-cp38-cp38-manylinux_2_17_x86_64.manylinux2014_x86_64.whl.metadata (2.1 kB)
Collecting tenacity<9.0,>=6.1.0 (from -r <https://ci-beam.apache.org/job/beam_PostCommit_Java_PVR_Spark_Batch/ws/src/sdks/java/container/license_scripts/requirement.txt> (line 21))
Using cached tenacity-8.2.3-py3-none-any.whl.metadata (1.0 kB)
Collecting soupsieve>1.2 (from beautifulsoup4<5.0,>=4.9.0->-r <https://ci-beam.apache.org/job/beam_PostCommit_Java_PVR_Spark_Batch/ws/src/sdks/java/container/license_scripts/requirement.txt> (line 19))
Using cached soupsieve-2.5-py3-none-any.whl.metadata (4.7 kB)
Using cached PyYAML-6.0.1-cp38-cp38-manylinux_2_17_x86_64.manylinux2014_x86_64.whl (736 kB)
Using cached tenacity-8.2.3-py3-none-any.whl (24 kB)
Using cached soupsieve-2.5-py3-none-any.whl (36 kB)
Installing collected packages: tenacity, soupsieve, pyyaml, beautifulsoup4
Successfully installed beautifulsoup4-4.12.2 pyyaml-6.0.1 soupsieve-2.5 tenacity-8.2.3
Executing python <https://ci-beam.apache.org/job/beam_PostCommit_Java_PVR_Spark_Batch/ws/src/sdks/java/container/license_scripts/pull_licenses_java.py> --license_index=<https://ci-beam.apache.org/job/beam_PostCommit_Java_PVR_Spark_Batch/ws/src/sdks/java/container/build/reports/dependency-license/index.json> --output_dir=<https://ci-beam.apache.org/job/beam_PostCommit_Java_PVR_Spark_Batch/ws/src/sdks/java/container/build/target/java_third_party_licenses> --dep_url_yaml=<https://ci-beam.apache.org/job/beam_PostCommit_Java_PVR_Spark_Batch/ws/src/sdks/java/container/license_scripts/dep_urls_java.yaml> --manual_license_path=<https://ci-beam.apache.org/job/beam_PostCommit_Java_PVR_Spark_Batch/ws/src/sdks/java/container/license_scripts/manual_licenses>
INFO:root:Pulling license for 126 dependencies using 16 threads.
INFO:root:Replaced local file URL with file://<https://ci-beam.apache.org/job/beam_PostCommit_Java_PVR_Spark_Batch/ws/src/sdks/java/container/license_scripts/manual_licenses/xz/COPYING> for xz-1.5
INFO:root:pull_licenses_java.py succeed. It took 1.50119 seconds with 16 threads.
Copying licenses from <https://ci-beam.apache.org/job/beam_PostCommit_Java_PVR_Spark_Batch/ws/src/sdks/java/container/build/target/java_third_party_licenses> to <https://ci-beam.apache.org/job/beam_PostCommit_Java_PVR_Spark_Batch/ws/src/sdks/java/container/build/target/third_party_licenses.>
Finished license_scripts.sh
> Task :release:go-licenses:java:dockerRun
+ rm -rf '/output/*'
+ go get github.com/apache/beam/sdks/v2/java/container
go: downloading github.com/apache/beam/sdks/v2 v2.52.0
go: downloading github.com/apache/beam v2.52.0+incompatible
go: downloading github.com/golang/protobuf v1.5.3
go: downloading google.golang.org/grpc v1.59.0
go: downloading google.golang.org/protobuf v1.31.0
go: downloading golang.org/x/sys v0.13.0
go: downloading golang.org/x/net v0.17.0
go: downloading google.golang.org/genproto/googleapis/rpc v0.0.0-20231012201019-e917dd12ba7a
go: downloading google.golang.org/genproto v0.0.0-20231002182017-d307bd883b97
go: downloading golang.org/x/text v0.13.0
> Task :sdks:java:container:java8:copyJavaThirdPartyLicenses
> Task :sdks:java:container:downloadCloudProfilerAgent
% Total % Received % Xferd Average Speed Time Time Time Current
Dload Upload Total Spent Left Speed
0 0 0 0 0 0 0 0 --:--:-- --:--:-- --:--:-- 0version.txt
NOTICES
profiler_java_agent.so
100 4183k 100 4183k 0 0 16.7M 0 --:--:-- --:--:-- --:--:-- 16.7M
> Task :sdks:java:container:goPrepare UP-TO-DATE
> Task :release:go-licenses:java:dockerRun
go: added github.com/apache/beam/sdks/v2 v2.52.0
go: added github.com/golang/protobuf v1.5.3
go: added golang.org/x/net v0.17.0
go: added golang.org/x/sys v0.13.0
go: added golang.org/x/text v0.13.0
go: added google.golang.org/genproto/googleapis/rpc v0.0.0-20231012201019-e917dd12ba7a
go: added google.golang.org/grpc v1.59.0
go: added google.golang.org/protobuf v1.31.0
+ go-licenses save github.com/apache/beam/sdks/v2/java/container --save_path=/output/licenses
> Task :sdks:java:container:goBuild
/home/jenkins/go/bin/go1.21.4 build -o ./build/target/linux_amd64/boot boot.go boot_test.go pathingjar.go pathingjar_test.go
> Task :sdks:java:container:java8:copySdkHarnessLauncher
> Task :release:go-licenses:java:dockerRun
W1202 04:21:07.235418 37 library.go:101] "golang.org/x/sys/unix" contains non-Go code that can't be inspected for further dependencies:
/go/pkg/mod/golang.org/x/sys@v0.13.0/unix/asm_linux_amd64.s
+ go-licenses csv github.com/apache/beam/sdks/v2/java/container
+ tee /output/licenses/list.csv
W1202 04:21:14.669921 83 library.go:101] "golang.org/x/sys/unix" contains non-Go code that can't be inspected for further dependencies:
/go/pkg/mod/golang.org/x/sys@v0.13.0/unix/asm_linux_amd64.s
github.com/apache/beam/sdks/v2/go,https://github.com/apache/beam/blob/sdks/v2.52.0/sdks/go/README.md,Apache-2.0
github.com/apache/beam/sdks/v2/java/container,https://github.com/apache/beam/blob/sdks/v2.52.0/sdks/LICENSE,Apache-2.0
github.com/golang/protobuf,https://github.com/golang/protobuf/blob/v1.5.3/LICENSE,BSD-3-Clause
golang.org/x/net,https://cs.opensource.google/go/x/net/+/v0.17.0:LICENSE,BSD-3-Clause
golang.org/x/sys/unix,https://cs.opensource.google/go/x/sys/+/v0.13.0:LICENSE,BSD-3-Clause
golang.org/x/text,https://cs.opensource.google/go/x/text/+/v0.13.0:LICENSE,BSD-3-Clause
google.golang.org/genproto/googleapis/rpc/status,https://github.com/googleapis/go-genproto/blob/e917dd12ba7a/googleapis/rpc/LICENSE,Apache-2.0
google.golang.org/grpc,https://github.com/grpc/grpc-go/blob/v1.59.0/LICENSE,Apache-2.0
google.golang.org/protobuf,https://github.com/protocolbuffers/protobuf-go/blob/v1.31.0/LICENSE,BSD-3-Clause
+ chmod -R a+w /output/licenses
> Task :runners:spark:3:job-server:validatesPortableRunnerBatch
> Task :release:go-licenses:java:createLicenses
> Task :sdks:java:container:java8:copyGolangLicenses
> Task :sdks:java:container:java8:dockerPrepare
> Task :sdks:java:container:java8:docker
#1 [internal] load .dockerignore
#1 transferring context:
#1 transferring context: 2B done
#1 DONE 1.0s
#2 [internal] load build definition from Dockerfile
#2 transferring dockerfile: 2.59kB done
#2 DONE 1.0s
#3 [internal] load metadata for docker.io/library/eclipse-temurin:8
#3 DONE 2.0s
#4 [ 1/16] FROM docker.io/library/eclipse-temurin:8@sha256:e9c4ad21b6e0b79646ad349cd645e13be82f9c4fc3422cefe88bb3c41aeda989
#4 CACHED
#5 [internal] load build context
#5 transferring context: 47.30MB 0.6s done
#5 DONE 1.5s
#6 [ 2/16] ADD target/slf4j-api.jar /opt/apache/beam/jars/
#6 DONE 2.6s
#7 [ 3/16] ADD target/slf4j-jdk14.jar /opt/apache/beam/jars/
#7 DONE 0.0s
#8 [ 4/16] ADD target/jcl-over-slf4j.jar /opt/apache/beam/jars/
#8 DONE 0.1s
#9 [ 5/16] ADD target/log4j-over-slf4j.jar /opt/apache/beam/jars/
#9 DONE 0.0s
#10 [ 6/16] ADD target/log4j-to-slf4j.jar /opt/apache/beam/jars/
#10 DONE 0.0s
#11 [ 7/16] ADD target/beam-sdks-java-harness.jar /opt/apache/beam/jars/
#11 DONE 0.1s
#12 [ 8/16] COPY target/jamm.jar target/open-module-agent*.jar /opt/apache/beam/jars/
#12 DONE 0.1s
#13 [ 9/16] COPY target/linux_amd64/boot /opt/apache/beam/
#13 DONE 0.2s
#14 [10/16] COPY target/LICENSE /opt/apache/beam/
#14 DONE 0.0s
#15 [11/16] COPY target/NOTICE /opt/apache/beam/
#15 DONE 0.0s
#16 [12/16] ADD target/third_party_licenses /opt/apache/beam/third_party_licenses/
#16 DONE 0.2s
#17 [13/16] COPY target/LICENSE target/options/* /opt/apache/beam/options/
#17 DONE 0.1s
#18 [14/16] COPY target/go-licenses/* /opt/apache/beam/third_party_licenses/golang/
#18 DONE 0.0s
#19 [15/16] RUN if [ "true" = "false" ] ; then rm -rf /opt/apache/beam/third_party_licenses ; fi
#19 DONE 0.8s
#20 [16/16] COPY target/profiler/* /opt/google_cloud_profiler/
#20 DONE 0.1s
#21 exporting to image
#21 exporting layers
#21 exporting layers 0.3s done
#21 writing image sha256:f12f537090d2a1b4d5a7371b16be639175e90fa89bf6e386a06460bc82be6a9b done
#21 naming to docker.io/apache/beam_java8_sdk:2.53.0.dev done
#21 DONE 0.3s
> Task :runners:spark:3:job-server:validatesPortableRunnerBatch
org.apache.beam.sdk.transforms.ParDoTest$TimerCoderInferenceTests > testValueStateCoderInferenceFromInputCoder FAILED
java.lang.RuntimeException at ParDoTest.java:6375
org.apache.beam.sdk.transforms.ParDoTest$TimerCoderInferenceTests > testValueStateCoderInference FAILED
java.lang.RuntimeException at ParDoTest.java:6309
[shutdown-hook-0] INFO org.apache.spark.util.ShutdownHookManager - Shutdown hook called
[shutdown-hook-0] INFO org.apache.spark.util.ShutdownHookManager - Deleting directory /tmp/spark-c0fcfb99-24e4-4ea9-9abb-06b3c9a12617
> Task :runners:spark:3:job-server:validatesPortableRunnerBatch
org.apache.beam.sdk.transforms.ParDoTest$MultipleInputsAndOutputTests > testParDoWithTaggedOutput FAILED
java.lang.RuntimeException at ParDoTest.java:723
org.apache.beam.sdk.transforms.ParDoTest$MultipleInputsAndOutputTests > testSideInputAnnotation FAILED
java.lang.RuntimeException at ParDoTest.java:1076
org.apache.beam.sdk.transforms.ParDoTest$MultipleInputsAndOutputTests > testParDoWithEmptyTaggedOutput FAILED
java.lang.RuntimeException at ParDoTest.java:789
org.apache.beam.sdk.transforms.ParDoTest$StateTests > testCombiningStateParameterSuperclass FAILED
java.lang.RuntimeException at ParDoTest.java:3533
[shutdown-hook-0] INFO org.apache.spark.util.ShutdownHookManager - Shutdown hook called
[shutdown-hook-0] INFO org.apache.spark.util.ShutdownHookManager - Deleting directory /tmp/spark-8e6dc2b5-a1b8-4e78-af1f-4cad383ed8dd
[shutdown-hook-0] INFO org.apache.spark.util.ShutdownHookManager - Shutdown hook called
[shutdown-hook-0] INFO org.apache.spark.util.ShutdownHookManager - Deleting directory /tmp/spark-31d64713-7948-48b3-807c-dc4526fde2da
[shutdown-hook-0] INFO org.apache.spark.util.ShutdownHookManager - Shutdown hook called
[shutdown-hook-0] INFO org.apache.spark.util.ShutdownHookManager - Deleting directory /tmp/spark-c1dd7679-f239-4a0f-becc-0d7aaab4a7a2
> Task :runners:spark:3:job-server:validatesPortableRunnerBatch
233 tests completed, 6 failed, 1 skipped
> Task :runners:spark:3:job-server:validatesPortableRunnerBatch FAILED
> Task :runners:spark:3:job-server:validatesPortableRunnerDocker FROM-CACHE
FAILURE: Build failed with an exception.
* What went wrong:
Execution failed for task ':runners:spark:3:job-server:validatesPortableRunnerBatch'.
> There were failing tests. See the report at: file://<https://ci-beam.apache.org/job/beam_PostCommit_Java_PVR_Spark_Batch/ws/src/runners/spark/3/job-server/build/reports/tests/validatesPortableRunnerBatch/index.html>
Deprecated Gradle features were used in this build, making it incompatible with Gradle 9.0.
You can use '--warning-mode all' to show the individual deprecation warnings and determine if they come from your own scripts or plugins.
For more on this, please refer to https://docs.gradle.org/8.4/userguide/command_line_interface.html#sec:command_line_warnings in the Gradle documentation.
BUILD FAILED in 1h 34m 14s
121 actionable tasks: 78 executed, 41 from cache, 2 up-to-date
Publishing build scan...
https://ge.apache.org/s/7lh4bjcmorafy
Build step 'Invoke Gradle script' changed build result to FAILURE
Build step 'Invoke Gradle script' marked build as failure
---------------------------------------------------------------------
To unsubscribe, e-mail: builds-unsubscribe@beam.apache.org
For additional commands, e-mail: builds-help@beam.apache.org