You are viewing a plain text version of this content. The canonical link for it is here.
Posted to dev@hive.apache.org by Apache Hudson Server <hu...@hudson.zones.apache.org> on 2010/06/02 16:00:53 UTC

Build failed in Hudson: Hive-trunk-h0.18 #460

See <http://hudson.zones.apache.org/hudson/job/Hive-trunk-h0.18/460/>

------------------------------------------
Failed to access build log

hudson.util.IOException2: remote file operation failed: /home/hudson/hudson-slave/workspace/Hive-trunk-h0.18 at hudson.remoting.Channel@1db2ed:minerva.apache.org (Ubuntu)
	at hudson.FilePath.act(FilePath.java:743)
	at hudson.FilePath.act(FilePath.java:729)
	at hudson.FilePath.toURI(FilePath.java:784)
	at hudson.tasks.MailSender.createFailureMail(MailSender.java:259)
	at hudson.tasks.MailSender.getMail(MailSender.java:134)
	at hudson.tasks.MailSender.execute(MailSender.java:82)
	at hudson.tasks.Mailer.perform(Mailer.java:101)
	at hudson.tasks.BuildStepMonitor$1.perform(BuildStepMonitor.java:19)
	at hudson.model.AbstractBuild$AbstractRunner.perform(AbstractBuild.java:582)
	at hudson.model.AbstractBuild$AbstractRunner.performAllBuildStep(AbstractBuild.java:563)
	at hudson.model.AbstractBuild$AbstractRunner.performAllBuildStep(AbstractBuild.java:550)
	at hudson.model.Build$RunnerImpl.post2(Build.java:152)
	at hudson.model.AbstractBuild$AbstractRunner.post(AbstractBuild.java:528)
	at hudson.model.Run.run(Run.java:1266)
	at hudson.model.FreeStyleBuild.run(FreeStyleBuild.java:46)
	at hudson.model.ResourceController.execute(ResourceController.java:88)
	at hudson.model.Executor.run(Executor.java:122)
Caused by: java.io.IOException: Broken pipe
	at java.io.FileOutputStream.writeBytes(Native Method)
	at java.io.FileOutputStream.write(FileOutputStream.java:260)
	at java.io.BufferedOutputStream.flushBuffer(BufferedOutputStream.java:65)
	at java.io.BufferedOutputStream.write(BufferedOutputStream.java:109)
	at java.io.ObjectOutputStream$BlockDataOutputStream.drain(ObjectOutputStream.java:1838)
	at java.io.ObjectOutputStream$BlockDataOutputStream.writeByte(ObjectOutputStream.java:1876)
	at java.io.ObjectOutputStream.writeFatalException(ObjectOutputStream.java:1537)
	at java.io.ObjectOutputStream.writeObject(ObjectOutputStream.java:329)
	at hudson.remoting.Channel.send(Channel.java:417)
	at hudson.remoting.Request.call(Request.java:105)
	at hudson.remoting.Channel.call(Channel.java:551)
	at hudson.FilePath.act(FilePath.java:736)
	... 16 more


Hudson build is back to normal : Hive-trunk-h0.18 #463

Posted by Apache Hudson Server <hu...@hudson.zones.apache.org>.
See <http://hudson.zones.apache.org/hudson/job/Hive-trunk-h0.18/463/>



Build failed in Hudson: Hive-trunk-h0.18 #462

Posted by Apache Hudson Server <hu...@hudson.zones.apache.org>.
See <http://hudson.zones.apache.org/hudson/job/Hive-trunk-h0.18/462/changes>

Changes:

[nzhang] HIVE-1388. combinehiveinputformat does not work if files are of different types (Namit Jain via Ning Zhang)

[namit] HIVE-1348. Move inputFileChanged() from ExecMapper to where it is needed
(Ning Zhang via namit)

[nzhang] HIVE-1228. allow HBase key column to be anywhere in Hive table (John Sichi via Ning Zhang)

[jvs] HIVE-1372. New algorithm for variance() UDAF
(Mayank Lahiri via jvs)

------------------------------------------
[...truncated 14065 lines...]
    [junit] OK
    [junit] Loading data to table srcbucket2
    [junit] POSTHOOK: Output: default@srcbucket2
    [junit] OK
    [junit] Loading data to table srcbucket2
    [junit] POSTHOOK: Output: default@srcbucket2
    [junit] OK
    [junit] Loading data to table src
    [junit] POSTHOOK: Output: default@src
    [junit] OK
    [junit] Loading data to table src1
    [junit] POSTHOOK: Output: default@src1
    [junit] OK
    [junit] Loading data to table src_sequencefile
    [junit] POSTHOOK: Output: default@src_sequencefile
    [junit] OK
    [junit] Loading data to table src_thrift
    [junit] POSTHOOK: Output: default@src_thrift
    [junit] OK
    [junit] Loading data to table src_json
    [junit] POSTHOOK: Output: default@src_json
    [junit] OK
    [junit] diff <http://hudson.zones.apache.org/hudson/job/Hive-trunk-h0.18/ws/hive/build/ql/test/logs/negative/unknown_function4.q.out> <http://hudson.zones.apache.org/hudson/job/Hive-trunk-h0.18/ws/hive/ql/src/test/results/compiler/errors/unknown_function4.q.out>
    [junit] Done query: unknown_function4.q
    [junit] Begin query: unknown_table1.q
    [junit] Loading data to table srcpart partition (ds=2008-04-08, hr=11)
    [junit] POSTHOOK: Output: default@srcpart@ds=2008-04-08/hr=11
    [junit] OK
    [junit] Loading data to table srcpart partition (ds=2008-04-08, hr=12)
    [junit] POSTHOOK: Output: default@srcpart@ds=2008-04-08/hr=12
    [junit] OK
    [junit] Loading data to table srcpart partition (ds=2008-04-09, hr=11)
    [junit] POSTHOOK: Output: default@srcpart@ds=2008-04-09/hr=11
    [junit] OK
    [junit] Loading data to table srcpart partition (ds=2008-04-09, hr=12)
    [junit] POSTHOOK: Output: default@srcpart@ds=2008-04-09/hr=12
    [junit] OK
    [junit] POSTHOOK: Output: default@srcbucket
    [junit] OK
    [junit] Loading data to table srcbucket
    [junit] POSTHOOK: Output: default@srcbucket
    [junit] OK
    [junit] Loading data to table srcbucket
    [junit] POSTHOOK: Output: default@srcbucket
    [junit] OK
    [junit] POSTHOOK: Output: default@srcbucket2
    [junit] OK
    [junit] Loading data to table srcbucket2
    [junit] POSTHOOK: Output: default@srcbucket2
    [junit] OK
    [junit] Loading data to table srcbucket2
    [junit] POSTHOOK: Output: default@srcbucket2
    [junit] OK
    [junit] Loading data to table srcbucket2
    [junit] POSTHOOK: Output: default@srcbucket2
    [junit] OK
    [junit] Loading data to table srcbucket2
    [junit] POSTHOOK: Output: default@srcbucket2
    [junit] OK
    [junit] Loading data to table src
    [junit] POSTHOOK: Output: default@src
    [junit] OK
    [junit] Loading data to table src1
    [junit] POSTHOOK: Output: default@src1
    [junit] OK
    [junit] Loading data to table src_sequencefile
    [junit] POSTHOOK: Output: default@src_sequencefile
    [junit] OK
    [junit] Loading data to table src_thrift
    [junit] POSTHOOK: Output: default@src_thrift
    [junit] OK
    [junit] Loading data to table src_json
    [junit] POSTHOOK: Output: default@src_json
    [junit] OK
    [junit] diff <http://hudson.zones.apache.org/hudson/job/Hive-trunk-h0.18/ws/hive/build/ql/test/logs/negative/unknown_table1.q.out> <http://hudson.zones.apache.org/hudson/job/Hive-trunk-h0.18/ws/hive/ql/src/test/results/compiler/errors/unknown_table1.q.out>
    [junit] Done query: unknown_table1.q
    [junit] Begin query: unknown_table2.q
    [junit] Loading data to table srcpart partition (ds=2008-04-08, hr=11)
    [junit] POSTHOOK: Output: default@srcpart@ds=2008-04-08/hr=11
    [junit] OK
    [junit] Loading data to table srcpart partition (ds=2008-04-08, hr=12)
    [junit] POSTHOOK: Output: default@srcpart@ds=2008-04-08/hr=12
    [junit] OK
    [junit] Loading data to table srcpart partition (ds=2008-04-09, hr=11)
    [junit] POSTHOOK: Output: default@srcpart@ds=2008-04-09/hr=11
    [junit] OK
    [junit] Loading data to table srcpart partition (ds=2008-04-09, hr=12)
    [junit] POSTHOOK: Output: default@srcpart@ds=2008-04-09/hr=12
    [junit] OK
    [junit] POSTHOOK: Output: default@srcbucket
    [junit] OK
    [junit] Loading data to table srcbucket
    [junit] POSTHOOK: Output: default@srcbucket
    [junit] OK
    [junit] Loading data to table srcbucket
    [junit] POSTHOOK: Output: default@srcbucket
    [junit] OK
    [junit] POSTHOOK: Output: default@srcbucket2
    [junit] OK
    [junit] Loading data to table srcbucket2
    [junit] POSTHOOK: Output: default@srcbucket2
    [junit] OK
    [junit] Loading data to table srcbucket2
    [junit] POSTHOOK: Output: default@srcbucket2
    [junit] OK
    [junit] Loading data to table srcbucket2
    [junit] POSTHOOK: Output: default@srcbucket2
    [junit] OK
    [junit] Loading data to table srcbucket2
    [junit] POSTHOOK: Output: default@srcbucket2
    [junit] OK
    [junit] Loading data to table src
    [junit] POSTHOOK: Output: default@src
    [junit] OK
    [junit] Loading data to table src1
    [junit] POSTHOOK: Output: default@src1
    [junit] OK
    [junit] Loading data to table src_sequencefile
    [junit] POSTHOOK: Output: default@src_sequencefile
    [junit] OK
    [junit] Loading data to table src_thrift
    [junit] POSTHOOK: Output: default@src_thrift
    [junit] OK
    [junit] Loading data to table src_json
    [junit] POSTHOOK: Output: default@src_json
    [junit] OK
    [junit] diff <http://hudson.zones.apache.org/hudson/job/Hive-trunk-h0.18/ws/hive/build/ql/test/logs/negative/unknown_table2.q.out> <http://hudson.zones.apache.org/hudson/job/Hive-trunk-h0.18/ws/hive/ql/src/test/results/compiler/errors/unknown_table2.q.out>
    [junit] Done query: unknown_table2.q
    [junit] Begin query: wrong_distinct1.q
    [junit] Loading data to table srcpart partition (ds=2008-04-08, hr=11)
    [junit] POSTHOOK: Output: default@srcpart@ds=2008-04-08/hr=11
    [junit] OK
    [junit] Loading data to table srcpart partition (ds=2008-04-08, hr=12)
    [junit] POSTHOOK: Output: default@srcpart@ds=2008-04-08/hr=12
    [junit] OK
    [junit] Loading data to table srcpart partition (ds=2008-04-09, hr=11)
    [junit] POSTHOOK: Output: default@srcpart@ds=2008-04-09/hr=11
    [junit] OK
    [junit] Loading data to table srcpart partition (ds=2008-04-09, hr=12)
    [junit] POSTHOOK: Output: default@srcpart@ds=2008-04-09/hr=12
    [junit] OK
    [junit] POSTHOOK: Output: default@srcbucket
    [junit] OK
    [junit] Loading data to table srcbucket
    [junit] POSTHOOK: Output: default@srcbucket
    [junit] OK
    [junit] Loading data to table srcbucket
    [junit] POSTHOOK: Output: default@srcbucket
    [junit] OK
    [junit] POSTHOOK: Output: default@srcbucket2
    [junit] OK
    [junit] Loading data to table srcbucket2
    [junit] POSTHOOK: Output: default@srcbucket2
    [junit] OK
    [junit] Loading data to table srcbucket2
    [junit] POSTHOOK: Output: default@srcbucket2
    [junit] OK
    [junit] Loading data to table srcbucket2
    [junit] POSTHOOK: Output: default@srcbucket2
    [junit] OK
    [junit] Loading data to table srcbucket2
    [junit] POSTHOOK: Output: default@srcbucket2
    [junit] OK
    [junit] Loading data to table src
    [junit] POSTHOOK: Output: default@src
    [junit] OK
    [junit] Loading data to table src1
    [junit] POSTHOOK: Output: default@src1
    [junit] OK
    [junit] Loading data to table src_sequencefile
    [junit] POSTHOOK: Output: default@src_sequencefile
    [junit] OK
    [junit] Loading data to table src_thrift
    [junit] POSTHOOK: Output: default@src_thrift
    [junit] OK
    [junit] Loading data to table src_json
    [junit] POSTHOOK: Output: default@src_json
    [junit] OK
    [junit] diff <http://hudson.zones.apache.org/hudson/job/Hive-trunk-h0.18/ws/hive/build/ql/test/logs/negative/wrong_distinct1.q.out> <http://hudson.zones.apache.org/hudson/job/Hive-trunk-h0.18/ws/hive/ql/src/test/results/compiler/errors/wrong_distinct1.q.out>
    [junit] Done query: wrong_distinct1.q
    [junit] Begin query: wrong_distinct2.q
    [junit] Loading data to table srcpart partition (ds=2008-04-08, hr=11)
    [junit] POSTHOOK: Output: default@srcpart@ds=2008-04-08/hr=11
    [junit] OK
    [junit] Loading data to table srcpart partition (ds=2008-04-08, hr=12)
    [junit] POSTHOOK: Output: default@srcpart@ds=2008-04-08/hr=12
    [junit] OK
    [junit] Loading data to table srcpart partition (ds=2008-04-09, hr=11)
    [junit] POSTHOOK: Output: default@srcpart@ds=2008-04-09/hr=11
    [junit] OK
    [junit] Loading data to table srcpart partition (ds=2008-04-09, hr=12)
    [junit] POSTHOOK: Output: default@srcpart@ds=2008-04-09/hr=12
    [junit] OK
    [junit] POSTHOOK: Output: default@srcbucket
    [junit] OK
    [junit] Loading data to table srcbucket
    [junit] POSTHOOK: Output: default@srcbucket
    [junit] OK
    [junit] Loading data to table srcbucket
    [junit] POSTHOOK: Output: default@srcbucket
    [junit] OK
    [junit] POSTHOOK: Output: default@srcbucket2
    [junit] OK
    [junit] Loading data to table srcbucket2
    [junit] POSTHOOK: Output: default@srcbucket2
    [junit] OK
    [junit] Loading data to table srcbucket2
    [junit] POSTHOOK: Output: default@srcbucket2
    [junit] OK
    [junit] Loading data to table srcbucket2
    [junit] POSTHOOK: Output: default@srcbucket2
    [junit] OK
    [junit] Loading data to table srcbucket2
    [junit] POSTHOOK: Output: default@srcbucket2
    [junit] OK
    [junit] Loading data to table src
    [junit] POSTHOOK: Output: default@src
    [junit] OK
    [junit] Loading data to table src1
    [junit] POSTHOOK: Output: default@src1
    [junit] OK
    [junit] Loading data to table src_sequencefile
    [junit] POSTHOOK: Output: default@src_sequencefile
    [junit] OK
    [junit] Loading data to table src_thrift
    [junit] POSTHOOK: Output: default@src_thrift
    [junit] OK
    [junit] Loading data to table src_json
    [junit] POSTHOOK: Output: default@src_json
    [junit] OK
    [junit] diff <http://hudson.zones.apache.org/hudson/job/Hive-trunk-h0.18/ws/hive/build/ql/test/logs/negative/wrong_distinct2.q.out> <http://hudson.zones.apache.org/hudson/job/Hive-trunk-h0.18/ws/hive/ql/src/test/results/compiler/errors/wrong_distinct2.q.out>
    [junit] Done query: wrong_distinct2.q
    [junit] Tests run: 31, Failures: 0, Errors: 0, Time elapsed: 63.569 sec
    [junit] Running org.apache.hadoop.hive.ql.tool.TestLineageInfo
    [junit] Tests run: 5, Failures: 0, Errors: 0, Time elapsed: 0.341 sec
    [junit] Running org.apache.hadoop.hive.ql.udf.TestUDFDateAdd
    [junit] Tests run: 2, Failures: 0, Errors: 0, Time elapsed: 0.186 sec
    [junit] Running org.apache.hadoop.hive.ql.udf.TestUDFDateDiff
    [junit] Tests run: 1, Failures: 0, Errors: 0, Time elapsed: 0.231 sec
    [junit] Running org.apache.hadoop.hive.ql.udf.TestUDFDateSub
    [junit] Tests run: 2, Failures: 0, Errors: 0, Time elapsed: 0.151 sec

BUILD FAILED
<http://hudson.zones.apache.org/hudson/job/Hive-trunk-h0.18/ws/hive/build.xml>:166: The following error occurred while executing this line:
<http://hudson.zones.apache.org/hudson/job/Hive-trunk-h0.18/ws/hive/build.xml>:103: The following error occurred while executing this line:
<http://hudson.zones.apache.org/hudson/job/Hive-trunk-h0.18/ws/hive/build-common.xml>:429: Tests failed!

Total time: 103 minutes 47 seconds
Recording test results


Build failed in Hudson: Hive-trunk-h0.18 #461

Posted by Apache Hudson Server <hu...@hudson.zones.apache.org>.
See <http://hudson.zones.apache.org/hudson/job/Hive-trunk-h0.18/461/>

------------------------------------------
[...truncated 14027 lines...]
    [junit] OK
    [junit] Loading data to table srcbucket2
    [junit] POSTHOOK: Output: default@srcbucket2
    [junit] OK
    [junit] Loading data to table srcbucket2
    [junit] POSTHOOK: Output: default@srcbucket2
    [junit] OK
    [junit] Loading data to table src
    [junit] POSTHOOK: Output: default@src
    [junit] OK
    [junit] Loading data to table src1
    [junit] POSTHOOK: Output: default@src1
    [junit] OK
    [junit] Loading data to table src_sequencefile
    [junit] POSTHOOK: Output: default@src_sequencefile
    [junit] OK
    [junit] Loading data to table src_thrift
    [junit] POSTHOOK: Output: default@src_thrift
    [junit] OK
    [junit] Loading data to table src_json
    [junit] POSTHOOK: Output: default@src_json
    [junit] OK
    [junit] diff <http://hudson.zones.apache.org/hudson/job/Hive-trunk-h0.18/ws/hive/build/ql/test/logs/negative/unknown_function4.q.out> <http://hudson.zones.apache.org/hudson/job/Hive-trunk-h0.18/ws/hive/ql/src/test/results/compiler/errors/unknown_function4.q.out>
    [junit] Done query: unknown_function4.q
    [junit] Begin query: unknown_table1.q
    [junit] Loading data to table srcpart partition (ds=2008-04-08, hr=11)
    [junit] POSTHOOK: Output: default@srcpart@ds=2008-04-08/hr=11
    [junit] OK
    [junit] Loading data to table srcpart partition (ds=2008-04-08, hr=12)
    [junit] POSTHOOK: Output: default@srcpart@ds=2008-04-08/hr=12
    [junit] OK
    [junit] Loading data to table srcpart partition (ds=2008-04-09, hr=11)
    [junit] POSTHOOK: Output: default@srcpart@ds=2008-04-09/hr=11
    [junit] OK
    [junit] Loading data to table srcpart partition (ds=2008-04-09, hr=12)
    [junit] POSTHOOK: Output: default@srcpart@ds=2008-04-09/hr=12
    [junit] OK
    [junit] POSTHOOK: Output: default@srcbucket
    [junit] OK
    [junit] Loading data to table srcbucket
    [junit] POSTHOOK: Output: default@srcbucket
    [junit] OK
    [junit] Loading data to table srcbucket
    [junit] POSTHOOK: Output: default@srcbucket
    [junit] OK
    [junit] POSTHOOK: Output: default@srcbucket2
    [junit] OK
    [junit] Loading data to table srcbucket2
    [junit] POSTHOOK: Output: default@srcbucket2
    [junit] OK
    [junit] Loading data to table srcbucket2
    [junit] POSTHOOK: Output: default@srcbucket2
    [junit] OK
    [junit] Loading data to table srcbucket2
    [junit] POSTHOOK: Output: default@srcbucket2
    [junit] OK
    [junit] Loading data to table srcbucket2
    [junit] POSTHOOK: Output: default@srcbucket2
    [junit] OK
    [junit] Loading data to table src
    [junit] POSTHOOK: Output: default@src
    [junit] OK
    [junit] Loading data to table src1
    [junit] POSTHOOK: Output: default@src1
    [junit] OK
    [junit] Loading data to table src_sequencefile
    [junit] POSTHOOK: Output: default@src_sequencefile
    [junit] OK
    [junit] Loading data to table src_thrift
    [junit] POSTHOOK: Output: default@src_thrift
    [junit] OK
    [junit] Loading data to table src_json
    [junit] POSTHOOK: Output: default@src_json
    [junit] OK
    [junit] diff <http://hudson.zones.apache.org/hudson/job/Hive-trunk-h0.18/ws/hive/build/ql/test/logs/negative/unknown_table1.q.out> <http://hudson.zones.apache.org/hudson/job/Hive-trunk-h0.18/ws/hive/ql/src/test/results/compiler/errors/unknown_table1.q.out>
    [junit] Done query: unknown_table1.q
    [junit] Begin query: unknown_table2.q
    [junit] Loading data to table srcpart partition (ds=2008-04-08, hr=11)
    [junit] POSTHOOK: Output: default@srcpart@ds=2008-04-08/hr=11
    [junit] OK
    [junit] Loading data to table srcpart partition (ds=2008-04-08, hr=12)
    [junit] POSTHOOK: Output: default@srcpart@ds=2008-04-08/hr=12
    [junit] OK
    [junit] Loading data to table srcpart partition (ds=2008-04-09, hr=11)
    [junit] POSTHOOK: Output: default@srcpart@ds=2008-04-09/hr=11
    [junit] OK
    [junit] Loading data to table srcpart partition (ds=2008-04-09, hr=12)
    [junit] POSTHOOK: Output: default@srcpart@ds=2008-04-09/hr=12
    [junit] OK
    [junit] POSTHOOK: Output: default@srcbucket
    [junit] OK
    [junit] Loading data to table srcbucket
    [junit] POSTHOOK: Output: default@srcbucket
    [junit] OK
    [junit] Loading data to table srcbucket
    [junit] POSTHOOK: Output: default@srcbucket
    [junit] OK
    [junit] POSTHOOK: Output: default@srcbucket2
    [junit] OK
    [junit] Loading data to table srcbucket2
    [junit] POSTHOOK: Output: default@srcbucket2
    [junit] OK
    [junit] Loading data to table srcbucket2
    [junit] POSTHOOK: Output: default@srcbucket2
    [junit] OK
    [junit] Loading data to table srcbucket2
    [junit] POSTHOOK: Output: default@srcbucket2
    [junit] OK
    [junit] Loading data to table srcbucket2
    [junit] POSTHOOK: Output: default@srcbucket2
    [junit] OK
    [junit] Loading data to table src
    [junit] POSTHOOK: Output: default@src
    [junit] OK
    [junit] Loading data to table src1
    [junit] POSTHOOK: Output: default@src1
    [junit] OK
    [junit] Loading data to table src_sequencefile
    [junit] POSTHOOK: Output: default@src_sequencefile
    [junit] OK
    [junit] Loading data to table src_thrift
    [junit] POSTHOOK: Output: default@src_thrift
    [junit] OK
    [junit] Loading data to table src_json
    [junit] POSTHOOK: Output: default@src_json
    [junit] OK
    [junit] diff <http://hudson.zones.apache.org/hudson/job/Hive-trunk-h0.18/ws/hive/build/ql/test/logs/negative/unknown_table2.q.out> <http://hudson.zones.apache.org/hudson/job/Hive-trunk-h0.18/ws/hive/ql/src/test/results/compiler/errors/unknown_table2.q.out>
    [junit] Done query: unknown_table2.q
    [junit] Begin query: wrong_distinct1.q
    [junit] Loading data to table srcpart partition (ds=2008-04-08, hr=11)
    [junit] POSTHOOK: Output: default@srcpart@ds=2008-04-08/hr=11
    [junit] OK
    [junit] Loading data to table srcpart partition (ds=2008-04-08, hr=12)
    [junit] POSTHOOK: Output: default@srcpart@ds=2008-04-08/hr=12
    [junit] OK
    [junit] Loading data to table srcpart partition (ds=2008-04-09, hr=11)
    [junit] POSTHOOK: Output: default@srcpart@ds=2008-04-09/hr=11
    [junit] OK
    [junit] Loading data to table srcpart partition (ds=2008-04-09, hr=12)
    [junit] POSTHOOK: Output: default@srcpart@ds=2008-04-09/hr=12
    [junit] OK
    [junit] POSTHOOK: Output: default@srcbucket
    [junit] OK
    [junit] Loading data to table srcbucket
    [junit] POSTHOOK: Output: default@srcbucket
    [junit] OK
    [junit] Loading data to table srcbucket
    [junit] POSTHOOK: Output: default@srcbucket
    [junit] OK
    [junit] POSTHOOK: Output: default@srcbucket2
    [junit] OK
    [junit] Loading data to table srcbucket2
    [junit] POSTHOOK: Output: default@srcbucket2
    [junit] OK
    [junit] Loading data to table srcbucket2
    [junit] POSTHOOK: Output: default@srcbucket2
    [junit] OK
    [junit] Loading data to table srcbucket2
    [junit] POSTHOOK: Output: default@srcbucket2
    [junit] OK
    [junit] Loading data to table srcbucket2
    [junit] POSTHOOK: Output: default@srcbucket2
    [junit] OK
    [junit] Loading data to table src
    [junit] POSTHOOK: Output: default@src
    [junit] OK
    [junit] Loading data to table src1
    [junit] POSTHOOK: Output: default@src1
    [junit] OK
    [junit] Loading data to table src_sequencefile
    [junit] POSTHOOK: Output: default@src_sequencefile
    [junit] OK
    [junit] Loading data to table src_thrift
    [junit] POSTHOOK: Output: default@src_thrift
    [junit] OK
    [junit] Loading data to table src_json
    [junit] POSTHOOK: Output: default@src_json
    [junit] OK
    [junit] diff <http://hudson.zones.apache.org/hudson/job/Hive-trunk-h0.18/ws/hive/build/ql/test/logs/negative/wrong_distinct1.q.out> <http://hudson.zones.apache.org/hudson/job/Hive-trunk-h0.18/ws/hive/ql/src/test/results/compiler/errors/wrong_distinct1.q.out>
    [junit] Done query: wrong_distinct1.q
    [junit] Begin query: wrong_distinct2.q
    [junit] Loading data to table srcpart partition (ds=2008-04-08, hr=11)
    [junit] POSTHOOK: Output: default@srcpart@ds=2008-04-08/hr=11
    [junit] OK
    [junit] Loading data to table srcpart partition (ds=2008-04-08, hr=12)
    [junit] POSTHOOK: Output: default@srcpart@ds=2008-04-08/hr=12
    [junit] OK
    [junit] Loading data to table srcpart partition (ds=2008-04-09, hr=11)
    [junit] POSTHOOK: Output: default@srcpart@ds=2008-04-09/hr=11
    [junit] OK
    [junit] Loading data to table srcpart partition (ds=2008-04-09, hr=12)
    [junit] POSTHOOK: Output: default@srcpart@ds=2008-04-09/hr=12
    [junit] OK
    [junit] POSTHOOK: Output: default@srcbucket
    [junit] OK
    [junit] Loading data to table srcbucket
    [junit] POSTHOOK: Output: default@srcbucket
    [junit] OK
    [junit] Loading data to table srcbucket
    [junit] POSTHOOK: Output: default@srcbucket
    [junit] OK
    [junit] POSTHOOK: Output: default@srcbucket2
    [junit] OK
    [junit] Loading data to table srcbucket2
    [junit] POSTHOOK: Output: default@srcbucket2
    [junit] OK
    [junit] Loading data to table srcbucket2
    [junit] POSTHOOK: Output: default@srcbucket2
    [junit] OK
    [junit] Loading data to table srcbucket2
    [junit] POSTHOOK: Output: default@srcbucket2
    [junit] OK
    [junit] Loading data to table srcbucket2
    [junit] POSTHOOK: Output: default@srcbucket2
    [junit] OK
    [junit] Loading data to table src
    [junit] POSTHOOK: Output: default@src
    [junit] OK
    [junit] Loading data to table src1
    [junit] POSTHOOK: Output: default@src1
    [junit] OK
    [junit] Loading data to table src_sequencefile
    [junit] POSTHOOK: Output: default@src_sequencefile
    [junit] OK
    [junit] Loading data to table src_thrift
    [junit] POSTHOOK: Output: default@src_thrift
    [junit] OK
    [junit] Loading data to table src_json
    [junit] POSTHOOK: Output: default@src_json
    [junit] OK
    [junit] diff <http://hudson.zones.apache.org/hudson/job/Hive-trunk-h0.18/ws/hive/build/ql/test/logs/negative/wrong_distinct2.q.out> <http://hudson.zones.apache.org/hudson/job/Hive-trunk-h0.18/ws/hive/ql/src/test/results/compiler/errors/wrong_distinct2.q.out>
    [junit] Done query: wrong_distinct2.q
    [junit] Tests run: 31, Failures: 0, Errors: 0, Time elapsed: 67.766 sec
    [junit] Running org.apache.hadoop.hive.ql.tool.TestLineageInfo
    [junit] Tests run: 5, Failures: 0, Errors: 0, Time elapsed: 0.483 sec
    [junit] Running org.apache.hadoop.hive.ql.udf.TestUDFDateAdd
    [junit] Tests run: 2, Failures: 0, Errors: 0, Time elapsed: 0.248 sec
    [junit] Running org.apache.hadoop.hive.ql.udf.TestUDFDateDiff
    [junit] Tests run: 1, Failures: 0, Errors: 0, Time elapsed: 0.221 sec
    [junit] Running org.apache.hadoop.hive.ql.udf.TestUDFDateSub
    [junit] Tests run: 2, Failures: 0, Errors: 0, Time elapsed: 0.252 sec

BUILD FAILED
<http://hudson.zones.apache.org/hudson/job/Hive-trunk-h0.18/ws/hive/build.xml>:166: The following error occurred while executing this line:
<http://hudson.zones.apache.org/hudson/job/Hive-trunk-h0.18/ws/hive/build.xml>:103: The following error occurred while executing this line:
<http://hudson.zones.apache.org/hudson/job/Hive-trunk-h0.18/ws/hive/build-common.xml>:429: Tests failed!

Total time: 109 minutes 59 seconds
Recording test results