You are viewing a plain text version of this content. The canonical link for it is here.
Posted to builds@beam.apache.org by Apache Jenkins Server <je...@builds.apache.org> on 2023/07/07 11:34:08 UTC

Build failed in Jenkins: beam_PostCommit_Python310 #1044

See <https://ci-beam.apache.org/job/beam_PostCommit_Python310/1044/display/redirect>

Changes:


------------------------------------------
[...truncated 12.98 MB...]
  Implementing implicit namespace packages (as specified in PEP 420) is preferred to `pkg_resources.declare_namespace`. See https://setuptools.pypa.io/en/latest/references/keywords.html#keyword-namespace-packages
    declare_namespace(pkg)

../../build/gradleenv/2050596098/lib/python3.10/site-packages/google/rpc/__init__.py:20
../../build/gradleenv/2050596098/lib/python3.10/site-packages/google/rpc/__init__.py:20
../../build/gradleenv/2050596098/lib/python3.10/site-packages/google/rpc/__init__.py:20
../../build/gradleenv/2050596098/lib/python3.10/site-packages/google/rpc/__init__.py:20
../../build/gradleenv/2050596098/lib/python3.10/site-packages/google/rpc/__init__.py:20
../../build/gradleenv/2050596098/lib/python3.10/site-packages/google/rpc/__init__.py:20
../../build/gradleenv/2050596098/lib/python3.10/site-packages/google/rpc/__init__.py:20
../../build/gradleenv/2050596098/lib/python3.10/site-packages/google/rpc/__init__.py:20
../../build/gradleenv/2050596098/lib/python3.10/site-packages/google/rpc/__init__.py:20
  <https://ci-beam.apache.org/job/beam_PostCommit_Python310/ws/src/build/gradleenv/2050596098/lib/python3.10/site-packages/google/rpc/__init__.py>:20: DeprecationWarning: Deprecated call to `pkg_resources.declare_namespace('google.rpc')`.
  Implementing implicit namespace packages (as specified in PEP 420) is preferred to `pkg_resources.declare_namespace`. See https://setuptools.pypa.io/en/latest/references/keywords.html#keyword-namespace-packages
    pkg_resources.declare_namespace(__name__)

../../build/gradleenv/2050596098/lib/python3.10/site-packages/google/api_core/operations_v1/abstract_operations_client.py:17
../../build/gradleenv/2050596098/lib/python3.10/site-packages/google/api_core/operations_v1/abstract_operations_client.py:17
../../build/gradleenv/2050596098/lib/python3.10/site-packages/google/api_core/operations_v1/abstract_operations_client.py:17
../../build/gradleenv/2050596098/lib/python3.10/site-packages/google/api_core/operations_v1/abstract_operations_client.py:17
../../build/gradleenv/2050596098/lib/python3.10/site-packages/google/api_core/operations_v1/abstract_operations_client.py:17
../../build/gradleenv/2050596098/lib/python3.10/site-packages/google/api_core/operations_v1/abstract_operations_client.py:17
../../build/gradleenv/2050596098/lib/python3.10/site-packages/google/api_core/operations_v1/abstract_operations_client.py:17
../../build/gradleenv/2050596098/lib/python3.10/site-packages/google/api_core/operations_v1/abstract_operations_client.py:17
  <https://ci-beam.apache.org/job/beam_PostCommit_Python310/ws/src/build/gradleenv/2050596098/lib/python3.10/site-packages/google/api_core/operations_v1/abstract_operations_client.py>:17: DeprecationWarning: The distutils package is deprecated and slated for removal in Python 3.12. Use setuptools or check PEP 632 for potential alternatives
    from distutils import util

apache_beam/typehints/pandas_type_compatibility_test.py:67
apache_beam/typehints/pandas_type_compatibility_test.py:67
apache_beam/typehints/pandas_type_compatibility_test.py:67
apache_beam/typehints/pandas_type_compatibility_test.py:67
apache_beam/typehints/pandas_type_compatibility_test.py:67
apache_beam/typehints/pandas_type_compatibility_test.py:67
apache_beam/typehints/pandas_type_compatibility_test.py:67
apache_beam/typehints/pandas_type_compatibility_test.py:67
  <https://ci-beam.apache.org/job/beam_PostCommit_Python310/ws/src/sdks/python/apache_beam/typehints/pandas_type_compatibility_test.py>:67: FutureWarning: pandas.Int64Index is deprecated and will be removed from pandas in a future version. Use pandas.Index with the appropriate dtype instead.
    }).set_index(pd.Int64Index(range(123, 223), name='an_index')),

apache_beam/typehints/pandas_type_compatibility_test.py:90
apache_beam/typehints/pandas_type_compatibility_test.py:90
apache_beam/typehints/pandas_type_compatibility_test.py:90
apache_beam/typehints/pandas_type_compatibility_test.py:90
apache_beam/typehints/pandas_type_compatibility_test.py:90
apache_beam/typehints/pandas_type_compatibility_test.py:90
apache_beam/typehints/pandas_type_compatibility_test.py:90
apache_beam/typehints/pandas_type_compatibility_test.py:90
  <https://ci-beam.apache.org/job/beam_PostCommit_Python310/ws/src/sdks/python/apache_beam/typehints/pandas_type_compatibility_test.py>:90: FutureWarning: pandas.Int64Index is deprecated and will be removed from pandas in a future version. Use pandas.Index with the appropriate dtype instead.
    pd.Int64Index(range(123, 223), name='an_index'),

apache_beam/typehints/pandas_type_compatibility_test.py:91
apache_beam/typehints/pandas_type_compatibility_test.py:91
apache_beam/typehints/pandas_type_compatibility_test.py:91
apache_beam/typehints/pandas_type_compatibility_test.py:91
apache_beam/typehints/pandas_type_compatibility_test.py:91
apache_beam/typehints/pandas_type_compatibility_test.py:91
apache_beam/typehints/pandas_type_compatibility_test.py:91
apache_beam/typehints/pandas_type_compatibility_test.py:91
  <https://ci-beam.apache.org/job/beam_PostCommit_Python310/ws/src/sdks/python/apache_beam/typehints/pandas_type_compatibility_test.py>:91: FutureWarning: pandas.Int64Index is deprecated and will be removed from pandas in a future version. Use pandas.Index with the appropriate dtype instead.
    pd.Int64Index(range(475, 575), name='another_index'),

apache_beam/dataframe/io_it_test.py: 3 warnings
apache_beam/examples/cookbook/bigquery_tornadoes_it_test.py: 1 warning
apache_beam/examples/dataframe/flight_delays_it_test.py: 1 warning
apache_beam/io/gcp/bigquery_io_read_it_test.py: 2 warnings
apache_beam/io/gcp/bigquery_read_it_test.py: 7 warnings
apache_beam/io/gcp/big_query_query_to_table_it_test.py: 4 warnings
apache_beam/io/gcp/bigquery_json_it_test.py: 3 warnings
  <https://ci-beam.apache.org/job/beam_PostCommit_Python310/ws/src/sdks/python/apache_beam/io/gcp/bigquery.py>:2722: BeamDeprecationWarning: options is deprecated since First stable release. References to <pipeline>.options will not be supported
    temp_location = pcoll.pipeline.options.view_as(

apache_beam/dataframe/io_it_test.py: 3 warnings
apache_beam/examples/cookbook/bigquery_tornadoes_it_test.py: 1 warning
apache_beam/examples/dataframe/flight_delays_it_test.py: 1 warning
apache_beam/io/gcp/bigquery_io_read_it_test.py: 2 warnings
apache_beam/io/gcp/bigquery_read_it_test.py: 7 warnings
apache_beam/io/gcp/big_query_query_to_table_it_test.py: 4 warnings
apache_beam/io/gcp/bigquery_json_it_test.py: 3 warnings
  <https://ci-beam.apache.org/job/beam_PostCommit_Python310/ws/src/sdks/python/apache_beam/io/gcp/bigquery.py>:2724: BeamDeprecationWarning: options is deprecated since First stable release. References to <pipeline>.options will not be supported
    job_name = pcoll.pipeline.options.view_as(GoogleCloudOptions).job_name

apache_beam/dataframe/io_it_test.py: 3 warnings
apache_beam/examples/cookbook/bigquery_tornadoes_it_test.py: 1 warning
apache_beam/examples/dataframe/flight_delays_it_test.py: 1 warning
apache_beam/io/gcp/bigquery_io_read_it_test.py: 2 warnings
apache_beam/io/gcp/bigquery_read_it_test.py: 7 warnings
apache_beam/io/gcp/big_query_query_to_table_it_test.py: 4 warnings
apache_beam/io/gcp/bigquery_json_it_test.py: 3 warnings
  <https://ci-beam.apache.org/job/beam_PostCommit_Python310/ws/src/sdks/python/apache_beam/io/gcp/bigquery.py>:2748: BeamDeprecationWarning: options is deprecated since First stable release. References to <pipeline>.options will not be supported
    pipeline_options=pcoll.pipeline.options,

apache_beam/examples/cookbook/bigquery_tornadoes_it_test.py: 1 warning
apache_beam/io/gcp/big_query_query_to_table_it_test.py: 4 warnings
apache_beam/io/gcp/bigquery_write_it_test.py: 4 warnings
apache_beam/io/gcp/bigquery_test.py: 2 warnings
  <https://ci-beam.apache.org/job/beam_PostCommit_Python310/ws/src/sdks/python/apache_beam/io/gcp/bigquery.py>:2075: BeamDeprecationWarning: options is deprecated since First stable release. References to <pipeline>.options will not be supported
    self.table_reference.projectId = pcoll.pipeline.options.view_as(

apache_beam/examples/cookbook/bigquery_tornadoes_it_test.py: 1 warning
apache_beam/examples/complete/game/game_stats_it_test.py: 2 warnings
apache_beam/examples/complete/game/hourly_team_score_it_test.py: 1 warning
apache_beam/examples/complete/game/leader_board_it_test.py: 2 warnings
apache_beam/io/gcp/bigquery_file_loads_test.py: 3 warnings
apache_beam/io/gcp/big_query_query_to_table_it_test.py: 4 warnings
apache_beam/io/gcp/bigquery_json_it_test.py: 2 warnings
apache_beam/io/gcp/bigquery_test.py: 6 warnings
apache_beam/io/gcp/bigquery_write_it_test.py: 4 warnings
  <https://ci-beam.apache.org/job/beam_PostCommit_Python310/ws/src/sdks/python/apache_beam/io/gcp/bigquery.py>:2079: BeamDeprecationWarning: options is deprecated since First stable release. References to <pipeline>.options will not be supported
    is_streaming_pipeline = p.options.view_as(StandardOptions).streaming

apache_beam/examples/cookbook/bigquery_tornadoes_it_test.py: 1 warning
apache_beam/examples/complete/game/game_stats_it_test.py: 2 warnings
apache_beam/examples/complete/game/hourly_team_score_it_test.py: 1 warning
apache_beam/examples/complete/game/leader_board_it_test.py: 2 warnings
apache_beam/io/gcp/bigquery_file_loads_test.py: 3 warnings
apache_beam/io/gcp/big_query_query_to_table_it_test.py: 4 warnings
apache_beam/io/gcp/bigquery_json_it_test.py: 2 warnings
apache_beam/io/gcp/bigquery_test.py: 6 warnings
apache_beam/io/gcp/bigquery_write_it_test.py: 4 warnings
  <https://ci-beam.apache.org/job/beam_PostCommit_Python310/ws/src/sdks/python/apache_beam/io/gcp/bigquery.py>:2085: BeamDeprecationWarning: options is deprecated since First stable release. References to <pipeline>.options will not be supported
    experiments = p.options.view_as(DebugOptions).experiments or []

apache_beam/examples/cookbook/bigquery_tornadoes_it_test.py: 1 warning
apache_beam/io/gcp/bigquery_file_loads_test.py: 3 warnings
apache_beam/io/gcp/big_query_query_to_table_it_test.py: 4 warnings
apache_beam/io/gcp/bigquery_write_it_test.py: 3 warnings
apache_beam/io/gcp/bigquery_test.py: 3 warnings
  <https://ci-beam.apache.org/job/beam_PostCommit_Python310/ws/src/sdks/python/apache_beam/io/gcp/bigquery_file_loads.py>:1169: BeamDeprecationWarning: options is deprecated since First stable release. References to <pipeline>.options will not be supported
    self.project = self.project or p.options.view_as(GoogleCloudOptions).project

apache_beam/examples/cookbook/bigquery_tornadoes_it_test.py: 1 warning
apache_beam/examples/complete/game/hourly_team_score_it_test.py: 1 warning
apache_beam/io/gcp/bigquery_file_loads_test.py: 3 warnings
apache_beam/io/gcp/big_query_query_to_table_it_test.py: 4 warnings
apache_beam/io/gcp/bigquery_write_it_test.py: 3 warnings
apache_beam/io/gcp/bigquery_test.py: 3 warnings
  <https://ci-beam.apache.org/job/beam_PostCommit_Python310/ws/src/sdks/python/apache_beam/io/gcp/bigquery_file_loads.py>:1176: BeamDeprecationWarning: options is deprecated since First stable release. References to <pipeline>.options will not be supported
    temp_location = p.options.view_as(GoogleCloudOptions).temp_location

apache_beam/examples/cookbook/bigquery_tornadoes_it_test.py: 1 warning
apache_beam/examples/complete/game/hourly_team_score_it_test.py: 1 warning
apache_beam/io/gcp/bigquery_file_loads_test.py: 3 warnings
apache_beam/io/gcp/big_query_query_to_table_it_test.py: 4 warnings
apache_beam/io/gcp/bigquery_write_it_test.py: 3 warnings
apache_beam/io/gcp/bigquery_test.py: 3 warnings
  <https://ci-beam.apache.org/job/beam_PostCommit_Python310/ws/src/sdks/python/apache_beam/io/gcp/bigquery_file_loads.py>:1178: BeamDeprecationWarning: options is deprecated since First stable release. References to <pipeline>.options will not be supported
    p.options.view_as(GoogleCloudOptions).job_name or 'AUTOMATIC_JOB_NAME')

apache_beam/examples/cookbook/bigquery_tornadoes_it_test.py::BigqueryTornadoesIT::test_bigquery_tornadoes_it
  <https://ci-beam.apache.org/job/beam_PostCommit_Python310/ws/src/sdks/python/apache_beam/io/gcp/tests/utils.py>:100: PendingDeprecationWarning: Client.dataset is deprecated and will be removed in a future version. Use a string like 'my_project.my_dataset' or a cloud.google.bigquery.DatasetReference object, instead.
    table_ref = client.dataset(dataset_id).table(table_id)

apache_beam/dataframe/io_it_test.py: 2 warnings
apache_beam/io/gcp/bigquery_json_it_test.py: 1 warning
apache_beam/io/gcp/bigquery_read_it_test.py: 9 warnings
  <https://ci-beam.apache.org/job/beam_PostCommit_Python310/ws/src/sdks/python/apache_beam/io/gcp/bigquery.py>:2766: BeamDeprecationWarning: options is deprecated since First stable release. References to <pipeline>.options will not be supported
    project_id = pcoll.pipeline.options.view_as(GoogleCloudOptions).project

apache_beam/dataframe/io_it_test.py: 2 warnings
apache_beam/io/gcp/bigquery_json_it_test.py: 1 warning
apache_beam/io/gcp/bigquery_read_it_test.py: 9 warnings
  <https://ci-beam.apache.org/job/beam_PostCommit_Python310/ws/src/sdks/python/apache_beam/io/gcp/bigquery.py>:2787: BeamDeprecationWarning: options is deprecated since First stable release. References to <pipeline>.options will not be supported
    pipeline_options=pcoll.pipeline.options,

apache_beam/examples/complete/game/game_stats_it_test.py::GameStatsIT::test_game_stats_it
apache_beam/examples/complete/game/hourly_team_score_it_test.py::HourlyTeamScoreIT::test_hourly_team_score_it
apache_beam/examples/complete/game/leader_board_it_test.py::LeaderBoardIT::test_leader_board_it
apache_beam/io/gcp/bigquery_test.py::PubSubBigQueryIT::test_file_loads
apache_beam/io/gcp/bigquery_test.py::PubSubBigQueryIT::test_streaming_inserts
  <https://ci-beam.apache.org/job/beam_PostCommit_Python310/ws/src/sdks/python/apache_beam/io/gcp/tests/utils.py>:63: PendingDeprecationWarning: Client.dataset is deprecated and will be removed in a future version. Use a string like 'my_project.my_dataset' or a cloud.google.bigquery.DatasetReference object, instead.
    dataset_ref = client.dataset(unique_dataset_name, project=project)

apache_beam/examples/dataframe/flight_delays_it_test.py::FlightDelaysTest::test_flight_delays
  <https://ci-beam.apache.org/job/beam_PostCommit_Python310/ws/src/sdks/python/apache_beam/examples/dataframe/flight_delays.py>:47: FutureWarning: The default value of numeric_only in DataFrame.mean is deprecated. In a future version, it will default to False. In addition, specifying 'numeric_only=None' is deprecated. Select only valid columns or specify the value of numeric_only to silence this warning.
    return airline_df[at_top_airports].mean()

apache_beam/examples/dataframe/flight_delays_it_test.py::FlightDelaysTest::test_flight_delays
apache_beam/examples/dataframe/taxiride_it_test.py::TaxirideIT::test_aggregation
apache_beam/examples/dataframe/taxiride_it_test.py::TaxirideIT::test_enrich
  <https://ci-beam.apache.org/job/beam_PostCommit_Python310/ws/src/sdks/python/apache_beam/io/fileio.py>:593: BeamDeprecationWarning: options is deprecated since First stable release. References to <pipeline>.options will not be supported
    p.options.view_as(GoogleCloudOptions).temp_location or

apache_beam/io/gcp/bigquery_read_it_test.py::ReadTests::test_native_source
  <https://ci-beam.apache.org/job/beam_PostCommit_Python310/ws/src/sdks/python/apache_beam/io/gcp/bigquery_read_it_test.py>:170: BeamDeprecationWarning: BigQuerySource is deprecated since 2.25.0. Use ReadFromBigQuery instead.
    beam.io.BigQuerySource(query=self.query, use_standard_sql=True)))

apache_beam/io/gcp/bigquery_test.py::BigQueryStreamingInsertTransformIntegrationTests::test_multiple_destinations_transform
  <https://ci-beam.apache.org/job/beam_PostCommit_Python310/ws/src/sdks/python/apache_beam/io/gcp/bigquery_test.py>:1728: BeamDeprecationWarning: options is deprecated since First stable release. References to <pipeline>.options will not be supported
    streaming = self.test_pipeline.options.view_as(StandardOptions).streaming

apache_beam/transforms/external_it_test.py::ExternalTransformIT::test_job_python_from_python_it
  <https://ci-beam.apache.org/job/beam_PostCommit_Python310/ws/src/sdks/python/apache_beam/transforms/external.py>:676: BeamDeprecationWarning: options is deprecated since First stable release. References to <pipeline>.options will not be supported
    self._expansion_service, pipeline.options)

apache_beam/io/gcp/bigquery_read_it_test.py::ReadNewTypesTests::test_native_source
  <https://ci-beam.apache.org/job/beam_PostCommit_Python310/ws/src/sdks/python/apache_beam/io/gcp/bigquery_read_it_test.py>:693: BeamDeprecationWarning: BigQuerySource is deprecated since 2.25.0. Use ReadFromBigQuery instead.
    beam.io.BigQuerySource(query=self.query, use_standard_sql=True)))

apache_beam/io/gcp/bigquery_read_it_test.py::ReadAllBQTests::test_read_queries
  <https://ci-beam.apache.org/job/beam_PostCommit_Python310/ws/src/sdks/python/apache_beam/io/gcp/bigquery.py>:2894: BeamDeprecationWarning: options is deprecated since First stable release. References to <pipeline>.options will not be supported
    job_name = pcoll.pipeline.options.view_as(GoogleCloudOptions).job_name

apache_beam/io/gcp/bigquery_read_it_test.py::ReadAllBQTests::test_read_queries
  <https://ci-beam.apache.org/job/beam_PostCommit_Python310/ws/src/sdks/python/apache_beam/io/gcp/bigquery.py>:2895: BeamDeprecationWarning: options is deprecated since First stable release. References to <pipeline>.options will not be supported
    project = pcoll.pipeline.options.view_as(GoogleCloudOptions).project

apache_beam/io/gcp/bigquery_read_it_test.py::ReadAllBQTests::test_read_queries
  <https://ci-beam.apache.org/job/beam_PostCommit_Python310/ws/src/sdks/python/apache_beam/io/gcp/bigquery.py>:2908: BeamDeprecationWarning: options is deprecated since First stable release. References to <pipeline>.options will not be supported
    options=pcoll.pipeline.options,

-- Docs: https://docs.pytest.org/en/stable/how-to/capture-warnings.html
- generated xml file: <https://ci-beam.apache.org/job/beam_PostCommit_Python310/ws/src/sdks/python/pytest_postCommitIT-df-py310.xml> -
=========================== short test summary info ============================
FAILED apache_beam/examples/complete/juliaset/juliaset/juliaset_test_it.py::JuliaSetTestIT::test_run_example_with_setup_file - Failed: Timeout >4500.0s
===== 1 failed, 78 passed, 42 skipped, 646 warnings in 8510.52s (2:21:50) ======

> Task :sdks:python:test-suites:dataflow:py310:postCommitIT FAILED

FAILURE: Build failed with an exception.

* Where:
Script '<https://ci-beam.apache.org/job/beam_PostCommit_Python310/ws/src/sdks/python/test-suites/dataflow/common.gradle'> line: 141

* What went wrong:
Execution failed for task ':sdks:python:test-suites:dataflow:py310:postCommitIT'.
> Process 'command 'sh'' finished with non-zero exit value 1

* Try:
> Run with --stacktrace option to get the stack trace.
> Run with --info or --debug option to get more log output.

* Get more help at https://help.gradle.org

Deprecated Gradle features were used in this build, making it incompatible with Gradle 8.0.

You can use '--warning-mode all' to show the individual deprecation warnings and determine if they come from your own scripts or plugins.

See https://docs.gradle.org/7.5.1/userguide/command_line_interface.html#sec:command_line_warnings

Execution optimizations have been disabled for 1 invalid unit(s) of work during this build to ensure correctness.
Please consult deprecation warnings for more details.

BUILD FAILED in 2h 30m 44s
209 actionable tasks: 144 executed, 59 from cache, 6 up-to-date

Publishing build scan...
https://ge.apache.org/s/rp74pt2ttew32

Build step 'Invoke Gradle script' changed build result to FAILURE
Build step 'Invoke Gradle script' marked build as failure

---------------------------------------------------------------------
To unsubscribe, e-mail: builds-unsubscribe@beam.apache.org
For additional commands, e-mail: builds-help@beam.apache.org


Jenkins build is back to normal : beam_PostCommit_Python310 #1046

Posted by Apache Jenkins Server <je...@builds.apache.org>.
See <https://ci-beam.apache.org/job/beam_PostCommit_Python310/1046/display/redirect>


---------------------------------------------------------------------
To unsubscribe, e-mail: builds-unsubscribe@beam.apache.org
For additional commands, e-mail: builds-help@beam.apache.org


Build failed in Jenkins: beam_PostCommit_Python310 #1045

Posted by Apache Jenkins Server <je...@builds.apache.org>.
See <https://ci-beam.apache.org/job/beam_PostCommit_Python310/1045/display/redirect?page=changes>

Changes:

[noreply] Bump google.golang.org/api from 0.129.0 to 0.130.0 in /sdks (#27377)


------------------------------------------
[...truncated 12.59 MB...]
    declare_namespace(pkg)

../../build/gradleenv/2050596098/lib/python3.10/site-packages/google/rpc/__init__.py:20
../../build/gradleenv/2050596098/lib/python3.10/site-packages/google/rpc/__init__.py:20
../../build/gradleenv/2050596098/lib/python3.10/site-packages/google/rpc/__init__.py:20
../../build/gradleenv/2050596098/lib/python3.10/site-packages/google/rpc/__init__.py:20
../../build/gradleenv/2050596098/lib/python3.10/site-packages/google/rpc/__init__.py:20
../../build/gradleenv/2050596098/lib/python3.10/site-packages/google/rpc/__init__.py:20
../../build/gradleenv/2050596098/lib/python3.10/site-packages/google/rpc/__init__.py:20
../../build/gradleenv/2050596098/lib/python3.10/site-packages/google/rpc/__init__.py:20
../../build/gradleenv/2050596098/lib/python3.10/site-packages/google/rpc/__init__.py:20
  <https://ci-beam.apache.org/job/beam_PostCommit_Python310/ws/src/build/gradleenv/2050596098/lib/python3.10/site-packages/google/rpc/__init__.py>:20: DeprecationWarning: Deprecated call to `pkg_resources.declare_namespace('google.rpc')`.
  Implementing implicit namespace packages (as specified in PEP 420) is preferred to `pkg_resources.declare_namespace`. See https://setuptools.pypa.io/en/latest/references/keywords.html#keyword-namespace-packages
    pkg_resources.declare_namespace(__name__)

../../build/gradleenv/2050596098/lib/python3.10/site-packages/google/api_core/operations_v1/abstract_operations_client.py:17
../../build/gradleenv/2050596098/lib/python3.10/site-packages/google/api_core/operations_v1/abstract_operations_client.py:17
../../build/gradleenv/2050596098/lib/python3.10/site-packages/google/api_core/operations_v1/abstract_operations_client.py:17
../../build/gradleenv/2050596098/lib/python3.10/site-packages/google/api_core/operations_v1/abstract_operations_client.py:17
../../build/gradleenv/2050596098/lib/python3.10/site-packages/google/api_core/operations_v1/abstract_operations_client.py:17
../../build/gradleenv/2050596098/lib/python3.10/site-packages/google/api_core/operations_v1/abstract_operations_client.py:17
../../build/gradleenv/2050596098/lib/python3.10/site-packages/google/api_core/operations_v1/abstract_operations_client.py:17
../../build/gradleenv/2050596098/lib/python3.10/site-packages/google/api_core/operations_v1/abstract_operations_client.py:17
  <https://ci-beam.apache.org/job/beam_PostCommit_Python310/ws/src/build/gradleenv/2050596098/lib/python3.10/site-packages/google/api_core/operations_v1/abstract_operations_client.py>:17: DeprecationWarning: The distutils package is deprecated and slated for removal in Python 3.12. Use setuptools or check PEP 632 for potential alternatives
    from distutils import util

apache_beam/typehints/pandas_type_compatibility_test.py:67
apache_beam/typehints/pandas_type_compatibility_test.py:67
apache_beam/typehints/pandas_type_compatibility_test.py:67
apache_beam/typehints/pandas_type_compatibility_test.py:67
apache_beam/typehints/pandas_type_compatibility_test.py:67
apache_beam/typehints/pandas_type_compatibility_test.py:67
apache_beam/typehints/pandas_type_compatibility_test.py:67
apache_beam/typehints/pandas_type_compatibility_test.py:67
  <https://ci-beam.apache.org/job/beam_PostCommit_Python310/ws/src/sdks/python/apache_beam/typehints/pandas_type_compatibility_test.py>:67: FutureWarning: pandas.Int64Index is deprecated and will be removed from pandas in a future version. Use pandas.Index with the appropriate dtype instead.
    }).set_index(pd.Int64Index(range(123, 223), name='an_index')),

apache_beam/typehints/pandas_type_compatibility_test.py:90
apache_beam/typehints/pandas_type_compatibility_test.py:90
apache_beam/typehints/pandas_type_compatibility_test.py:90
apache_beam/typehints/pandas_type_compatibility_test.py:90
apache_beam/typehints/pandas_type_compatibility_test.py:90
apache_beam/typehints/pandas_type_compatibility_test.py:90
apache_beam/typehints/pandas_type_compatibility_test.py:90
apache_beam/typehints/pandas_type_compatibility_test.py:90
  <https://ci-beam.apache.org/job/beam_PostCommit_Python310/ws/src/sdks/python/apache_beam/typehints/pandas_type_compatibility_test.py>:90: FutureWarning: pandas.Int64Index is deprecated and will be removed from pandas in a future version. Use pandas.Index with the appropriate dtype instead.
    pd.Int64Index(range(123, 223), name='an_index'),

apache_beam/typehints/pandas_type_compatibility_test.py:91
apache_beam/typehints/pandas_type_compatibility_test.py:91
apache_beam/typehints/pandas_type_compatibility_test.py:91
apache_beam/typehints/pandas_type_compatibility_test.py:91
apache_beam/typehints/pandas_type_compatibility_test.py:91
apache_beam/typehints/pandas_type_compatibility_test.py:91
apache_beam/typehints/pandas_type_compatibility_test.py:91
apache_beam/typehints/pandas_type_compatibility_test.py:91
  <https://ci-beam.apache.org/job/beam_PostCommit_Python310/ws/src/sdks/python/apache_beam/typehints/pandas_type_compatibility_test.py>:91: FutureWarning: pandas.Int64Index is deprecated and will be removed from pandas in a future version. Use pandas.Index with the appropriate dtype instead.
    pd.Int64Index(range(475, 575), name='another_index'),

apache_beam/dataframe/io_it_test.py: 3 warnings
apache_beam/examples/cookbook/bigquery_tornadoes_it_test.py: 1 warning
apache_beam/examples/dataframe/flight_delays_it_test.py: 1 warning
apache_beam/io/gcp/bigquery_read_it_test.py: 7 warnings
apache_beam/io/gcp/bigquery_io_read_it_test.py: 2 warnings
apache_beam/io/gcp/bigquery_json_it_test.py: 3 warnings
apache_beam/io/gcp/big_query_query_to_table_it_test.py: 4 warnings
  <https://ci-beam.apache.org/job/beam_PostCommit_Python310/ws/src/sdks/python/apache_beam/io/gcp/bigquery.py>:2722: BeamDeprecationWarning: options is deprecated since First stable release. References to <pipeline>.options will not be supported
    temp_location = pcoll.pipeline.options.view_as(

apache_beam/dataframe/io_it_test.py: 3 warnings
apache_beam/examples/cookbook/bigquery_tornadoes_it_test.py: 1 warning
apache_beam/examples/dataframe/flight_delays_it_test.py: 1 warning
apache_beam/io/gcp/bigquery_read_it_test.py: 7 warnings
apache_beam/io/gcp/bigquery_io_read_it_test.py: 2 warnings
apache_beam/io/gcp/bigquery_json_it_test.py: 3 warnings
apache_beam/io/gcp/big_query_query_to_table_it_test.py: 4 warnings
  <https://ci-beam.apache.org/job/beam_PostCommit_Python310/ws/src/sdks/python/apache_beam/io/gcp/bigquery.py>:2724: BeamDeprecationWarning: options is deprecated since First stable release. References to <pipeline>.options will not be supported
    job_name = pcoll.pipeline.options.view_as(GoogleCloudOptions).job_name

apache_beam/dataframe/io_it_test.py: 3 warnings
apache_beam/examples/cookbook/bigquery_tornadoes_it_test.py: 1 warning
apache_beam/examples/dataframe/flight_delays_it_test.py: 1 warning
apache_beam/io/gcp/bigquery_read_it_test.py: 7 warnings
apache_beam/io/gcp/bigquery_io_read_it_test.py: 2 warnings
apache_beam/io/gcp/bigquery_json_it_test.py: 3 warnings
apache_beam/io/gcp/big_query_query_to_table_it_test.py: 4 warnings
  <https://ci-beam.apache.org/job/beam_PostCommit_Python310/ws/src/sdks/python/apache_beam/io/gcp/bigquery.py>:2748: BeamDeprecationWarning: options is deprecated since First stable release. References to <pipeline>.options will not be supported
    pipeline_options=pcoll.pipeline.options,

apache_beam/examples/cookbook/bigquery_tornadoes_it_test.py: 1 warning
apache_beam/io/gcp/bigquery_write_it_test.py: 4 warnings
apache_beam/io/gcp/bigquery_test.py: 2 warnings
apache_beam/io/gcp/big_query_query_to_table_it_test.py: 4 warnings
  <https://ci-beam.apache.org/job/beam_PostCommit_Python310/ws/src/sdks/python/apache_beam/io/gcp/bigquery.py>:2075: BeamDeprecationWarning: options is deprecated since First stable release. References to <pipeline>.options will not be supported
    self.table_reference.projectId = pcoll.pipeline.options.view_as(

apache_beam/examples/cookbook/bigquery_tornadoes_it_test.py: 1 warning
apache_beam/examples/complete/game/game_stats_it_test.py: 2 warnings
apache_beam/examples/complete/game/hourly_team_score_it_test.py: 1 warning
apache_beam/examples/complete/game/leader_board_it_test.py: 2 warnings
apache_beam/io/gcp/bigquery_file_loads_test.py: 3 warnings
apache_beam/io/gcp/bigquery_test.py: 6 warnings
apache_beam/io/gcp/bigquery_json_it_test.py: 2 warnings
apache_beam/io/gcp/bigquery_write_it_test.py: 4 warnings
apache_beam/io/gcp/big_query_query_to_table_it_test.py: 4 warnings
  <https://ci-beam.apache.org/job/beam_PostCommit_Python310/ws/src/sdks/python/apache_beam/io/gcp/bigquery.py>:2079: BeamDeprecationWarning: options is deprecated since First stable release. References to <pipeline>.options will not be supported
    is_streaming_pipeline = p.options.view_as(StandardOptions).streaming

apache_beam/examples/cookbook/bigquery_tornadoes_it_test.py: 1 warning
apache_beam/examples/complete/game/game_stats_it_test.py: 2 warnings
apache_beam/examples/complete/game/hourly_team_score_it_test.py: 1 warning
apache_beam/examples/complete/game/leader_board_it_test.py: 2 warnings
apache_beam/io/gcp/bigquery_file_loads_test.py: 3 warnings
apache_beam/io/gcp/bigquery_test.py: 6 warnings
apache_beam/io/gcp/bigquery_json_it_test.py: 2 warnings
apache_beam/io/gcp/bigquery_write_it_test.py: 4 warnings
apache_beam/io/gcp/big_query_query_to_table_it_test.py: 4 warnings
  <https://ci-beam.apache.org/job/beam_PostCommit_Python310/ws/src/sdks/python/apache_beam/io/gcp/bigquery.py>:2085: BeamDeprecationWarning: options is deprecated since First stable release. References to <pipeline>.options will not be supported
    experiments = p.options.view_as(DebugOptions).experiments or []

apache_beam/examples/cookbook/bigquery_tornadoes_it_test.py: 1 warning
apache_beam/io/gcp/bigquery_file_loads_test.py: 3 warnings
apache_beam/io/gcp/bigquery_test.py: 3 warnings
apache_beam/io/gcp/bigquery_write_it_test.py: 3 warnings
apache_beam/io/gcp/big_query_query_to_table_it_test.py: 4 warnings
  <https://ci-beam.apache.org/job/beam_PostCommit_Python310/ws/src/sdks/python/apache_beam/io/gcp/bigquery_file_loads.py>:1169: BeamDeprecationWarning: options is deprecated since First stable release. References to <pipeline>.options will not be supported
    self.project = self.project or p.options.view_as(GoogleCloudOptions).project

apache_beam/examples/cookbook/bigquery_tornadoes_it_test.py: 1 warning
apache_beam/examples/complete/game/hourly_team_score_it_test.py: 1 warning
apache_beam/io/gcp/bigquery_file_loads_test.py: 3 warnings
apache_beam/io/gcp/bigquery_test.py: 3 warnings
apache_beam/io/gcp/bigquery_write_it_test.py: 3 warnings
apache_beam/io/gcp/big_query_query_to_table_it_test.py: 4 warnings
  <https://ci-beam.apache.org/job/beam_PostCommit_Python310/ws/src/sdks/python/apache_beam/io/gcp/bigquery_file_loads.py>:1176: BeamDeprecationWarning: options is deprecated since First stable release. References to <pipeline>.options will not be supported
    temp_location = p.options.view_as(GoogleCloudOptions).temp_location

apache_beam/examples/cookbook/bigquery_tornadoes_it_test.py: 1 warning
apache_beam/examples/complete/game/hourly_team_score_it_test.py: 1 warning
apache_beam/io/gcp/bigquery_file_loads_test.py: 3 warnings
apache_beam/io/gcp/bigquery_test.py: 3 warnings
apache_beam/io/gcp/bigquery_write_it_test.py: 3 warnings
apache_beam/io/gcp/big_query_query_to_table_it_test.py: 4 warnings
  <https://ci-beam.apache.org/job/beam_PostCommit_Python310/ws/src/sdks/python/apache_beam/io/gcp/bigquery_file_loads.py>:1178: BeamDeprecationWarning: options is deprecated since First stable release. References to <pipeline>.options will not be supported
    p.options.view_as(GoogleCloudOptions).job_name or 'AUTOMATIC_JOB_NAME')

apache_beam/examples/cookbook/bigquery_tornadoes_it_test.py::BigqueryTornadoesIT::test_bigquery_tornadoes_it
  <https://ci-beam.apache.org/job/beam_PostCommit_Python310/ws/src/sdks/python/apache_beam/io/gcp/tests/utils.py>:100: PendingDeprecationWarning: Client.dataset is deprecated and will be removed in a future version. Use a string like 'my_project.my_dataset' or a cloud.google.bigquery.DatasetReference object, instead.
    table_ref = client.dataset(dataset_id).table(table_id)

apache_beam/examples/complete/game/game_stats_it_test.py::GameStatsIT::test_game_stats_it
apache_beam/examples/complete/game/hourly_team_score_it_test.py::HourlyTeamScoreIT::test_hourly_team_score_it
apache_beam/examples/complete/game/leader_board_it_test.py::LeaderBoardIT::test_leader_board_it
apache_beam/io/gcp/bigquery_test.py::PubSubBigQueryIT::test_file_loads
apache_beam/io/gcp/bigquery_test.py::PubSubBigQueryIT::test_streaming_inserts
  <https://ci-beam.apache.org/job/beam_PostCommit_Python310/ws/src/sdks/python/apache_beam/io/gcp/tests/utils.py>:63: PendingDeprecationWarning: Client.dataset is deprecated and will be removed in a future version. Use a string like 'my_project.my_dataset' or a cloud.google.bigquery.DatasetReference object, instead.
    dataset_ref = client.dataset(unique_dataset_name, project=project)

apache_beam/dataframe/io_it_test.py: 2 warnings
apache_beam/io/gcp/bigquery_json_it_test.py: 1 warning
apache_beam/io/gcp/bigquery_read_it_test.py: 9 warnings
  <https://ci-beam.apache.org/job/beam_PostCommit_Python310/ws/src/sdks/python/apache_beam/io/gcp/bigquery.py>:2766: BeamDeprecationWarning: options is deprecated since First stable release. References to <pipeline>.options will not be supported
    project_id = pcoll.pipeline.options.view_as(GoogleCloudOptions).project

apache_beam/dataframe/io_it_test.py: 2 warnings
apache_beam/io/gcp/bigquery_json_it_test.py: 1 warning
apache_beam/io/gcp/bigquery_read_it_test.py: 9 warnings
  <https://ci-beam.apache.org/job/beam_PostCommit_Python310/ws/src/sdks/python/apache_beam/io/gcp/bigquery.py>:2787: BeamDeprecationWarning: options is deprecated since First stable release. References to <pipeline>.options will not be supported
    pipeline_options=pcoll.pipeline.options,

apache_beam/examples/dataframe/flight_delays_it_test.py::FlightDelaysTest::test_flight_delays
  <https://ci-beam.apache.org/job/beam_PostCommit_Python310/ws/src/sdks/python/apache_beam/examples/dataframe/flight_delays.py>:47: FutureWarning: The default value of numeric_only in DataFrame.mean is deprecated. In a future version, it will default to False. In addition, specifying 'numeric_only=None' is deprecated. Select only valid columns or specify the value of numeric_only to silence this warning.
    return airline_df[at_top_airports].mean()

apache_beam/examples/dataframe/flight_delays_it_test.py::FlightDelaysTest::test_flight_delays
apache_beam/examples/dataframe/taxiride_it_test.py::TaxirideIT::test_aggregation
apache_beam/examples/dataframe/taxiride_it_test.py::TaxirideIT::test_enrich
  <https://ci-beam.apache.org/job/beam_PostCommit_Python310/ws/src/sdks/python/apache_beam/io/fileio.py>:593: BeamDeprecationWarning: options is deprecated since First stable release. References to <pipeline>.options will not be supported
    p.options.view_as(GoogleCloudOptions).temp_location or

apache_beam/io/gcp/bigquery_test.py::BigQueryStreamingInsertTransformIntegrationTests::test_multiple_destinations_transform
  <https://ci-beam.apache.org/job/beam_PostCommit_Python310/ws/src/sdks/python/apache_beam/io/gcp/bigquery_test.py>:1728: BeamDeprecationWarning: options is deprecated since First stable release. References to <pipeline>.options will not be supported
    streaming = self.test_pipeline.options.view_as(StandardOptions).streaming

apache_beam/io/gcp/bigquery_read_it_test.py::ReadTests::test_native_source
  <https://ci-beam.apache.org/job/beam_PostCommit_Python310/ws/src/sdks/python/apache_beam/io/gcp/bigquery_read_it_test.py>:170: BeamDeprecationWarning: BigQuerySource is deprecated since 2.25.0. Use ReadFromBigQuery instead.
    beam.io.BigQuerySource(query=self.query, use_standard_sql=True)))

apache_beam/transforms/external_it_test.py::ExternalTransformIT::test_job_python_from_python_it
  <https://ci-beam.apache.org/job/beam_PostCommit_Python310/ws/src/sdks/python/apache_beam/transforms/external.py>:676: BeamDeprecationWarning: options is deprecated since First stable release. References to <pipeline>.options will not be supported
    self._expansion_service, pipeline.options)

apache_beam/io/gcp/bigquery_read_it_test.py::ReadNewTypesTests::test_native_source
  <https://ci-beam.apache.org/job/beam_PostCommit_Python310/ws/src/sdks/python/apache_beam/io/gcp/bigquery_read_it_test.py>:693: BeamDeprecationWarning: BigQuerySource is deprecated since 2.25.0. Use ReadFromBigQuery instead.
    beam.io.BigQuerySource(query=self.query, use_standard_sql=True)))

apache_beam/io/gcp/bigquery_read_it_test.py::ReadAllBQTests::test_read_queries
  <https://ci-beam.apache.org/job/beam_PostCommit_Python310/ws/src/sdks/python/apache_beam/io/gcp/bigquery.py>:2894: BeamDeprecationWarning: options is deprecated since First stable release. References to <pipeline>.options will not be supported
    job_name = pcoll.pipeline.options.view_as(GoogleCloudOptions).job_name

apache_beam/io/gcp/bigquery_read_it_test.py::ReadAllBQTests::test_read_queries
  <https://ci-beam.apache.org/job/beam_PostCommit_Python310/ws/src/sdks/python/apache_beam/io/gcp/bigquery.py>:2895: BeamDeprecationWarning: options is deprecated since First stable release. References to <pipeline>.options will not be supported
    project = pcoll.pipeline.options.view_as(GoogleCloudOptions).project

apache_beam/io/gcp/bigquery_read_it_test.py::ReadAllBQTests::test_read_queries
  <https://ci-beam.apache.org/job/beam_PostCommit_Python310/ws/src/sdks/python/apache_beam/io/gcp/bigquery.py>:2908: BeamDeprecationWarning: options is deprecated since First stable release. References to <pipeline>.options will not be supported
    options=pcoll.pipeline.options,

-- Docs: https://docs.pytest.org/en/stable/how-to/capture-warnings.html
- generated xml file: <https://ci-beam.apache.org/job/beam_PostCommit_Python310/ws/src/sdks/python/pytest_postCommitIT-df-py310.xml> -
=========================== short test summary info ============================
FAILED apache_beam/examples/complete/juliaset/juliaset/juliaset_test_it.py::JuliaSetTestIT::test_run_example_with_setup_file - apache_beam.runners.dataflow.dataflow_runner.DataflowRuntimeException: Dataflow pipeline failed. State: FAILED, Error:
The Dataflow job appears to be stuck because no worker activity has been seen in the last 1h. Please check the worker logs in Stackdriver Logging. You can also get help with Cloud Dataflow at https://cloud.google.com/dataflow/support.
===== 1 failed, 78 passed, 42 skipped, 646 warnings in 8599.33s (2:23:19) ======

> Task :sdks:python:test-suites:dataflow:py310:postCommitIT FAILED

FAILURE: Build failed with an exception.

* Where:
Script '<https://ci-beam.apache.org/job/beam_PostCommit_Python310/ws/src/sdks/python/test-suites/dataflow/common.gradle'> line: 141

* What went wrong:
Execution failed for task ':sdks:python:test-suites:dataflow:py310:postCommitIT'.
> Process 'command 'sh'' finished with non-zero exit value 1

* Try:
> Run with --stacktrace option to get the stack trace.
> Run with --info or --debug option to get more log output.

* Get more help at https://help.gradle.org

Deprecated Gradle features were used in this build, making it incompatible with Gradle 8.0.

You can use '--warning-mode all' to show the individual deprecation warnings and determine if they come from your own scripts or plugins.

See https://docs.gradle.org/7.5.1/userguide/command_line_interface.html#sec:command_line_warnings

Execution optimizations have been disabled for 1 invalid unit(s) of work during this build to ensure correctness.
Please consult deprecation warnings for more details.

BUILD FAILED in 2h 29m 24s
209 actionable tasks: 144 executed, 59 from cache, 6 up-to-date

Publishing build scan...
https://ge.apache.org/s/jvrhhxiywfkbm

Build step 'Invoke Gradle script' changed build result to FAILURE
Build step 'Invoke Gradle script' marked build as failure

---------------------------------------------------------------------
To unsubscribe, e-mail: builds-unsubscribe@beam.apache.org
For additional commands, e-mail: builds-help@beam.apache.org