You are viewing a plain text version of this content. The canonical link for it is here.
Posted to builds@cassandra.apache.org by Apache Jenkins Server <je...@builds.apache.org> on 2022/07/28 03:36:50 UTC

Build complete: Cassandra-trunk #1248 [UNSTABLE] ea03af460511442e771ddd704d92568a63557686

-------------------------------------------------------------------------------
Build Cassandra-trunk #1248 Still Unstable
URL: https://ci-cassandra.apache.org/job/Cassandra-trunk/1248/
-------------------------------------------------------------------------------
Changes:
[Brandon Williams] Don't require an echo response in TpStatsTest

[Caleb Rackliffe] Remove usages of Path#toFile() in the snapshot apparatus


-------------------------------------------------------------------------------
Failed Tests:
5 tests failed.
FAILED:  dtest.jmx_test.TestJMX.test_compactionstats
FAILED:  junit.framework.TestSuite.org.apache.cassandra.distributed.test.CASMultiDCTest
FAILED:  org.apache.cassandra.distributed.test.CASTest.testSuccessfulWriteBeforeRangeMovement
FAILED:  org.apache.cassandra.distributed.test.CASTest.testIncompleteWriteFollowedBySuccessfulWriteWithStaleRingDuringRangeMovementFollowedByRead
FAILED:  org.apache.cassandra.distributed.test.CASTest.testConflictingWritesWithStaleRingInformation

-------------------------------------------------------------------------------
For complete test report and logs see https://nightlies.apache.org/cassandra/Cassandra-trunk/1248/