You are viewing a plain text version of this content. The canonical link for it is here.
Posted to builds@solr.apache.org by Apache Jenkins Server <je...@builds.apache.org> on 2025/10/14 18:32:54 UTC

[JENKINS] Solr » Solr-Lint-main - Build # 338 - Still Failing!

Build: https://ci-builds.apache.org/job/Solr/job/Solr-Lint-main/338/

No tests ran.

Build Log:
[...truncated 1224 lines...]
BUILD FAILED in 10m 4s
614 actionable tasks: 614 executed

Publishing build scan...
https://develocity.apache.org/s/nby3e5dqocxso

Build step 'Invoke Gradle script' changed build result to FAILURE
Build step 'Invoke Gradle script' marked build as failure
Email was triggered for: Failure - Any
Sending email for trigger: Failure - Any

[JENKINS] Solr » Solr-Lint-main - Build # 339 - Still Failing!

Posted by Apache Jenkins Server <je...@builds.apache.org>.
Build: https://ci-builds.apache.org/job/Solr/job/Solr-Lint-main/339/

No tests ran.

Build Log:
[...truncated 1150 lines...]
BUILD FAILED in 10m 42s
618 actionable tasks: 618 executed

Publishing build scan...
https://develocity.apache.org/s/crbfcnieedjhm

Build step 'Invoke Gradle script' changed build result to FAILURE
Build step 'Invoke Gradle script' marked build as failure
Email was triggered for: Failure - Any
Sending email for trigger: Failure - Any