You are viewing a plain text version of this content. The canonical link for it is here.
Posted to builds@mesos.apache.org by Apache Jenkins Server <je...@builds.apache.org> on 2017/04/16 12:53:27 UTC
Build failed in Jenkins: Mesos-Buildbot » autotools,clang,--verbose --enable-libevent --enable-ssl,GLOG_v=1 MESOS_VERBOSE=1,ubuntu:14.04,(docker||Hadoop)&&(!ubuntu-us1)&&(!ubuntu-eu2) #3494
See <https://builds.apache.org/job/Mesos-Buildbot/BUILDTOOL=autotools,COMPILER=clang,CONFIGURATION=--verbose%20--enable-libevent%20--enable-ssl,ENVIRONMENT=GLOG_v=1%20MESOS_VERBOSE=1,OS=ubuntu%3A14.04,label_exp=(docker%7C%7CHadoop)&&(!ubuntu-us1)&&(!ubuntu-eu2)/3494/display/redirect>
------------------------------------------
Started by upstream project "Mesos-Buildbot" build number 3494
originally caused by:
Started by an SCM change
[EnvInject] - Loading node environment variables.
Building remotely on H5 (Hadoop) in workspace <https://builds.apache.org/job/Mesos-Buildbot/BUILDTOOL=autotools,COMPILER=clang,CONFIGURATION=--verbose%20--enable-libevent%20--enable-ssl,ENVIRONMENT=GLOG_v=1%20MESOS_VERBOSE=1,OS=ubuntu%3A14.04,label_exp=(docker%7C%7CHadoop)&&(!ubuntu-us1)&&(!ubuntu-eu2)/ws/>
Wiping out workspace first.
Cloning the remote Git repository
Cloning repository https://git-wip-us.apache.org/repos/asf/mesos.git
> git init <https://builds.apache.org/job/Mesos-Buildbot/BUILDTOOL=autotools,COMPILER=clang,CONFIGURATION=--verbose%20--enable-libevent%20--enable-ssl,ENVIRONMENT=GLOG_v=1%20MESOS_VERBOSE=1,OS=ubuntu%3A14.04,label_exp=(docker%7C%7CHadoop)&&(!ubuntu-us1)&&(!ubuntu-eu2)/ws/> # timeout=10
Fetching upstream changes from https://git-wip-us.apache.org/repos/asf/mesos.git
> git --version # timeout=10
> git fetch --tags --progress https://git-wip-us.apache.org/repos/asf/mesos.git +refs/heads/*:refs/remotes/origin/*
> git config remote.origin.url https://git-wip-us.apache.org/repos/asf/mesos.git # timeout=10
> git config --add remote.origin.fetch +refs/heads/*:refs/remotes/origin/* # timeout=10
> git config remote.origin.url https://git-wip-us.apache.org/repos/asf/mesos.git # timeout=10
Fetching upstream changes from https://git-wip-us.apache.org/repos/asf/mesos.git
> git fetch --tags --progress https://git-wip-us.apache.org/repos/asf/mesos.git +refs/heads/*:refs/remotes/origin/*
Checking out Revision c1703cdc376c1b8f064b2bc672f867bdeea96e14 (refs/tags/0.12.1-rc1)
> git config core.sparsecheckout # timeout=10
> git checkout -f c1703cdc376c1b8f064b2bc672f867bdeea96e14
First time build. Skipping changelog.
[3b5a1cbc] $ /bin/bash -xe /tmp/hudson67414121300771702.sh
+ '[' refs/tags/0.12.1-rc1 = origin/1.0.x ']'
+ ./support/jenkins/buildbot.sh
/tmp/hudson67414121300771702.sh: line 6: ./support/jenkins/buildbot.sh: No such file or directory
Build step 'Execute shell' marked build as failure
Jenkins build is back to normal : Mesos-Buildbot » autotools,clang,--verbose --enable-libevent --enable-ssl,GLOG_v=1 MESOS_VERBOSE=1,ubuntu:14.04,(docker||Hadoop)&&(!ubuntu-us1)&&(!ubuntu-eu2) #3521
Posted by Apache Jenkins Server <je...@builds.apache.org>.
See <https://builds.apache.org/job/Mesos-Buildbot/BUILDTOOL=autotools,COMPILER=clang,CONFIGURATION=--verbose%20--enable-libevent%20--enable-ssl,ENVIRONMENT=GLOG_v=1%20MESOS_VERBOSE=1,OS=ubuntu%3A14.04,label_exp=(docker%7C%7CHadoop)&&(!ubuntu-us1)&&(!ubuntu-eu2)/3521/display/redirect>
Build failed in Jenkins: Mesos-Buildbot » autotools,clang,--verbose --enable-libevent --enable-ssl,GLOG_v=1 MESOS_VERBOSE=1,ubuntu:14.04,(docker||Hadoop)&&(!ubuntu-us1)&&(!ubuntu-eu2) #3520
Posted by Apache Jenkins Server <je...@builds.apache.org>.
See <https://builds.apache.org/job/Mesos-Buildbot/BUILDTOOL=autotools,COMPILER=clang,CONFIGURATION=--verbose%20--enable-libevent%20--enable-ssl,ENVIRONMENT=GLOG_v=1%20MESOS_VERBOSE=1,OS=ubuntu%3A14.04,label_exp=(docker%7C%7CHadoop)&&(!ubuntu-us1)&&(!ubuntu-eu2)/3520/display/redirect?page=changes>
Changes:
[haosdent] Allowed whitelist additional devices in cgroups devices subsystem.
------------------------------------------
[...truncated 27.45 MB...]
I0417 04:52:41.696393 15888 master.cpp:1804] Recovered 0 agents from the registry (129B); allowing 10mins for agents to re-register
I0417 04:52:41.696460 15878 hierarchical.cpp:186] Skipping recovery of hierarchical allocator: nothing to recover
I0417 04:52:41.701921 31329 cluster.cpp:448] Creating default 'local' authorizer
I0417 04:52:41.703986 15885 slave.cpp:225] Mesos agent started on (724)@172.17.0.2:60786
I0417 04:52:41.704041 15885 slave.cpp:226] Flags at startup: --acls="" --appc_simple_discovery_uri_prefix="http://" --appc_store_dir="/tmp/mesos/store/appc" --authenticate_http_executors="true" --authenticate_http_readonly="true" --authenticate_http_readwrite="true" --authenticatee="crammd5" --authentication_backoff_factor="1secs" --authorizer="local" --cgroups_cpu_enable_pids_and_tids_count="false" --cgroups_enable_cfs="false" --cgroups_hierarchy="/sys/fs/cgroup" --cgroups_limit_swap="false" --cgroups_root="mesos" --container_disk_watch_interval="15secs" --containerizers="mesos" --credential="/tmp/ContentTypeAndSSLConfig_SchedulerSSLTest_RunTaskAndTeardown_0_8CxFja/credential" --default_role="*" --disk_watch_interval="1mins" --docker="docker" --docker_kill_orphans="true" --docker_registry="https://registry-1.docker.io" --docker_remove_delay="6hrs" --docker_socket="/var/run/docker.sock" --docker_stop_timeout="0ns" --docker_store_dir="/tmp/mesos/store/docker" --docker_volume_checkpoint_dir="/var/run/mesos/isolators/docker/volume" --enforce_container_disk_quota="false" --executor_registration_timeout="1mins" --executor_secret_key="/tmp/ContentTypeAndSSLConfig_SchedulerSSLTest_RunTaskAndTeardown_0_8CxFja/executor_secret_key" --executor_shutdown_grace_period="5secs" --fetcher_cache_dir="/tmp/ContentTypeAndSSLConfig_SchedulerSSLTest_RunTaskAndTeardown_0_8CxFja/fetch" --fetcher_cache_size="2GB" --frameworks_home="" --gc_delay="1weeks" --gc_disk_headroom="0.1" --hadoop_home="" --help="false" --hostname_lookup="true" --http_command_executor="false" --http_credentials="/tmp/ContentTypeAndSSLConfig_SchedulerSSLTest_RunTaskAndTeardown_0_8CxFja/http_credentials" --http_heartbeat_interval="30secs" --initialize_driver_logging="true" --isolation="posix/cpu,posix/mem" --launcher="posix" --launcher_dir="/mesos/mesos-1.3.0/_build/src" --logbufsecs="0" --logging_level="INFO" --max_completed_executors_per_framework="150" --oversubscribed_resources_interval="15secs" --perf_duration="10secs" --perf_interval="1mins" --port="5051" --qos_correction_interval_min="0ns" --quiet="false" --recover="reconnect" --recovery_timeout="15mins" --registration_backoff_factor="10ms" --resources="cpus:2;gpus:0;mem:1024;disk:1024;ports:[31000-32000]" --revocable_cpu_low_priority="true" --runtime_dir="/tmp/ContentTypeAndSSLConfig_SchedulerSSLTest_RunTaskAndTeardown_0_8CxFja" --sandbox_directory="/mnt/mesos/sandbox" --strict="true" --switch_user="true" --systemd_enable_support="true" --systemd_runtime_directory="/run/systemd/system" --version="false" --work_dir="/tmp/ContentTypeAndSSLConfig_SchedulerSSLTest_RunTaskAndTeardown_0_VfwfyQ"
I0417 04:52:41.704504 15885 credentials.hpp:86] Loading credential for authentication from '/tmp/ContentTypeAndSSLConfig_SchedulerSSLTest_RunTaskAndTeardown_0_8CxFja/credential'
I0417 04:52:41.704640 31329 scheduler.cpp:184] Version: 1.3.0
I0417 04:52:41.704690 15885 slave.cpp:258] Agent using credential for: test-principal
I0417 04:52:41.704725 15885 credentials.hpp:37] Loading credentials for authentication from '/tmp/ContentTypeAndSSLConfig_SchedulerSSLTest_RunTaskAndTeardown_0_8CxFja/http_credentials'
I0417 04:52:41.705238 15885 http.cpp:975] Creating default 'basic' HTTP authenticator for realm 'mesos-agent-executor'
I0417 04:52:41.705344 15884 scheduler.cpp:470] New master detected at master@172.17.0.2:60786
I0417 04:52:41.705371 15885 http.cpp:996] Creating default 'jwt' HTTP authenticator for realm 'mesos-agent-executor'
I0417 04:52:41.705651 15885 http.cpp:975] Creating default 'basic' HTTP authenticator for realm 'mesos-agent-readonly'
I0417 04:52:41.705766 15885 http.cpp:996] Creating default 'jwt' HTTP authenticator for realm 'mesos-agent-readonly'
I0417 04:52:41.706001 15885 http.cpp:975] Creating default 'basic' HTTP authenticator for realm 'mesos-agent-readwrite'
I0417 04:52:41.706115 15885 http.cpp:996] Creating default 'jwt' HTTP authenticator for realm 'mesos-agent-readwrite'
I0417 04:52:41.707729 15884 scheduler.cpp:479] Waiting for 0ns before initiating a re-(connection) attempt with the master
I0417 04:52:41.707754 15885 slave.cpp:525] Agent resources: cpus(*):2; mem(*):1024; disk(*):1024; ports(*):[31000-32000]
I0417 04:52:41.707857 15885 slave.cpp:533] Agent attributes: [ ]
I0417 04:52:41.707873 15885 slave.cpp:538] Agent hostname: b950f7335236
I0417 04:52:41.708046 15881 status_update_manager.cpp:177] Pausing sending status updates
I0417 04:52:41.709573 15889 state.cpp:62] Recovering state from '/tmp/ContentTypeAndSSLConfig_SchedulerSSLTest_RunTaskAndTeardown_0_VfwfyQ/meta'
I0417 04:52:41.709823 15882 status_update_manager.cpp:203] Recovering status update manager
I0417 04:52:41.710206 15893 slave.cpp:5963] Finished recovery
I0417 04:52:41.710629 15893 slave.cpp:6145] Querying resource estimator for oversubscribable resources
I0417 04:52:41.710819 15884 status_update_manager.cpp:177] Pausing sending status updates
I0417 04:52:41.710824 15893 slave.cpp:918] New master detected at master@172.17.0.2:60786
I0417 04:52:41.710918 15893 slave.cpp:953] Detecting new master
I0417 04:52:41.711041 15893 slave.cpp:6159] Received oversubscribable resources {} from the resource estimator
I0417 04:52:41.725327 15881 slave.cpp:980] Authenticating with master master@172.17.0.2:60786
I0417 04:52:41.725395 15881 slave.cpp:991] Using default CRAM-MD5 authenticatee
I0417 04:52:41.725636 15888 authenticatee.cpp:121] Creating new client SASL connection
I0417 04:52:41.725981 15878 master.cpp:7269] Authenticating slave(724)@172.17.0.2:60786
I0417 04:52:41.726140 15878 authenticator.cpp:414] Starting authentication session for crammd5-authenticatee(1347)@172.17.0.2:60786
I0417 04:52:41.726274 15891 scheduler.cpp:361] Connected with the master at https://172.17.0.2:60786/master/api/v1/scheduler
I0417 04:52:41.726501 15878 authenticator.cpp:98] Creating new server SASL connection
I0417 04:52:41.726732 15878 authenticatee.cpp:213] Received SASL authentication mechanisms: CRAM-MD5
I0417 04:52:41.726761 15878 authenticatee.cpp:239] Attempting to authenticate with mechanism 'CRAM-MD5'
I0417 04:52:41.726991 15878 authenticator.cpp:204] Received SASL authentication start
I0417 04:52:41.727054 15878 authenticator.cpp:326] Authentication requires more steps
I0417 04:52:41.727151 15878 authenticatee.cpp:259] Received SASL authentication step
I0417 04:52:41.727329 15880 authenticator.cpp:232] Received SASL authentication step
I0417 04:52:41.727362 15880 auxprop.cpp:109] Request to lookup properties for user: 'test-principal' realm: 'b950f7335236' server FQDN: 'b950f7335236' SASL_AUXPROP_VERIFY_AGAINST_HASH: false SASL_AUXPROP_OVERRIDE: false SASL_AUXPROP_AUTHZID: false
I0417 04:52:41.727385 15880 auxprop.cpp:181] Looking up auxiliary property '*userPassword'
I0417 04:52:41.727422 15880 auxprop.cpp:181] Looking up auxiliary property '*cmusaslsecretCRAM-MD5'
I0417 04:52:41.727442 15880 auxprop.cpp:109] Request to lookup properties for user: 'test-principal' realm: 'b950f7335236' server FQDN: 'b950f7335236' SASL_AUXPROP_VERIFY_AGAINST_HASH: false SASL_AUXPROP_OVERRIDE: false SASL_AUXPROP_AUTHZID: true
I0417 04:52:41.727453 15880 auxprop.cpp:131] Skipping auxiliary property '*userPassword' since SASL_AUXPROP_AUTHZID == true
I0417 04:52:41.727460 15880 auxprop.cpp:131] Skipping auxiliary property '*cmusaslsecretCRAM-MD5' since SASL_AUXPROP_AUTHZID == true
I0417 04:52:41.727473 15880 authenticator.cpp:318] Authentication success
I0417 04:52:41.727445 15879 scheduler.cpp:243] Sending SUBSCRIBE call to https://172.17.0.2:60786/master/api/v1/scheduler
I0417 04:52:41.727635 15892 authenticatee.cpp:299] Authentication success
I0417 04:52:41.727761 15887 authenticator.cpp:432] Authentication session cleanup for crammd5-authenticatee(1347)@172.17.0.2:60786
I0417 04:52:41.727902 15880 slave.cpp:1075] Successfully authenticated with master master@172.17.0.2:60786
I0417 04:52:41.727924 15893 master.cpp:7299] Successfully authenticated principal 'test-principal' at slave(724)@172.17.0.2:60786
I0417 04:52:41.728080 15880 slave.cpp:1503] Will retry registration in 14.977017ms if necessary
I0417 04:52:41.728281 15888 master.cpp:5454] Registering agent at slave(724)@172.17.0.2:60786 (b950f7335236) with id cae5ae65-7379-4dd4-b2dc-22f5fa3354a0-S0
I0417 04:52:41.728567 15888 process.cpp:3722] Handling HTTP event for process 'master' with path: '/master/api/v1/scheduler'
I0417 04:52:41.728595 15891 registrar.cpp:463] Applied 1 operations in 59989ns; attempting to update the registry
I0417 04:52:41.731359 15891 registrar.cpp:508] Successfully updated the registry in 2.701056ms
I0417 04:52:41.732007 15885 slave.cpp:4745] Received ping from slave-observer(658)@172.17.0.2:60786
I0417 04:52:41.732101 15879 master.cpp:5528] Registered agent cae5ae65-7379-4dd4-b2dc-22f5fa3354a0-S0 at slave(724)@172.17.0.2:60786 (b950f7335236) with cpus(*):2; mem(*):1024; disk(*):1024; ports(*):[31000-32000]
I0417 04:52:41.732219 15885 slave.cpp:1121] Registered with master master@172.17.0.2:60786; given agent ID cae5ae65-7379-4dd4-b2dc-22f5fa3354a0-S0
I0417 04:52:41.732244 15885 fetcher.cpp:94] Clearing fetcher cache
I0417 04:52:41.732381 15882 status_update_manager.cpp:184] Resuming sending status updates
I0417 04:52:41.732494 15883 hierarchical.cpp:527] Added agent cae5ae65-7379-4dd4-b2dc-22f5fa3354a0-S0 (b950f7335236) with cpus(*):2; mem(*):1024; disk(*):1024; ports(*):[31000-32000] (allocated: {})
I0417 04:52:41.732584 15885 slave.cpp:1149] Checkpointing SlaveInfo to '/tmp/ContentTypeAndSSLConfig_SchedulerSSLTest_RunTaskAndTeardown_0_VfwfyQ/meta/slaves/cae5ae65-7379-4dd4-b2dc-22f5fa3354a0-S0/slave.info'
I0417 04:52:41.732702 15883 hierarchical.cpp:1862] No allocations performed
I0417 04:52:41.732759 15883 hierarchical.cpp:1446] Performed allocation for 1 agents in 168527ns
I0417 04:52:41.732928 15885 slave.cpp:1187] Forwarding total oversubscribed resources {}
I0417 04:52:41.733094 15888 master.cpp:6115] Received update of agent cae5ae65-7379-4dd4-b2dc-22f5fa3354a0-S0 at slave(724)@172.17.0.2:60786 (b950f7335236) with total oversubscribed resources {}
I0417 04:52:41.766196 15881 http.cpp:1115] HTTP POST for /master/api/v1/scheduler from 172.17.0.2:56756
I0417 04:52:41.767741 15881 master.cpp:2518] Received subscription request for HTTP framework 'default'
I0417 04:52:41.767768 15881 master.cpp:2202] Authorizing framework principal 'test-principal' to receive offers for roles '{ * }'
I0417 04:52:41.768402 15881 master.cpp:2633] Subscribing framework 'default' with checkpointing disabled and capabilities [ ]
I0417 04:52:41.769124 15882 master.hpp:2167] Sending heartbeat to cae5ae65-7379-4dd4-b2dc-22f5fa3354a0-0000
I0417 04:52:41.769325 15893 hierarchical.cpp:271] Added framework cae5ae65-7379-4dd4-b2dc-22f5fa3354a0-0000
I0417 04:52:41.770246 15893 hierarchical.cpp:1952] No inverse offers to send out!
I0417 04:52:41.770288 15893 hierarchical.cpp:1446] Performed allocation for 1 agents in 891869ns
I0417 04:52:41.770967 15890 master.cpp:7098] Sending 1 offers to framework cae5ae65-7379-4dd4-b2dc-22f5fa3354a0-0000 (default)
I0417 04:52:41.806203 15892 scheduler.cpp:676] Enqueuing event SUBSCRIBED received from https://172.17.0.2:60786/master/api/v1/scheduler
I0417 04:52:41.806794 15892 scheduler.cpp:676] Enqueuing event HEARTBEAT received from https://172.17.0.2:60786/master/api/v1/scheduler
I0417 04:52:41.807749 15892 scheduler.cpp:676] Enqueuing event OFFERS received from https://172.17.0.2:60786/master/api/v1/scheduler
I0417 04:52:41.810137 15891 scheduler.cpp:243] Sending ACCEPT call to https://172.17.0.2:60786/master/api/v1/scheduler
I0417 04:52:41.811219 15880 process.cpp:3722] Handling HTTP event for process 'master' with path: '/master/api/v1/scheduler'
I0417 04:52:41.850076 15891 http.cpp:1115] HTTP POST for /master/api/v1/scheduler from 172.17.0.2:56757
I0417 04:52:41.850857 15891 master.cpp:3856] Processing ACCEPT call for offers: [ cae5ae65-7379-4dd4-b2dc-22f5fa3354a0-O0 ] on agent cae5ae65-7379-4dd4-b2dc-22f5fa3354a0-S0 at slave(724)@172.17.0.2:60786 (b950f7335236) for framework cae5ae65-7379-4dd4-b2dc-22f5fa3354a0-0000 (default)
I0417 04:52:41.850940 15891 master.cpp:3432] Authorizing framework principal 'test-principal' to launch task 8f092844-a825-4f9e-98e7-bea8ac82e704
W0417 04:52:41.853904 15891 validation.cpp:1113] Executor 'default' for task '8f092844-a825-4f9e-98e7-bea8ac82e704' uses less CPUs (None) than the minimum required (0.01). Please update your executor, as this will be mandatory in future releases.
W0417 04:52:41.853945 15891 validation.cpp:1125] Executor 'default' for task '8f092844-a825-4f9e-98e7-bea8ac82e704' uses less memory (None) than the minimum required (32MB). Please update your executor, as this will be mandatory in future releases.
I0417 04:52:41.854665 15891 master.cpp:9114] Adding task 8f092844-a825-4f9e-98e7-bea8ac82e704 with resources cpus(*)(allocated: *):2; mem(*)(allocated: *):1024; disk(*)(allocated: *):1024; ports(*)(allocated: *):[31000-32000] on agent cae5ae65-7379-4dd4-b2dc-22f5fa3354a0-S0 at slave(724)@172.17.0.2:60786 (b950f7335236)
I0417 04:52:41.855175 15891 master.cpp:4506] Launching task 8f092844-a825-4f9e-98e7-bea8ac82e704 of framework cae5ae65-7379-4dd4-b2dc-22f5fa3354a0-0000 (default) with resources cpus(*)(allocated: *):2; mem(*)(allocated: *):1024; disk(*)(allocated: *):1024; ports(*)(allocated: *):[31000-32000] on agent cae5ae65-7379-4dd4-b2dc-22f5fa3354a0-S0 at slave(724)@172.17.0.2:60786 (b950f7335236)
I0417 04:52:41.855840 15883 slave.cpp:1613] Got assigned task '8f092844-a825-4f9e-98e7-bea8ac82e704' for framework cae5ae65-7379-4dd4-b2dc-22f5fa3354a0-0000
I0417 04:52:41.856693 15883 slave.cpp:1894] Authorizing task '8f092844-a825-4f9e-98e7-bea8ac82e704' for framework cae5ae65-7379-4dd4-b2dc-22f5fa3354a0-0000
I0417 04:52:41.856786 15883 slave.cpp:6582] Authorizing framework principal 'test-principal' to launch task 8f092844-a825-4f9e-98e7-bea8ac82e704
I0417 04:52:41.858139 15884 slave.cpp:2081] Launching task '8f092844-a825-4f9e-98e7-bea8ac82e704' for framework cae5ae65-7379-4dd4-b2dc-22f5fa3354a0-0000
I0417 04:52:41.858817 15890 hierarchical.cpp:852] Updated allocation of framework cae5ae65-7379-4dd4-b2dc-22f5fa3354a0-0000 on agent cae5ae65-7379-4dd4-b2dc-22f5fa3354a0-S0 from cpus(*)(allocated: *):2; mem(*)(allocated: *):1024; disk(*)(allocated: *):1024; ports(*)(allocated: *):[31000-32000] to cpus(*)(allocated: *):2; mem(*)(allocated: *):1024; disk(*)(allocated: *):1024; ports(*)(allocated: *):[31000-32000]
I0417 04:52:41.858858 15884 paths.cpp:556] Trying to chown '/tmp/ContentTypeAndSSLConfig_SchedulerSSLTest_RunTaskAndTeardown_0_VfwfyQ/slaves/cae5ae65-7379-4dd4-b2dc-22f5fa3354a0-S0/frameworks/cae5ae65-7379-4dd4-b2dc-22f5fa3354a0-0000/executors/default/runs/7ebc1122-3493-4817-863f-c504a2f75ae1' to user 'mesos'
I0417 04:52:41.859175 15884 slave.cpp:6926] Launching executor 'default' of framework cae5ae65-7379-4dd4-b2dc-22f5fa3354a0-0000 with resources {} in work directory '/tmp/ContentTypeAndSSLConfig_SchedulerSSLTest_RunTaskAndTeardown_0_VfwfyQ/slaves/cae5ae65-7379-4dd4-b2dc-22f5fa3354a0-S0/frameworks/cae5ae65-7379-4dd4-b2dc-22f5fa3354a0-0000/executors/default/runs/7ebc1122-3493-4817-863f-c504a2f75ae1'
I0417 04:52:41.860088 15884 slave.cpp:2310] Queued task '8f092844-a825-4f9e-98e7-bea8ac82e704' for executor 'default' of framework cae5ae65-7379-4dd4-b2dc-22f5fa3354a0-0000
I0417 04:52:41.860183 15884 slave.cpp:871] Successfully attached file '/tmp/ContentTypeAndSSLConfig_SchedulerSSLTest_RunTaskAndTeardown_0_VfwfyQ/slaves/cae5ae65-7379-4dd4-b2dc-22f5fa3354a0-S0/frameworks/cae5ae65-7379-4dd4-b2dc-22f5fa3354a0-0000/executors/default/runs/7ebc1122-3493-4817-863f-c504a2f75ae1'
I0417 04:52:41.863283 15881 executor.cpp:192] Version: 1.3.0
I0417 04:52:41.885733 15878 executor.cpp:410] Connected with the agent
I0417 04:52:41.886284 15892 executor.cpp:307] Sending SUBSCRIBE call to https://172.17.0.2:60786/slave(724)/api/v1/executor
I0417 04:52:41.887198 15879 process.cpp:3722] Handling HTTP event for process 'slave(724)' with path: '/slave(724)/api/v1/executor'
I0417 04:52:41.927721 15893 http.cpp:1115] HTTP POST for /slave(724)/api/v1/executor from 172.17.0.2:56758
I0417 04:52:41.927963 15893 slave.cpp:3568] Received Subscribe request for HTTP executor 'default' of framework cae5ae65-7379-4dd4-b2dc-22f5fa3354a0-0000
I0417 04:52:41.929479 15893 slave.cpp:2523] Sending queued task '8f092844-a825-4f9e-98e7-bea8ac82e704' to executor 'default' of framework cae5ae65-7379-4dd4-b2dc-22f5fa3354a0-0000 (via HTTP)
I0417 04:52:41.970662 15887 executor.cpp:725] Enqueuing event SUBSCRIBED received from https://172.17.0.2:60786/slave(724)/api/v1/executor
I0417 04:52:41.971905 15882 executor.cpp:725] Enqueuing event LAUNCH received from https://172.17.0.2:60786/slave(724)/api/v1/executor
I0417 04:52:41.973048 15886 executor.cpp:307] Sending UPDATE call to https://172.17.0.2:60786/slave(724)/api/v1/executor
I0417 04:52:41.974333 15883 process.cpp:3722] Handling HTTP event for process 'slave(724)' with path: '/slave(724)/api/v1/executor'
I0417 04:52:42.015367 15881 http.cpp:1115] HTTP POST for /slave(724)/api/v1/executor from 172.17.0.2:56759
I0417 04:52:42.015563 15881 slave.cpp:4215] Handling status update TASK_RUNNING (UUID: ec47d822-5881-42bc-bb29-145c8cc8b7f0) for task 8f092844-a825-4f9e-98e7-bea8ac82e704 of framework cae5ae65-7379-4dd4-b2dc-22f5fa3354a0-0000
I0417 04:52:42.016472 15883 status_update_manager.cpp:323] Received status update TASK_RUNNING (UUID: ec47d822-5881-42bc-bb29-145c8cc8b7f0) for task 8f092844-a825-4f9e-98e7-bea8ac82e704 of framework cae5ae65-7379-4dd4-b2dc-22f5fa3354a0-0000
I0417 04:52:42.016561 15883 status_update_manager.cpp:500] Creating StatusUpdate stream for task 8f092844-a825-4f9e-98e7-bea8ac82e704 of framework cae5ae65-7379-4dd4-b2dc-22f5fa3354a0-0000
I0417 04:52:42.017179 15883 status_update_manager.cpp:377] Forwarding update TASK_RUNNING (UUID: ec47d822-5881-42bc-bb29-145c8cc8b7f0) for task 8f092844-a825-4f9e-98e7-bea8ac82e704 of framework cae5ae65-7379-4dd4-b2dc-22f5fa3354a0-0000 to the agent
I0417 04:52:42.017575 15879 slave.cpp:4655] Forwarding the update TASK_RUNNING (UUID: ec47d822-5881-42bc-bb29-145c8cc8b7f0) for task 8f092844-a825-4f9e-98e7-bea8ac82e704 of framework cae5ae65-7379-4dd4-b2dc-22f5fa3354a0-0000 to master@172.17.0.2:60786
I0417 04:52:42.017854 15879 slave.cpp:4549] Status update manager successfully handled status update TASK_RUNNING (UUID: ec47d822-5881-42bc-bb29-145c8cc8b7f0) for task 8f092844-a825-4f9e-98e7-bea8ac82e704 of framework cae5ae65-7379-4dd4-b2dc-22f5fa3354a0-0000
I0417 04:52:42.018002 15891 master.cpp:6260] Status update TASK_RUNNING (UUID: ec47d822-5881-42bc-bb29-145c8cc8b7f0) for task 8f092844-a825-4f9e-98e7-bea8ac82e704 of framework cae5ae65-7379-4dd4-b2dc-22f5fa3354a0-0000 from agent cae5ae65-7379-4dd4-b2dc-22f5fa3354a0-S0 at slave(724)@172.17.0.2:60786 (b950f7335236)
I0417 04:52:42.018085 15891 master.cpp:6328] Forwarding status update TASK_RUNNING (UUID: ec47d822-5881-42bc-bb29-145c8cc8b7f0) for task 8f092844-a825-4f9e-98e7-bea8ac82e704 of framework cae5ae65-7379-4dd4-b2dc-22f5fa3354a0-0000
I0417 04:52:42.018555 15891 master.cpp:8362] Updating the state of task 8f092844-a825-4f9e-98e7-bea8ac82e704 of framework cae5ae65-7379-4dd4-b2dc-22f5fa3354a0-0000 (latest state: TASK_RUNNING, status update state: TASK_RUNNING)
I0417 04:52:42.018957 15884 executor.cpp:725] Enqueuing event ACKNOWLEDGED received from https://172.17.0.2:60786/slave(724)/api/v1/executor
I0417 04:52:42.020103 15893 scheduler.cpp:676] Enqueuing event UPDATE received from https://172.17.0.2:60786/master/api/v1/scheduler
I0417 04:52:42.021472 15889 scheduler.cpp:243] Sending TEARDOWN call to https://172.17.0.2:60786/master/api/v1/scheduler
I0417 04:52:42.022706 15884 process.cpp:3722] Handling HTTP event for process 'master' with path: '/master/api/v1/scheduler'
I0417 04:52:42.062048 15885 http.cpp:1115] HTTP POST for /master/api/v1/scheduler from 172.17.0.2:56757
I0417 04:52:42.062180 15885 master.cpp:7794] Removing framework cae5ae65-7379-4dd4-b2dc-22f5fa3354a0-0000 (default)
I0417 04:52:42.062288 15885 master.cpp:3165] Deactivating framework cae5ae65-7379-4dd4-b2dc-22f5fa3354a0-0000 (default)
I0417 04:52:42.062594 15889 hierarchical.cpp:376] Deactivated framework cae5ae65-7379-4dd4-b2dc-22f5fa3354a0-0000
I0417 04:52:42.062682 15891 slave.cpp:3057] Asked to shut down framework cae5ae65-7379-4dd4-b2dc-22f5fa3354a0-0000 by master@172.17.0.2:60786
I0417 04:52:42.062716 15885 master.cpp:8362] Updating the state of task 8f092844-a825-4f9e-98e7-bea8ac82e704 of framework cae5ae65-7379-4dd4-b2dc-22f5fa3354a0-0000 (latest state: TASK_KILLED, status update state: TASK_KILLED)
I0417 04:52:42.062777 15891 slave.cpp:3082] Shutting down framework cae5ae65-7379-4dd4-b2dc-22f5fa3354a0-0000
I0417 04:52:42.062846 15891 slave.cpp:5475] Shutting down executor 'default' of framework cae5ae65-7379-4dd4-b2dc-22f5fa3354a0-0000 (via HTTP)
I0417 04:52:42.063751 15882 executor.cpp:725] Enqueuing event SHUTDOWN received from https://172.17.0.2:60786/slave(724)/api/v1/executor
I0417 04:52:42.063742 15885 master.cpp:8456] Removing task 8f092844-a825-4f9e-98e7-bea8ac82e704 with resources cpus(*)(allocated: *):2; mem(*)(allocated: *):1024; disk(*)(allocated: *):1024; ports(*)(allocated: *):[31000-32000] of framework cae5ae65-7379-4dd4-b2dc-22f5fa3354a0-0000 on agent cae5ae65-7379-4dd4-b2dc-22f5fa3354a0-S0 at slave(724)@172.17.0.2:60786 (b950f7335236)
I0417 04:52:42.064214 15885 master.cpp:8485] Removing executor 'default' with resources {} of framework cae5ae65-7379-4dd4-b2dc-22f5fa3354a0-0000 on agent cae5ae65-7379-4dd4-b2dc-22f5fa3354a0-S0 at slave(724)@172.17.0.2:60786 (b950f7335236)
I0417 04:52:42.064262 15889 hierarchical.cpp:1116] Recovered cpus(*)(allocated: *):2; mem(*)(allocated: *):1024; disk(*)(allocated: *):1024; ports(*)(allocated: *):[31000-32000] (total: cpus(*):2; mem(*):1024; disk(*):1024; ports(*):[31000-32000], allocated: {}) on agent cae5ae65-7379-4dd4-b2dc-22f5fa3354a0-S0 from framework cae5ae65-7379-4dd4-b2dc-22f5fa3354a0-0000
I0417 04:52:42.065316 15887 hierarchical.cpp:323] Removed framework cae5ae65-7379-4dd4-b2dc-22f5fa3354a0-0000
E0417 04:52:42.065665 15884 scheduler.cpp:649] End-Of-File received from master. The master closed the event stream
I0417 04:52:42.066243 15888 scheduler.cpp:444] Re-detecting master
I0417 04:52:42.066923 15888 scheduler.cpp:395] Ignoring disconnection attempt from stale connection
I0417 04:52:42.067044 15888 scheduler.cpp:395] Ignoring disconnection attempt from stale connection
I0417 04:52:42.067262 15888 scheduler.cpp:470] New master detected at master@172.17.0.2:60786
I0417 04:52:42.069561 15888 scheduler.cpp:479] Waiting for 0ns before initiating a re-(connection) attempt with the master
I0417 04:52:42.071550 15882 slave.cpp:5161] Executor 'default' of framework cae5ae65-7379-4dd4-b2dc-22f5fa3354a0-0000 exited with status 0
I0417 04:52:42.071938 15882 slave.cpp:5261] Cleaning up executor 'default' of framework cae5ae65-7379-4dd4-b2dc-22f5fa3354a0-0000 (via HTTP)
W0417 04:52:42.072101 15890 master.cpp:6384] Ignoring unknown exited executor 'default' of framework cae5ae65-7379-4dd4-b2dc-22f5fa3354a0-0000 on agent cae5ae65-7379-4dd4-b2dc-22f5fa3354a0-S0 at slave(724)@172.17.0.2:60786 (b950f7335236)
I0417 04:52:42.072623 15882 slave.cpp:5349] Cleaning up framework cae5ae65-7379-4dd4-b2dc-22f5fa3354a0-0000
I0417 04:52:42.072703 15888 gc.cpp:55] Scheduling '/tmp/ContentTypeAndSSLConfig_SchedulerSSLTest_RunTaskAndTeardown_0_VfwfyQ/slaves/cae5ae65-7379-4dd4-b2dc-22f5fa3354a0-S0/frameworks/cae5ae65-7379-4dd4-b2dc-22f5fa3354a0-0000/executors/default/runs/7ebc1122-3493-4817-863f-c504a2f75ae1' for gc 6.99999916320593days in the future
I0417 04:52:42.072815 15880 status_update_manager.cpp:285] Closing status update streams for framework cae5ae65-7379-4dd4-b2dc-22f5fa3354a0-0000
I0417 04:52:42.072859 15888 gc.cpp:55] Scheduling '/tmp/ContentTypeAndSSLConfig_SchedulerSSLTest_RunTaskAndTeardown_0_VfwfyQ/slaves/cae5ae65-7379-4dd4-b2dc-22f5fa3354a0-S0/frameworks/cae5ae65-7379-4dd4-b2dc-22f5fa3354a0-0000/executors/default' for gc 6.99999916019556days in the future
I0417 04:52:42.072926 15880 status_update_manager.cpp:531] Cleaning up status update stream for task 8f092844-a825-4f9e-98e7-bea8ac82e704 of framework cae5ae65-7379-4dd4-b2dc-22f5fa3354a0-0000
I0417 04:52:42.072983 15882 slave.cpp:790] Agent terminating
I0417 04:52:42.073055 15888 gc.cpp:55] Scheduling '/tmp/ContentTypeAndSSLConfig_SchedulerSSLTest_RunTaskAndTeardown_0_VfwfyQ/slaves/cae5ae65-7379-4dd4-b2dc-22f5fa3354a0-S0/frameworks/cae5ae65-7379-4dd4-b2dc-22f5fa3354a0-0000' for gc 6.99999915682963days in the future
I0417 04:52:42.073263 15883 master.cpp:1318] Agent cae5ae65-7379-4dd4-b2dc-22f5fa3354a0-S0 at slave(724)@172.17.0.2:60786 (b950f7335236) disconnected
I0417 04:52:42.073365 15883 master.cpp:3202] Disconnecting agent cae5ae65-7379-4dd4-b2dc-22f5fa3354a0-S0 at slave(724)@172.17.0.2:60786 (b950f7335236)
I0417 04:52:42.073501 15883 master.cpp:3221] Deactivating agent cae5ae65-7379-4dd4-b2dc-22f5fa3354a0-S0 at slave(724)@172.17.0.2:60786 (b950f7335236)
I0417 04:52:42.073673 15892 hierarchical.cpp:655] Agent cae5ae65-7379-4dd4-b2dc-22f5fa3354a0-S0 deactivated
I0417 04:52:42.076892 31329 master.cpp:1157] Master terminating
I0417 04:52:42.077813 15885 hierarchical.cpp:560] Removed agent cae5ae65-7379-4dd4-b2dc-22f5fa3354a0-S0
W0417 04:52:42.079541 31329 master.hpp:2650] Failed to close HTTP pipe for cae5ae65-7379-4dd4-b2dc-22f5fa3354a0-0000 (default)
[ OK ] ContentTypeAndSSLConfig/SchedulerSSLTest.RunTaskAndTeardown/0 (613 ms)
[ RUN ] ContentTypeAndSSLConfig/SchedulerSSLTest.RunTaskAndTeardown/1
*** Aborted at 1492404762 (unix time) try "date -d @1492404762" if you are using GNU date ***
PC: @ 0x2b3ea765d64e (unknown)
*** SIGSEGV (@0x567d3ed89f08) received by PID 31329 (TID 0x2b3eb06ec700) from PID 1054383880; stack trace: ***
I0417 04:52:42.092703 31329 process.cpp:1264] libprocess is initialized on 172.17.0.2:56900 with 16 worker threads
@ 0x2b3ef94012d7 (unknown)
I0417 04:52:42.094830 31329 cluster.cpp:162] Creating default 'local' authorizer
@ 0x2b3ef94055b9 (unknown)
@ 0x2b3ea73b5330 (unknown)
@ 0x2b3ea765d64e (unknown)
@ 0x2b3ea6c3fe30 (unknown)
@ 0x2b3ea6c4048c (unknown)
I0417 04:52:42.097820 15910 master.cpp:438] Master a9b407ac-5c4d-45a6-87fa-1a3b3b346811 (b950f7335236) started on 172.17.0.2:56900
I0417 04:52:42.097889 15910 master.cpp:440] Flags at startup: --acls="" --agent_ping_timeout="15secs" --agent_reregister_timeout="10mins" --allocation_interval="1secs" --allocator="HierarchicalDRF" --authenticate_agents="true" --authenticate_frameworks="true" --authenticate_http_frameworks="true" --authenticate_http_readonly="true" --authenticate_http_readwrite="true" --authenticators="crammd5" --authorizers="local" --credentials="/tmp/VV8dK8/credentials" --framework_sorter="drf" --help="false" --hostname_lookup="true" --http_authenticators="basic" --http_framework_authenticators="basic" --initialize_driver_logging="true" --log_auto_initialize="true" --logbufsecs="0" --logging_level="INFO" --max_agent_ping_timeouts="5" --max_completed_frameworks="50" --max_completed_tasks_per_framework="1000" --max_unreachable_tasks_per_framework="1000" --port="5050" --quiet="false" --recovery_agent_removal_limit="100%" --registry="in_memory" --registry_fetch_timeout="1mins" --registry_gc_interval="15mins" --registry_max_agent_age="2weeks" --registry_max_agent_count="102400" --registry_store_timeout="100secs" --registry_strict="false" --root_submissions="true" --user_sorter="drf" --version="false" --webui_dir="/mesos/mesos-1.3.0/_inst/share/mesos/webui" --work_dir="/tmp/VV8dK8/master" --zk_session_timeout="10secs"
I0417 04:52:42.098273 15910 master.cpp:490] Master only allowing authenticated frameworks to register
I0417 04:52:42.098296 15910 master.cpp:504] Master only allowing authenticated agents to register
I0417 04:52:42.098316 15910 master.cpp:517] Master only allowing authenticated HTTP frameworks to register
I0417 04:52:42.098337 15910 credentials.hpp:37] Loading credentials for authentication from '/tmp/VV8dK8/credentials'
I0417 04:52:42.098639 15910 master.cpp:562] Using default 'crammd5' authenticator
I0417 04:52:42.098793 15910 http.cpp:975] Creating default 'basic' HTTP authenticator for realm 'mesos-master-readonly'
I0417 04:52:42.098969 15910 http.cpp:975] Creating default 'basic' HTTP authenticator for realm 'mesos-master-readwrite'
I0417 04:52:42.099164 15910 http.cpp:975] Creating default 'basic' HTTP authenticator for realm 'mesos-master-scheduler'
I0417 04:52:42.099345 15910 master.cpp:642] Authorization enabled
I0417 04:52:42.099521 15898 hierarchical.cpp:159] Initialized hierarchical allocator process
I0417 04:52:42.099551 15899 whitelist_watcher.cpp:77] No whitelist given
I0417 04:52:42.102149 15895 master.cpp:2166] Elected as the leading master!
I0417 04:52:42.102180 15895 master.cpp:1705] Recovering from registrar
I0417 04:52:42.102334 15903 registrar.cpp:331] Recovering registrar
I0417 04:52:42.105319 15903 registrar.cpp:364] Successfully fetched the registry (0B) in 2.870016ms
I0417 04:52:42.105429 15903 registrar.cpp:463] Applied 1 operations in 34413ns; attempting to update the registry
I0417 04:52:42.107686 15903 registrar.cpp:508] Successfully updated the registry in 2.19904ms
I0417 04:52:42.107807 15903 registrar.cpp:394] Successfully recovered registrar
I0417 04:52:42.108280 15900 master.cpp:1804] Recovered 0 agents from the registry (129B); allowing 10mins for agents to re-register
I0417 04:52:42.108319 15904 hierarchical.cpp:186] Skipping recovery of hierarchical allocator: nothing to recover
@ 0x2b3e9cd50e8f process::UPID::UPID()
@ 0x2b3ea4a0f6ae process::DispatchEvent::DispatchEvent()
@ 0x2b3ea49f9543 process::internal::dispatch()
@ 0x2b3ea4a0f16d process::dispatch<>()
@ 0x2b3ea49f8567 process::ProcessBase::route()
@ 0x2b3ea48b21ed process::ProcessBase::route<>()
@ 0x2b3ea48afb50 process::Help::initialize()
@ 0x2b3ea48afc02 process::Help::initialize()
@ 0x2b3ea49f3050 process::ProcessManager::resume()
@ 0x2b3ea4a019ac process::ProcessManager::init_threads()::$_2::operator()()
@ 0x2b3ea4a018b5 _ZNSt12_Bind_simpleIFZN7process14ProcessManager12init_threadsEvE3$_2vEE9_M_invokeIJEEEvSt12_Index_tupleIJXspT_EEE
@ 0x2b3ea4a01885 std::_Bind_simple<>::operator()()
@ 0x2b3ea4a0185c std::thread::_Impl<>::_M_run()
@ 0x2b3ea6c36a60 (unknown)
@ 0x2b3ea73ad184 start_thread
@ 0x2b3ea76c0bed (unknown)
make[4]: *** [check-local] Segmentation fault
make[4]: Leaving directory `/mesos/mesos-1.3.0/_build/src'
make[3]: *** [check-am] Error 2
make[3]: Leaving directory `/mesos/mesos-1.3.0/_build/src'
make[2]: *** [check] Error 2
make[2]: Leaving directory `/mesos/mesos-1.3.0/_build/src'
make[1]: *** [check-recursive] Error 1
make[1]: Leaving directory `/mesos/mesos-1.3.0/_build'
make: *** [distcheck] Error 1
+ docker rmi mesos-1492401629-12254
Untagged: mesos-1492401629-12254:latest
Deleted: sha256:b8c847813b544b5e9a7184bd56b3b5677a4acf33fb7f86101fcda22eb60c3966
Deleted: sha256:ef2b68deba3008793b2e98e007b46c02c93fa281c0c4ec22c35acdbcbd6b3624
Deleted: sha256:bf0c669bf454bbf197b1c3c288465d2e3082241a0afb01e03b19745e69707ba6
Deleted: sha256:27f79a40632bf93cea622e27f5f0f3dd4e6a8ba3de8afb6284acc4a417b41962
Deleted: sha256:d163efb8c5956d42b010b2816eda791d6393eeee0e08c87b2029b99166f4dc02
Deleted: sha256:84c690727def3466bc88519140eab93954a841f222bb4d1913c997d2733f1ccc
Deleted: sha256:f3b06b179ccb3f8149ed76cb3cc55549b89b1b852bb130f0036b419cdd71f56c
Deleted: sha256:fe46bcba9c0f0bdaaac2f81118448ee89ebaea7aa948ce902600e77083d60598
Deleted: sha256:a21705eecbaab5441b100d13e1ea5676657fc2e56d5c7d91e537f32db282538f
Deleted: sha256:00de1cbdfbe5ce3a99ab6b2959f6bb01848738b44e837f473518da9228bb5116
Deleted: sha256:dbe28cb3caf16c630821f54e0b879feaac15be98a561cb7628526405e6883641
Deleted: sha256:91e00feac6474b5ae907102190fd51e1afe5215d260c73a6a82951bf762f77ac
Deleted: sha256:bb597beea6595ded164e09583f6a6b2511112324f50503ccaf638d546a2d5da3
Deleted: sha256:175b2d185b741d7b1c8862dd08e2c35b0533c69bf7eb784895c597ac9d05e3ca
Deleted: sha256:a1456139e46382ffc063d480f1e19ce899d8674577e5ef0f744c8eff526400a5
Deleted: sha256:e54c2d8f32c2d82e223ee8358022fc717ab382e88125c029e2f0bf65c393492d
Deleted: sha256:317af650e94e9fa4fe50d6c5ac73a37340eea52fb91c5efac0e287c29e0575fc
Deleted: sha256:99989345a95d32a53296cb676e6477af27ee50e85eaa5b4bd470454eccb4c428
Deleted: sha256:80f213c7446018e5a94042c9f6e675830855ddbc4c46944e397f5989c5bf46e6
Deleted: sha256:7b61ccb408e1dac81383100c5080c117e4b5427725ac8b66fbbfc13c916d7a50
Deleted: sha256:00d9488fe03c985262d64ce481de31c695e5dabc72327d541a08bdaac1ca3266
Deleted: sha256:a2e98ec42ee151475dcfd0f381263a505dadc725eeef963a45517bf0dd96c1a4
Deleted: sha256:b8e371b6dd069c3ca1c4edaf1108f2b7423fa1e32d34da5f95b5f21720905ae2
Deleted: sha256:53f67520fc466759507b4ea46f0ae71cf19d8a3a5ee0be9dcc8b63c27d40caed
Build step 'Execute shell' marked build as failure
Not sending mail to unregistered user neil.conway@gmail.com
Build failed in Jenkins: Mesos-Buildbot » autotools,clang,--verbose --enable-libevent --enable-ssl,GLOG_v=1 MESOS_VERBOSE=1,ubuntu:14.04,(docker||Hadoop)&&(!ubuntu-us1)&&(!ubuntu-eu2) #3519
Posted by Apache Jenkins Server <je...@builds.apache.org>.
See <https://builds.apache.org/job/Mesos-Buildbot/BUILDTOOL=autotools,COMPILER=clang,CONFIGURATION=--verbose%20--enable-libevent%20--enable-ssl,ENVIRONMENT=GLOG_v=1%20MESOS_VERBOSE=1,OS=ubuntu%3A14.04,label_exp=(docker%7C%7CHadoop)&&(!ubuntu-us1)&&(!ubuntu-eu2)/3519/display/redirect?page=changes>
Changes:
[neil.conway] Cleaned up operator HTTP API docs slightly.
------------------------------------------
[...truncated 2.56 MB...]
I0416 20:36:39.773856 26403 ssl_tests.cpp:591] Testing server protocol 'LIBPROCESS_SSL_ENABLE_TLS_V1_1'
W0416 20:36:39.774305 26403 openssl.cpp:402] Failed SSL connections will be downgraded to a non-SSL socket
I0416 20:36:39.774318 26403 openssl.cpp:419] CA file path is unspecified! NOTE: Set CA file path with LIBPROCESS_SSL_CA_FILE=<filepath>
I0416 20:36:39.774323 26403 openssl.cpp:424] CA directory path unspecified! NOTE: Set CA directory path with LIBPROCESS_SSL_CA_DIR=<dirpath>
I0416 20:36:39.774327 26403 openssl.cpp:429] Will not verify peer certificate!
NOTE: Set LIBPROCESS_SSL_VERIFY_CERT=1 to enable peer certificate verification
I0416 20:36:39.774333 26403 openssl.cpp:435] Will only verify peer certificate if presented!
NOTE: Set LIBPROCESS_SSL_REQUIRE_CERT=1 to require peer certificate verification
I0416 20:36:39.874593 26403 ssl_tests.cpp:591] Testing server protocol 'LIBPROCESS_SSL_ENABLE_TLS_V1_2'
W0416 20:36:39.875190 26403 openssl.cpp:402] Failed SSL connections will be downgraded to a non-SSL socket
I0416 20:36:39.875207 26403 openssl.cpp:419] CA file path is unspecified! NOTE: Set CA file path with LIBPROCESS_SSL_CA_FILE=<filepath>
I0416 20:36:39.875216 26403 openssl.cpp:424] CA directory path unspecified! NOTE: Set CA directory path with LIBPROCESS_SSL_CA_DIR=<dirpath>
I0416 20:36:39.875224 26403 openssl.cpp:429] Will not verify peer certificate!
NOTE: Set LIBPROCESS_SSL_VERIFY_CERT=1 to enable peer certificate verification
I0416 20:36:39.875232 26403 openssl.cpp:435] Will only verify peer certificate if presented!
NOTE: Set LIBPROCESS_SSL_REQUIRE_CERT=1 to require peer certificate verification
[ OK ] SSLTest.ValidDowngradeEachProtocol (805 ms)
[ RUN ] SSLTest.NoValidDowngradeEachProtocol
I0416 20:36:40.561100 26403 ssl_tests.cpp:638] Testing server protocol 'LIBPROCESS_SSL_ENABLE_SSL_V3'
I0416 20:36:40.561512 26403 openssl.cpp:419] CA file path is unspecified! NOTE: Set CA file path with LIBPROCESS_SSL_CA_FILE=<filepath>
I0416 20:36:40.561527 26403 openssl.cpp:424] CA directory path unspecified! NOTE: Set CA directory path with LIBPROCESS_SSL_CA_DIR=<dirpath>
I0416 20:36:40.561532 26403 openssl.cpp:429] Will not verify peer certificate!
NOTE: Set LIBPROCESS_SSL_VERIFY_CERT=1 to enable peer certificate verification
I0416 20:36:40.561540 26403 openssl.cpp:435] Will only verify peer certificate if presented!
NOTE: Set LIBPROCESS_SSL_REQUIRE_CERT=1 to require peer certificate verification
I0416 20:36:40.573987 26420 libevent_ssl_socket.cpp:1170] Socket error: error:140760FC:SSL routines:SSL23_GET_CLIENT_HELLO:unknown protocol
I0416 20:36:40.578691 26403 ssl_tests.cpp:638] Testing server protocol 'LIBPROCESS_SSL_ENABLE_TLS_V1_0'
I0416 20:36:40.579282 26403 openssl.cpp:419] CA file path is unspecified! NOTE: Set CA file path with LIBPROCESS_SSL_CA_FILE=<filepath>
I0416 20:36:40.579300 26403 openssl.cpp:424] CA directory path unspecified! NOTE: Set CA directory path with LIBPROCESS_SSL_CA_DIR=<dirpath>
I0416 20:36:40.579308 26403 openssl.cpp:429] Will not verify peer certificate!
NOTE: Set LIBPROCESS_SSL_VERIFY_CERT=1 to enable peer certificate verification
I0416 20:36:40.579313 26403 openssl.cpp:435] Will only verify peer certificate if presented!
NOTE: Set LIBPROCESS_SSL_REQUIRE_CERT=1 to require peer certificate verification
I0416 20:36:40.592770 26420 libevent_ssl_socket.cpp:1170] Socket error: error:140760FC:SSL routines:SSL23_GET_CLIENT_HELLO:unknown protocol
I0416 20:36:40.679615 26403 ssl_tests.cpp:638] Testing server protocol 'LIBPROCESS_SSL_ENABLE_TLS_V1_1'
I0416 20:36:40.680197 26403 openssl.cpp:419] CA file path is unspecified! NOTE: Set CA file path with LIBPROCESS_SSL_CA_FILE=<filepath>
I0416 20:36:40.680217 26403 openssl.cpp:424] CA directory path unspecified! NOTE: Set CA directory path with LIBPROCESS_SSL_CA_DIR=<dirpath>
I0416 20:36:40.680223 26403 openssl.cpp:429] Will not verify peer certificate!
NOTE: Set LIBPROCESS_SSL_VERIFY_CERT=1 to enable peer certificate verification
I0416 20:36:40.680229 26403 openssl.cpp:435] Will only verify peer certificate if presented!
NOTE: Set LIBPROCESS_SSL_REQUIRE_CERT=1 to require peer certificate verification
I0416 20:36:40.693058 26420 libevent_ssl_socket.cpp:1170] Socket error: error:140760FC:SSL routines:SSL23_GET_CLIENT_HELLO:unknown protocol
I0416 20:36:40.780745 26403 ssl_tests.cpp:638] Testing server protocol 'LIBPROCESS_SSL_ENABLE_TLS_V1_2'
I0416 20:36:40.781220 26403 openssl.cpp:419] CA file path is unspecified! NOTE: Set CA file path with LIBPROCESS_SSL_CA_FILE=<filepath>
I0416 20:36:40.781236 26403 openssl.cpp:424] CA directory path unspecified! NOTE: Set CA directory path with LIBPROCESS_SSL_CA_DIR=<dirpath>
I0416 20:36:40.781244 26403 openssl.cpp:429] Will not verify peer certificate!
NOTE: Set LIBPROCESS_SSL_VERIFY_CERT=1 to enable peer certificate verification
I0416 20:36:40.781251 26403 openssl.cpp:435] Will only verify peer certificate if presented!
NOTE: Set LIBPROCESS_SSL_REQUIRE_CERT=1 to require peer certificate verification
I0416 20:36:40.790982 26420 libevent_ssl_socket.cpp:1170] Socket error: error:140760FC:SSL routines:SSL23_GET_CLIENT_HELLO:unknown protocol
[ OK ] SSLTest.NoValidDowngradeEachProtocol (905 ms)
[ RUN ] SSLTest.PeerAddress
I0416 20:36:41.322099 26403 openssl.cpp:419] CA file path is unspecified! NOTE: Set CA file path with LIBPROCESS_SSL_CA_FILE=<filepath>
I0416 20:36:41.322115 26403 openssl.cpp:424] CA directory path unspecified! NOTE: Set CA directory path with LIBPROCESS_SSL_CA_DIR=<dirpath>
I0416 20:36:41.322120 26403 openssl.cpp:429] Will not verify peer certificate!
NOTE: Set LIBPROCESS_SSL_VERIFY_CERT=1 to enable peer certificate verification
I0416 20:36:41.322124 26403 openssl.cpp:435] Will only verify peer certificate if presented!
NOTE: Set LIBPROCESS_SSL_REQUIRE_CERT=1 to require peer certificate verification
[ OK ] SSLTest.PeerAddress (446 ms)
[ RUN ] SSLTest.HTTPSGet
I0416 20:36:41.990634 26403 openssl.cpp:419] CA file path is unspecified! NOTE: Set CA file path with LIBPROCESS_SSL_CA_FILE=<filepath>
I0416 20:36:41.990653 26403 openssl.cpp:424] CA directory path unspecified! NOTE: Set CA directory path with LIBPROCESS_SSL_CA_DIR=<dirpath>
I0416 20:36:41.990658 26403 openssl.cpp:429] Will not verify peer certificate!
NOTE: Set LIBPROCESS_SSL_VERIFY_CERT=1 to enable peer certificate verification
I0416 20:36:41.990661 26403 openssl.cpp:435] Will only verify peer certificate if presented!
NOTE: Set LIBPROCESS_SSL_REQUIRE_CERT=1 to require peer certificate verification
[ OK ] SSLTest.HTTPSGet (669 ms)
[ RUN ] SSLTest.HTTPSPost
I0416 20:36:42.668895 26403 openssl.cpp:419] CA file path is unspecified! NOTE: Set CA file path with LIBPROCESS_SSL_CA_FILE=<filepath>
I0416 20:36:42.668918 26403 openssl.cpp:424] CA directory path unspecified! NOTE: Set CA directory path with LIBPROCESS_SSL_CA_DIR=<dirpath>
I0416 20:36:42.668923 26403 openssl.cpp:429] Will not verify peer certificate!
NOTE: Set LIBPROCESS_SSL_VERIFY_CERT=1 to enable peer certificate verification
I0416 20:36:42.668928 26403 openssl.cpp:435] Will only verify peer certificate if presented!
NOTE: Set LIBPROCESS_SSL_REQUIRE_CERT=1 to require peer certificate verification
[ OK ] SSLTest.HTTPSPost (679 ms)
[ RUN ] SSLTest.SilentSocket
I0416 20:36:42.837193 26403 openssl.cpp:419] CA file path is unspecified! NOTE: Set CA file path with LIBPROCESS_SSL_CA_FILE=<filepath>
I0416 20:36:42.837208 26403 openssl.cpp:424] CA directory path unspecified! NOTE: Set CA directory path with LIBPROCESS_SSL_CA_DIR=<dirpath>
I0416 20:36:42.837213 26403 openssl.cpp:429] Will not verify peer certificate!
NOTE: Set LIBPROCESS_SSL_VERIFY_CERT=1 to enable peer certificate verification
I0416 20:36:42.837218 26403 openssl.cpp:435] Will only verify peer certificate if presented!
NOTE: Set LIBPROCESS_SSL_REQUIRE_CERT=1 to require peer certificate verification
I0416 20:36:42.845299 26420 libevent_ssl_socket.cpp:1170] Socket error: error:00000000:lib(0):func(0):reason(0)
[ OK ] SSLTest.SilentSocket (170 ms)
[----------] 15 tests from SSLTest (9102 ms total)
[----------] 42 tests from Scheme/HTTPTest
[ RUN ] Scheme/HTTPTest.Endpoints/0
I0416 20:36:43.244519 26403 openssl.cpp:419] CA file path is unspecified! NOTE: Set CA file path with LIBPROCESS_SSL_CA_FILE=<filepath>
I0416 20:36:43.244535 26403 openssl.cpp:424] CA directory path unspecified! NOTE: Set CA directory path with LIBPROCESS_SSL_CA_DIR=<dirpath>
I0416 20:36:43.244540 26403 openssl.cpp:429] Will not verify peer certificate!
NOTE: Set LIBPROCESS_SSL_VERIFY_CERT=1 to enable peer certificate verification
I0416 20:36:43.244544 26403 openssl.cpp:435] Will only verify peer certificate if presented!
NOTE: Set LIBPROCESS_SSL_REQUIRE_CERT=1 to require peer certificate verification
I0416 20:36:43.250285 26403 process.cpp:1264] libprocess is initialized on 172.17.0.2:58733 with 16 worker threads
I0416 20:36:43.255545 27161 process.cpp:3722] Handling HTTP event for process '(77)' with path: '/(77)/body'
I0416 20:36:43.260876 27166 process.cpp:3722] Handling HTTP event for process '(77)' with path: '/(77)/pipe'
I0416 20:36:43.270006 27164 process.cpp:3722] Handling HTTP event for process '(77)' with path: '/(77)/body'
I0416 20:36:43.270359 27164 process.cpp:3779] Failed to process request for '/(77)/body': failure
I0416 20:36:43.270406 27164 process.cpp:1474] Returning '500 Internal Server Error' for '/(77)/body' (failure)
[ OK ] Scheme/HTTPTest.Endpoints/0 (426 ms)
[ RUN ] Scheme/HTTPTest.Endpoints/1
I0416 20:36:43.274348 26403 process.cpp:1264] libprocess is initialized on 172.17.0.2:50354 with 16 worker threads
I0416 20:36:43.275588 27178 process.cpp:3722] Handling HTTP event for process '(78)' with path: '/(78)/body'
I0416 20:36:43.277828 27179 process.cpp:3722] Handling HTTP event for process '(78)' with path: '/(78)/pipe'
I0416 20:36:43.280570 27181 process.cpp:3722] Handling HTTP event for process '(78)' with path: '/(78)/body'
I0416 20:36:43.281173 27187 process.cpp:3779] Failed to process request for '/(78)/body': failure
I0416 20:36:43.281208 27184 process.cpp:1474] Returning '500 Internal Server Error' for '/(78)/body' (failure)
I0416 20:36:43.282197 27193 process.cpp:838] Decode failure: Connection reset by peer
E0416 20:36:43.282244 27193 process.cpp:2444] Failed to shutdown socket with fd 9: Transport endpoint is not connected
[ OK ] Scheme/HTTPTest.Endpoints/1 (11 ms)
[ RUN ] Scheme/HTTPTest.EndpointsHelp/0
I0416 20:36:43.874081 26403 openssl.cpp:419] CA file path is unspecified! NOTE: Set CA file path with LIBPROCESS_SSL_CA_FILE=<filepath>
I0416 20:36:43.874099 26403 openssl.cpp:424] CA directory path unspecified! NOTE: Set CA directory path with LIBPROCESS_SSL_CA_DIR=<dirpath>
I0416 20:36:43.874107 26403 openssl.cpp:429] Will not verify peer certificate!
NOTE: Set LIBPROCESS_SSL_VERIFY_CERT=1 to enable peer certificate verification
I0416 20:36:43.874114 26403 openssl.cpp:435] Will only verify peer certificate if presented!
NOTE: Set LIBPROCESS_SSL_REQUIRE_CERT=1 to require peer certificate verification
I0416 20:36:43.876464 26403 process.cpp:1264] libprocess is initialized on 172.17.0.2:43431 with 16 worker threads
I0416 20:36:43.882202 27200 process.cpp:3722] Handling HTTP event for process 'help' with path: '/help'
I0416 20:36:43.887703 27205 process.cpp:3722] Handling HTTP event for process 'help' with path: '/help'
I0416 20:36:43.894050 27208 process.cpp:3722] Handling HTTP event for process 'help' with path: '/help/(79)/body'
I0416 20:36:43.899502 27196 process.cpp:3722] Handling HTTP event for process 'help' with path: '/help/(79)/a/b/c'
[ OK ] Scheme/HTTPTest.EndpointsHelp/0 (619 ms)
[ RUN ] Scheme/HTTPTest.EndpointsHelp/1
I0416 20:36:43.903306 26403 process.cpp:1264] libprocess is initialized on 172.17.0.2:54905 with 16 worker threads
I0416 20:36:43.904420 27221 process.cpp:3722] Handling HTTP event for process 'help' with path: '/help'
I0416 20:36:43.906183 27217 process.cpp:3722] Handling HTTP event for process 'help' with path: '/help'
I0416 20:36:43.908747 27225 process.cpp:3722] Handling HTTP event for process 'help' with path: '/help/(80)/body'
I0416 20:36:43.910400 27217 process.cpp:3722] Handling HTTP event for process 'help' with path: '/help/(80)/a/b/c'
[ OK ] Scheme/HTTPTest.EndpointsHelp/1 (10 ms)
[ RUN ] Scheme/HTTPTest.EndpointsHelpRemoval/0
I0416 20:36:44.579962 26403 openssl.cpp:419] CA file path is unspecified! NOTE: Set CA file path with LIBPROCESS_SSL_CA_FILE=<filepath>
I0416 20:36:44.579978 26403 openssl.cpp:424] CA directory path unspecified! NOTE: Set CA directory path with LIBPROCESS_SSL_CA_DIR=<dirpath>
I0416 20:36:44.579983 26403 openssl.cpp:429] Will not verify peer certificate!
NOTE: Set LIBPROCESS_SSL_VERIFY_CERT=1 to enable peer certificate verification
I0416 20:36:44.579988 26403 openssl.cpp:435] Will only verify peer certificate if presented!
NOTE: Set LIBPROCESS_SSL_REQUIRE_CERT=1 to require peer certificate verification
I0416 20:36:44.582211 26403 process.cpp:1264] libprocess is initialized on 172.17.0.2:37608 with 16 worker threads
I0416 20:36:44.587551 27233 process.cpp:3722] Handling HTTP event for process 'help' with path: '/help/(81)/body'
I0416 20:36:44.593901 27239 process.cpp:3722] Handling HTTP event for process 'help' with path: '/help/(81)/bogus'
[ OK ] Scheme/HTTPTest.EndpointsHelpRemoval/0 (684 ms)
[ RUN ] Scheme/HTTPTest.EndpointsHelpRemoval/1
I0416 20:36:44.598222 26403 process.cpp:1264] libprocess is initialized on 172.17.0.2:35391 with 16 worker threads
I0416 20:36:44.599485 27260 process.cpp:3722] Handling HTTP event for process 'help' with path: '/help/(82)/body'
I0416 20:36:44.601699 27255 process.cpp:3722] Handling HTTP event for process 'help' with path: '/help/(82)/bogus'
[ OK ] Scheme/HTTPTest.EndpointsHelpRemoval/1 (7 ms)
[ RUN ] Scheme/HTTPTest.PipeEOF/0
I0416 20:36:44.976614 26403 openssl.cpp:419] CA file path is unspecified! NOTE: Set CA file path with LIBPROCESS_SSL_CA_FILE=<filepath>
I0416 20:36:44.976630 26403 openssl.cpp:424] CA directory path unspecified! NOTE: Set CA directory path with LIBPROCESS_SSL_CA_DIR=<dirpath>
I0416 20:36:44.976635 26403 openssl.cpp:429] Will not verify peer certificate!
NOTE: Set LIBPROCESS_SSL_VERIFY_CERT=1 to enable peer certificate verification
I0416 20:36:44.976639 26403 openssl.cpp:435] Will only verify peer certificate if presented!
NOTE: Set LIBPROCESS_SSL_REQUIRE_CERT=1 to require peer certificate verification
I0416 20:36:44.982198 26403 process.cpp:1264] libprocess is initialized on 172.17.0.2:54634 with 16 worker threads
[ OK ] Scheme/HTTPTest.PipeEOF/0 (380 ms)
[ RUN ] Scheme/HTTPTest.PipeEOF/1
I0416 20:36:44.984817 26403 process.cpp:1264] libprocess is initialized on 172.17.0.2:46268 with 16 worker threads
[ OK ] Scheme/HTTPTest.PipeEOF/1 (3 ms)
[ RUN ] Scheme/HTTPTest.PipeFailure/0
I0416 20:36:45.445067 26403 openssl.cpp:419] CA file path is unspecified! NOTE: Set CA file path with LIBPROCESS_SSL_CA_FILE=<filepath>
I0416 20:36:45.445083 26403 openssl.cpp:424] CA directory path unspecified! NOTE: Set CA directory path with LIBPROCESS_SSL_CA_DIR=<dirpath>
I0416 20:36:45.445087 26403 openssl.cpp:429] Will not verify peer certificate!
NOTE: Set LIBPROCESS_SSL_VERIFY_CERT=1 to enable peer certificate verification
I0416 20:36:45.445091 26403 openssl.cpp:435] Will only verify peer certificate if presented!
NOTE: Set LIBPROCESS_SSL_REQUIRE_CERT=1 to require peer certificate verification
I0416 20:36:45.447163 26403 process.cpp:1264] libprocess is initialized on 172.17.0.2:44403 with 16 worker threads
[ OK ] Scheme/HTTPTest.PipeFailure/0 (462 ms)
[ RUN ] Scheme/HTTPTest.PipeFailure/1
I0416 20:36:45.449839 26403 process.cpp:1264] libprocess is initialized on 172.17.0.2:60489 with 16 worker threads
[ OK ] Scheme/HTTPTest.PipeFailure/1 (3 ms)
[ RUN ] Scheme/HTTPTest.PipeReaderCloses/0
I0416 20:36:45.908597 26403 openssl.cpp:419] CA file path is unspecified! NOTE: Set CA file path with LIBPROCESS_SSL_CA_FILE=<filepath>
I0416 20:36:45.908614 26403 openssl.cpp:424] CA directory path unspecified! NOTE: Set CA directory path with LIBPROCESS_SSL_CA_DIR=<dirpath>
I0416 20:36:45.908619 26403 openssl.cpp:429] Will not verify peer certificate!
NOTE: Set LIBPROCESS_SSL_VERIFY_CERT=1 to enable peer certificate verification
I0416 20:36:45.908623 26403 openssl.cpp:435] Will only verify peer certificate if presented!
NOTE: Set LIBPROCESS_SSL_REQUIRE_CERT=1 to require peer certificate verification
I0416 20:36:45.914701 26403 process.cpp:1264] libprocess is initialized on 172.17.0.2:42631 with 16 worker threads
[ OK ] Scheme/HTTPTest.PipeReaderCloses/0 (465 ms)
[ RUN ] Scheme/HTTPTest.PipeReaderCloses/1
*** Aborted at 1492375005 (unix time) try "date -d @1492375005" if you are using GNU date ***
PC: @ 0x2acba8b3ee62 (unknown)
*** SIGSEGV (@0x2acbd2e11458) received by PID 26403 (TID 0x2acbb09eb700) from PID 18446744072952550488; stack trace: ***
I0416 20:36:45.917645 26403 process.cpp:1264] libprocess is initialized on 172.17.0.2:37527 with 16 worker threads
@ 0x2acba6c90330 (unknown)
@ 0x2acba8b3ee62 (unknown)
@ 0x2acba8b3f48c (unknown)
[ OK ] Scheme/HTTPTest.PipeReaderCloses/1 (3 ms)
[ RUN ] Scheme/HTTPTest.Encode/0
@ 0x44393f process::UPID::UPID()
@ 0xa06a0e process::DispatchEvent::DispatchEvent()
@ 0x9f03d3 process::internal::dispatch()
@ 0xa064cd process::dispatch<>()
@ 0x9ef3f7 process::ProcessBase::route()
@ 0xb1592d process::ProcessBase::route<>()
@ 0xb13200 process::Help::initialize()
@ 0xb132b2 process::Help::initialize()
@ 0x9e9ee0 process::ProcessManager::resume()
@ 0x9f883c process::ProcessManager::init_threads()::$_2::operator()()
@ 0x9f8745 _ZNSt12_Bind_simpleIFZN7process14ProcessManager12init_threadsEvE3$_2vEE9_M_invokeIJEEEvSt12_Index_tupleIJXspT_EEE
@ 0x9f8715 std::_Bind_simple<>::operator()()
@ 0x9f86ec std::thread::_Impl<>::_M_run()
@ 0x2acba8b35a60 (unknown)
@ 0x2acba6c88184 start_thread
@ 0x2acba93a1bed (unknown)
make[7]: *** [check-local] Segmentation fault
make[7]: Leaving directory `/mesos/mesos-1.3.0/_build/3rdparty/libprocess'
make[6]: *** [check-am] Error 2
make[6]: Leaving directory `/mesos/mesos-1.3.0/_build/3rdparty/libprocess'
make[5]: *** [check-recursive] Error 1
make[5]: Leaving directory `/mesos/mesos-1.3.0/_build/3rdparty/libprocess'
make[4]: *** [check] Error 2
make[4]: Leaving directory `/mesos/mesos-1.3.0/_build/3rdparty/libprocess'
make[3]: *** [check-recursive] Error 1
make[3]: Leaving directory `/mesos/mesos-1.3.0/_build/3rdparty'
make[2]: *** [check] Error 2
make[2]: Leaving directory `/mesos/mesos-1.3.0/_build/3rdparty'
make[1]: *** [check-recursive] Error 1
make[1]: Leaving directory `/mesos/mesos-1.3.0/_build'
make: *** [distcheck] Error 1
+ docker rmi mesos-1492372978-7011
Untagged: mesos-1492372978-7011:latest
Deleted: sha256:d4cd9778ee43014bc3201567a50950d3784eca42c61cdf944b11fa21d3665103
Deleted: sha256:3977348aa634a594e31b1b59255f6b74163d58269a77a406cba4a0616e7a329a
Deleted: sha256:deed80b35606317558a211b21cffaccf09f740058943b4991a5821a2e354d6b0
Deleted: sha256:117e983faab2de9c9199b035b500e75bbd9191f09e1da7664e22d049deceb463
Deleted: sha256:2a7a01cffdfb445898441cf9a08b0a50364554ac1ff51338441f880182f4b9b1
Deleted: sha256:14e8881e3ded8a7504d584fd6aca2157d535b60fd54e85e4560c7a864fbcb22c
Deleted: sha256:a45e9768b92a56faf7814b35d2d79418752ac0247c4f92f27edf9b348fea270f
Deleted: sha256:cc66cfbf8c5a18cf98846eb6b1febead0b9bc2c883eb1f27c888273fc4b9060c
Deleted: sha256:6994d122cea19d3ec950c850ddca5ab4bd6d4ac37356db3a0bfbf669ce5fbd1c
Deleted: sha256:ca29c20499d43aa7a856a6d2ea5f19bfc7c8df2859f369fd90fc152459bd417a
Deleted: sha256:6127abd79c917561bb55e6f91f92f95a7378893f1d270e407df365170e1a487d
Deleted: sha256:3aad82071011ab72ffe7a53862d88b3485a16b53602e4f86b347c5738ead3cf9
Deleted: sha256:edd2fb863aec75ef127a5d666255627ac03d2df143ed4ecbe890f6aa52abb6b4
Deleted: sha256:7bca6a70ed213c9a384a8bcf3c8a27028d0527c4928abd88c5fa6634df091f29
Deleted: sha256:0b8c1a6c0c85ddf7fe8c143e74bda9c6e04bbd1b42794cab31f5e2e61b1f5e60
Deleted: sha256:89458edf4c19b3547073659b660d53aa7959bc08dee5ee459afbbdde0324a431
Deleted: sha256:c2845db5909512be34be1753e743dd413918379da8dc8c4080d4cb8aba98b0d4
Deleted: sha256:3bc44c0d517b4697e69af88029623cfe7fe8316e54659dcdb0344de0645422bd
Deleted: sha256:47e86d847a30c57d80adad067b234d63a4a354178ef03da6b1799290fe144231
Deleted: sha256:3c7dc1719414fd72bc39e71ae61b2a5ce4812332f1371f37209cdc3b57b9f7f4
Deleted: sha256:830dfd6f96c080f88cfe9030149c57dd14555b40317cce4e08002a07410fb3e9
Deleted: sha256:f85b14d79eeb5b728c7da23c9f1cb79f7ca6226fb5f31c61f30affcc5cfa6c9b
Deleted: sha256:66c9d1a681ab8c01b177c29d13736738b28d1619b2192510aa8872c184b0406c
Deleted: sha256:50bf687e053f9540449a827fd8a80e7c8a62c4185606e89ffd06b66b3c35814a
Build step 'Execute shell' marked build as failure
Not sending mail to unregistered user neil.conway@gmail.com
Build failed in Jenkins: Mesos-Buildbot » autotools,clang,--verbose --enable-libevent --enable-ssl,GLOG_v=1 MESOS_VERBOSE=1,ubuntu:14.04,(docker||Hadoop)&&(!ubuntu-us1)&&(!ubuntu-eu2) #3518
Posted by Apache Jenkins Server <je...@builds.apache.org>.
See <https://builds.apache.org/job/Mesos-Buildbot/BUILDTOOL=autotools,COMPILER=clang,CONFIGURATION=--verbose%20--enable-libevent%20--enable-ssl,ENVIRONMENT=GLOG_v=1%20MESOS_VERBOSE=1,OS=ubuntu%3A14.04,label_exp=(docker%7C%7CHadoop)&&(!ubuntu-us1)&&(!ubuntu-eu2)/3518/display/redirect?page=changes>
Changes:
[haosdent] Fixed health check bug when running agents with `docker_mesos_image`.
------------------------------------------
[...truncated 27.45 MB...]
I0416 19:25:22.822623 31324 containerizer.cpp:221] Using isolation: posix/cpu,posix/mem,filesystem/posix,network/cni
W0416 19:25:22.823115 31324 backend.cpp:76] Failed to create 'aufs' backend: AufsBackend requires root privileges
W0416 19:25:22.823225 31324 backend.cpp:76] Failed to create 'bind' backend: BindBackend requires root privileges
I0416 19:25:22.823261 31324 provisioner.cpp:249] Using default backend 'copy'
I0416 19:25:22.826283 15907 slave.cpp:225] Mesos agent started on (731)@172.17.0.2:52167
I0416 19:25:22.826324 15907 slave.cpp:226] Flags at startup: --acls="" --appc_simple_discovery_uri_prefix="http://" --appc_store_dir="/tmp/mesos/store/appc" --authenticate_http_executors="true" --authenticate_http_readonly="true" --authenticate_http_readwrite="true" --authenticatee="crammd5" --authentication_backoff_factor="1secs" --authorizer="local" --cgroups_cpu_enable_pids_and_tids_count="false" --cgroups_enable_cfs="false" --cgroups_hierarchy="/sys/fs/cgroup" --cgroups_limit_swap="false" --cgroups_root="mesos" --container_disk_watch_interval="15secs" --containerizers="mesos" --credential="/tmp/Endpoint_SlaveEndpointTest_UnauthorizedRequest_0_jLLT68/credential" --default_role="*" --disk_watch_interval="1mins" --docker="docker" --docker_kill_orphans="true" --docker_registry="https://registry-1.docker.io" --docker_remove_delay="6hrs" --docker_socket="/var/run/docker.sock" --docker_stop_timeout="0ns" --docker_store_dir="/tmp/mesos/store/docker" --docker_volume_checkpoint_dir="/var/run/mesos/isolators/docker/volume" --enforce_container_disk_quota="false" --executor_registration_timeout="1mins" --executor_secret_key="/tmp/Endpoint_SlaveEndpointTest_UnauthorizedRequest_0_jLLT68/executor_secret_key" --executor_shutdown_grace_period="5secs" --fetcher_cache_dir="/tmp/Endpoint_SlaveEndpointTest_UnauthorizedRequest_0_jLLT68/fetch" --fetcher_cache_size="2GB" --frameworks_home="" --gc_delay="1weeks" --gc_disk_headroom="0.1" --hadoop_home="" --help="false" --hostname_lookup="true" --http_command_executor="false" --http_credentials="/tmp/Endpoint_SlaveEndpointTest_UnauthorizedRequest_0_jLLT68/http_credentials" --http_heartbeat_interval="30secs" --initialize_driver_logging="true" --isolation="posix/cpu,posix/mem" --launcher="posix" --launcher_dir="/mesos/mesos-1.3.0/_build/src" --logbufsecs="0" --logging_level="INFO" --max_completed_executors_per_framework="150" --oversubscribed_resources_interval="15secs" --perf_duration="10secs" --perf_interval="1mins" --port="5051" --qos_correction_interval_min="0ns" --quiet="false" --recover="reconnect" --recovery_timeout="15mins" --registration_backoff_factor="10ms" --resources="cpus:2;gpus:0;mem:1024;disk:1024;ports:[31000-32000]" --revocable_cpu_low_priority="true" --runtime_dir="/tmp/Endpoint_SlaveEndpointTest_UnauthorizedRequest_0_jLLT68" --sandbox_directory="/mnt/mesos/sandbox" --strict="true" --switch_user="true" --systemd_enable_support="true" --systemd_runtime_directory="/run/systemd/system" --version="false" --work_dir="/tmp/Endpoint_SlaveEndpointTest_UnauthorizedRequest_0_RAYzV6"
I0416 19:25:22.826743 15907 credentials.hpp:86] Loading credential for authentication from '/tmp/Endpoint_SlaveEndpointTest_UnauthorizedRequest_0_jLLT68/credential'
I0416 19:25:22.826980 15907 slave.cpp:258] Agent using credential for: test-principal
I0416 19:25:22.827004 15907 credentials.hpp:37] Loading credentials for authentication from '/tmp/Endpoint_SlaveEndpointTest_UnauthorizedRequest_0_jLLT68/http_credentials'
I0416 19:25:22.827293 15907 http.cpp:975] Creating default 'basic' HTTP authenticator for realm 'mesos-agent-executor'
I0416 19:25:22.827430 15907 http.cpp:996] Creating default 'jwt' HTTP authenticator for realm 'mesos-agent-executor'
I0416 19:25:22.827674 15907 http.cpp:975] Creating default 'basic' HTTP authenticator for realm 'mesos-agent-readonly'
I0416 19:25:22.827775 15907 http.cpp:996] Creating default 'jwt' HTTP authenticator for realm 'mesos-agent-readonly'
I0416 19:25:22.828018 15907 http.cpp:975] Creating default 'basic' HTTP authenticator for realm 'mesos-agent-readwrite'
I0416 19:25:22.828122 15907 http.cpp:996] Creating default 'jwt' HTTP authenticator for realm 'mesos-agent-readwrite'
I0416 19:25:22.829617 15907 slave.cpp:525] Agent resources: cpus(*):2; mem(*):1024; disk(*):1024; ports(*):[31000-32000]
I0416 19:25:22.829718 15907 slave.cpp:533] Agent attributes: [ ]
I0416 19:25:22.829740 15907 slave.cpp:538] Agent hostname: 63c907e4ed7d
I0416 19:25:22.829879 15906 status_update_manager.cpp:177] Pausing sending status updates
I0416 19:25:22.831359 15900 state.cpp:62] Recovering state from '/tmp/Endpoint_SlaveEndpointTest_UnauthorizedRequest_0_RAYzV6/meta'
I0416 19:25:22.831634 15908 status_update_manager.cpp:203] Recovering status update manager
I0416 19:25:22.831820 15910 containerizer.cpp:608] Recovering containerizer
I0416 19:25:22.833228 15900 provisioner.cpp:410] Provisioner recovery complete
I0416 19:25:22.833609 15902 slave.cpp:5963] Finished recovery
I0416 19:25:22.834180 15902 slave.cpp:6145] Querying resource estimator for oversubscribable resources
I0416 19:25:22.834445 15897 slave.cpp:6159] Received oversubscribable resources {} from the resource estimator
I0416 19:25:22.836581 15901 process.cpp:3722] Handling HTTP event for process 'slave(731)' with path: '/slave(731)/monitor/statistics'
I0416 19:25:22.838276 15897 http.cpp:1115] HTTP GET for /slave(731)/monitor/statistics from 172.17.0.2:42769
I0416 19:25:22.838356 15897 http.cpp:936] Authorizing principal 'test-principal' to GET the '/monitor/statistics' endpoint
I0416 19:25:22.840072 15905 slave.cpp:790] Agent terminating
[ OK ] Endpoint/SlaveEndpointTest.UnauthorizedRequest/0 (50 ms)
[ RUN ] Endpoint/SlaveEndpointTest.UnauthorizedRequest/1
I0416 19:25:22.873615 31324 containerizer.cpp:221] Using isolation: posix/cpu,posix/mem,filesystem/posix,network/cni
W0416 19:25:22.874311 31324 backend.cpp:76] Failed to create 'aufs' backend: AufsBackend requires root privileges
W0416 19:25:22.874446 31324 backend.cpp:76] Failed to create 'bind' backend: BindBackend requires root privileges
I0416 19:25:22.874495 31324 provisioner.cpp:249] Using default backend 'copy'
I0416 19:25:22.877651 15906 slave.cpp:225] Mesos agent started on (732)@172.17.0.2:52167
I0416 19:25:22.877720 15906 slave.cpp:226] Flags at startup: --acls="" --appc_simple_discovery_uri_prefix="http://" --appc_store_dir="/tmp/mesos/store/appc" --authenticate_http_executors="true" --authenticate_http_readonly="true" --authenticate_http_readwrite="true" --authenticatee="crammd5" --authentication_backoff_factor="1secs" --authorizer="local" --cgroups_cpu_enable_pids_and_tids_count="false" --cgroups_enable_cfs="false" --cgroups_hierarchy="/sys/fs/cgroup" --cgroups_limit_swap="false" --cgroups_root="mesos" --container_disk_watch_interval="15secs" --containerizers="mesos" --credential="/tmp/Endpoint_SlaveEndpointTest_UnauthorizedRequest_1_bfOQgi/credential" --default_role="*" --disk_watch_interval="1mins" --docker="docker" --docker_kill_orphans="true" --docker_registry="https://registry-1.docker.io" --docker_remove_delay="6hrs" --docker_socket="/var/run/docker.sock" --docker_stop_timeout="0ns" --docker_store_dir="/tmp/mesos/store/docker" --docker_volume_checkpoint_dir="/var/run/mesos/isolators/docker/volume" --enforce_container_disk_quota="false" --executor_registration_timeout="1mins" --executor_secret_key="/tmp/Endpoint_SlaveEndpointTest_UnauthorizedRequest_1_bfOQgi/executor_secret_key" --executor_shutdown_grace_period="5secs" --fetcher_cache_dir="/tmp/Endpoint_SlaveEndpointTest_UnauthorizedRequest_1_bfOQgi/fetch" --fetcher_cache_size="2GB" --frameworks_home="" --gc_delay="1weeks" --gc_disk_headroom="0.1" --hadoop_home="" --help="false" --hostname_lookup="true" --http_command_executor="false" --http_credentials="/tmp/Endpoint_SlaveEndpointTest_UnauthorizedRequest_1_bfOQgi/http_credentials" --http_heartbeat_interval="30secs" --initialize_driver_logging="true" --isolation="posix/cpu,posix/mem" --launcher="posix" --launcher_dir="/mesos/mesos-1.3.0/_build/src" --logbufsecs="0" --logging_level="INFO" --max_completed_executors_per_framework="150" --oversubscribed_resources_interval="15secs" --perf_duration="10secs" --perf_interval="1mins" --port="5051" --qos_correction_interval_min="0ns" --quiet="false" --recover="reconnect" --recovery_timeout="15mins" --registration_backoff_factor="10ms" --resources="cpus:2;gpus:0;mem:1024;disk:1024;ports:[31000-32000]" --revocable_cpu_low_priority="true" --runtime_dir="/tmp/Endpoint_SlaveEndpointTest_UnauthorizedRequest_1_bfOQgi" --sandbox_directory="/mnt/mesos/sandbox" --strict="true" --switch_user="true" --systemd_enable_support="true" --systemd_runtime_directory="/run/systemd/system" --version="false" --work_dir="/tmp/Endpoint_SlaveEndpointTest_UnauthorizedRequest_1_flbgXf"
I0416 19:25:22.878170 15906 credentials.hpp:86] Loading credential for authentication from '/tmp/Endpoint_SlaveEndpointTest_UnauthorizedRequest_1_bfOQgi/credential'
I0416 19:25:22.878370 15906 slave.cpp:258] Agent using credential for: test-principal
I0416 19:25:22.878388 15906 credentials.hpp:37] Loading credentials for authentication from '/tmp/Endpoint_SlaveEndpointTest_UnauthorizedRequest_1_bfOQgi/http_credentials'
I0416 19:25:22.878654 15906 http.cpp:975] Creating default 'basic' HTTP authenticator for realm 'mesos-agent-executor'
I0416 19:25:22.878801 15906 http.cpp:996] Creating default 'jwt' HTTP authenticator for realm 'mesos-agent-executor'
I0416 19:25:22.879019 15906 http.cpp:975] Creating default 'basic' HTTP authenticator for realm 'mesos-agent-readonly'
I0416 19:25:22.879119 15906 http.cpp:996] Creating default 'jwt' HTTP authenticator for realm 'mesos-agent-readonly'
I0416 19:25:22.879295 15906 http.cpp:975] Creating default 'basic' HTTP authenticator for realm 'mesos-agent-readwrite'
I0416 19:25:22.879380 15906 http.cpp:996] Creating default 'jwt' HTTP authenticator for realm 'mesos-agent-readwrite'
I0416 19:25:22.880606 15906 slave.cpp:525] Agent resources: cpus(*):2; mem(*):1024; disk(*):1024; ports(*):[31000-32000]
I0416 19:25:22.880678 15906 slave.cpp:533] Agent attributes: [ ]
I0416 19:25:22.880691 15906 slave.cpp:538] Agent hostname: 63c907e4ed7d
I0416 19:25:22.880806 15905 status_update_manager.cpp:177] Pausing sending status updates
I0416 19:25:22.882107 15901 state.cpp:62] Recovering state from '/tmp/Endpoint_SlaveEndpointTest_UnauthorizedRequest_1_flbgXf/meta'
I0416 19:25:22.882553 15907 status_update_manager.cpp:203] Recovering status update manager
I0416 19:25:22.882735 15901 containerizer.cpp:608] Recovering containerizer
I0416 19:25:22.883946 15912 provisioner.cpp:410] Provisioner recovery complete
I0416 19:25:22.884299 15904 slave.cpp:5963] Finished recovery
I0416 19:25:22.884850 15904 slave.cpp:6145] Querying resource estimator for oversubscribable resources
I0416 19:25:22.885120 15905 slave.cpp:6159] Received oversubscribable resources {} from the resource estimator
I0416 19:25:22.887580 15904 process.cpp:3722] Handling HTTP event for process 'slave(732)' with path: '/slave(732)/monitor/statistics.json'
I0416 19:25:22.889457 15899 http.cpp:1115] HTTP GET for /slave(732)/monitor/statistics.json from 172.17.0.2:42773
I0416 19:25:22.889572 15899 http.cpp:936] Authorizing principal 'test-principal' to GET the '/monitor/statistics.json' endpoint
I0416 19:25:22.891989 15906 slave.cpp:790] Agent terminating
[ OK ] Endpoint/SlaveEndpointTest.UnauthorizedRequest/1 (29 ms)
[ RUN ] Endpoint/SlaveEndpointTest.UnauthorizedRequest/2
I0416 19:25:22.949801 31324 containerizer.cpp:221] Using isolation: posix/cpu,posix/mem,filesystem/posix,network/cni
W0416 19:25:22.950325 31324 backend.cpp:76] Failed to create 'aufs' backend: AufsBackend requires root privileges
W0416 19:25:22.950443 31324 backend.cpp:76] Failed to create 'bind' backend: BindBackend requires root privileges
I0416 19:25:22.950492 31324 provisioner.cpp:249] Using default backend 'copy'
I0416 19:25:22.953589 15901 slave.cpp:225] Mesos agent started on (733)@172.17.0.2:52167
I0416 19:25:22.953657 15901 slave.cpp:226] Flags at startup: --acls="" --appc_simple_discovery_uri_prefix="http://" --appc_store_dir="/tmp/mesos/store/appc" --authenticate_http_executors="true" --authenticate_http_readonly="true" --authenticate_http_readwrite="true" --authenticatee="crammd5" --authentication_backoff_factor="1secs" --authorizer="local" --cgroups_cpu_enable_pids_and_tids_count="false" --cgroups_enable_cfs="false" --cgroups_hierarchy="/sys/fs/cgroup" --cgroups_limit_swap="false" --cgroups_root="mesos" --container_disk_watch_interval="15secs" --containerizers="mesos" --credential="/tmp/Endpoint_SlaveEndpointTest_UnauthorizedRequest_2_Xxs39r/credential" --default_role="*" --disk_watch_interval="1mins" --docker="docker" --docker_kill_orphans="true" --docker_registry="https://registry-1.docker.io" --docker_remove_delay="6hrs" --docker_socket="/var/run/docker.sock" --docker_stop_timeout="0ns" --docker_store_dir="/tmp/mesos/store/docker" --docker_volume_checkpoint_dir="/var/run/mesos/isolators/docker/volume" --enforce_container_disk_quota="false" --executor_registration_timeout="1mins" --executor_secret_key="/tmp/Endpoint_SlaveEndpointTest_UnauthorizedRequest_2_Xxs39r/executor_secret_key" --executor_shutdown_grace_period="5secs" --fetcher_cache_dir="/tmp/Endpoint_SlaveEndpointTest_UnauthorizedRequest_2_Xxs39r/fetch" --fetcher_cache_size="2GB" --frameworks_home="" --gc_delay="1weeks" --gc_disk_headroom="0.1" --hadoop_home="" --help="false" --hostname_lookup="true" --http_command_executor="false" --http_credentials="/tmp/Endpoint_SlaveEndpointTest_UnauthorizedRequest_2_Xxs39r/http_credentials" --http_heartbeat_interval="30secs" --initialize_driver_logging="true" --isolation="posix/cpu,posix/mem" --launcher="posix" --launcher_dir="/mesos/mesos-1.3.0/_build/src" --logbufsecs="0" --logging_level="INFO" --max_completed_executors_per_framework="150" --oversubscribed_resources_interval="15secs" --perf_duration="10secs" --perf_interval="1mins" --port="5051" --qos_correction_interval_min="0ns" --quiet="false" --recover="reconnect" --recovery_timeout="15mins" --registration_backoff_factor="10ms" --resources="cpus:2;gpus:0;mem:1024;disk:1024;ports:[31000-32000]" --revocable_cpu_low_priority="true" --runtime_dir="/tmp/Endpoint_SlaveEndpointTest_UnauthorizedRequest_2_Xxs39r" --sandbox_directory="/mnt/mesos/sandbox" --strict="true" --switch_user="true" --systemd_enable_support="true" --systemd_runtime_directory="/run/systemd/system" --version="false" --work_dir="/tmp/Endpoint_SlaveEndpointTest_UnauthorizedRequest_2_3om5Dp"
I0416 19:25:22.954073 15901 credentials.hpp:86] Loading credential for authentication from '/tmp/Endpoint_SlaveEndpointTest_UnauthorizedRequest_2_Xxs39r/credential'
I0416 19:25:22.961189 15901 slave.cpp:258] Agent using credential for: test-principal
I0416 19:25:22.961235 15901 credentials.hpp:37] Loading credentials for authentication from '/tmp/Endpoint_SlaveEndpointTest_UnauthorizedRequest_2_Xxs39r/http_credentials'
I0416 19:25:22.961571 15901 http.cpp:975] Creating default 'basic' HTTP authenticator for realm 'mesos-agent-executor'
I0416 19:25:22.961822 15901 http.cpp:996] Creating default 'jwt' HTTP authenticator for realm 'mesos-agent-executor'
I0416 19:25:22.962191 15901 http.cpp:975] Creating default 'basic' HTTP authenticator for realm 'mesos-agent-readonly'
I0416 19:25:22.962332 15901 http.cpp:996] Creating default 'jwt' HTTP authenticator for realm 'mesos-agent-readonly'
I0416 19:25:22.962468 15901 http.cpp:975] Creating default 'basic' HTTP authenticator for realm 'mesos-agent-readwrite'
I0416 19:25:22.962539 15901 http.cpp:996] Creating default 'jwt' HTTP authenticator for realm 'mesos-agent-readwrite'
I0416 19:25:22.963862 15901 slave.cpp:525] Agent resources: cpus(*):2; mem(*):1024; disk(*):1024; ports(*):[31000-32000]
I0416 19:25:22.963945 15901 slave.cpp:533] Agent attributes: [ ]
I0416 19:25:22.963958 15901 slave.cpp:538] Agent hostname: 63c907e4ed7d
I0416 19:25:22.965101 15908 status_update_manager.cpp:177] Pausing sending status updates
I0416 19:25:22.965593 15907 state.cpp:62] Recovering state from '/tmp/Endpoint_SlaveEndpointTest_UnauthorizedRequest_2_3om5Dp/meta'
I0416 19:25:22.965946 15905 status_update_manager.cpp:203] Recovering status update manager
I0416 19:25:22.966262 15906 containerizer.cpp:608] Recovering containerizer
I0416 19:25:22.967669 15906 provisioner.cpp:410] Provisioner recovery complete
I0416 19:25:22.968008 15899 slave.cpp:5963] Finished recovery
I0416 19:25:22.968502 15899 slave.cpp:6145] Querying resource estimator for oversubscribable resources
I0416 19:25:22.968689 15908 slave.cpp:6159] Received oversubscribable resources {} from the resource estimator
I0416 19:25:22.979696 15902 process.cpp:3722] Handling HTTP event for process 'slave(733)' with path: '/slave(733)/containers'
I0416 19:25:22.982247 15902 http.cpp:1115] HTTP GET for /slave(733)/containers from 172.17.0.2:42776
I0416 19:25:22.982342 15902 http.cpp:936] Authorizing principal 'test-principal' to GET the '/containers' endpoint
I0416 19:25:22.984731 15897 slave.cpp:790] Agent terminating
[ OK ] Endpoint/SlaveEndpointTest.UnauthorizedRequest/2 (47 ms)
[ RUN ] Endpoint/SlaveEndpointTest.NoAuthorizer/0
I0416 19:25:22.997557 31324 containerizer.cpp:221] Using isolation: posix/cpu,posix/mem,filesystem/posix,network/cni
W0416 19:25:23.011920 31324 backend.cpp:76] Failed to create 'aufs' backend: AufsBackend requires root privileges
W0416 19:25:23.012156 31324 backend.cpp:76] Failed to create 'bind' backend: BindBackend requires root privileges
I0416 19:25:23.012203 31324 provisioner.cpp:249] Using default backend 'copy'
I0416 19:25:23.014427 31324 cluster.cpp:448] Creating default 'local' authorizer
I0416 19:25:23.017055 15900 slave.cpp:225] Mesos agent started on (734)@172.17.0.2:52167
I0416 19:25:23.017115 15900 slave.cpp:226] Flags at startup: --acls="" --appc_simple_discovery_uri_prefix="http://" --appc_store_dir="/tmp/mesos/store/appc" --authenticate_http_executors="true" --authenticate_http_readonly="true" --authenticate_http_readwrite="true" --authenticatee="crammd5" --authentication_backoff_factor="1secs" --authorizer="local" --cgroups_cpu_enable_pids_and_tids_count="false" --cgroups_enable_cfs="false" --cgroups_hierarchy="/sys/fs/cgroup" --cgroups_limit_swap="false" --cgroups_root="mesos" --container_disk_watch_interval="15secs" --containerizers="mesos" --credential="/tmp/Endpoint_SlaveEndpointTest_NoAuthorizer_0_EUGQDC/credential" --default_role="*" --disk_watch_interval="1mins" --docker="docker" --docker_kill_orphans="true" --docker_registry="https://registry-1.docker.io" --docker_remove_delay="6hrs" --docker_socket="/var/run/docker.sock" --docker_stop_timeout="0ns" --docker_store_dir="/tmp/mesos/store/docker" --docker_volume_checkpoint_dir="/var/run/mesos/isolators/docker/volume" --enforce_container_disk_quota="false" --executor_registration_timeout="1mins" --executor_secret_key="/tmp/Endpoint_SlaveEndpointTest_NoAuthorizer_0_EUGQDC/executor_secret_key" --executor_shutdown_grace_period="5secs" --fetcher_cache_dir="/tmp/Endpoint_SlaveEndpointTest_NoAuthorizer_0_EUGQDC/fetch" --fetcher_cache_size="2GB" --frameworks_home="" --gc_delay="1weeks" --gc_disk_headroom="0.1" --hadoop_home="" --help="false" --hostname_lookup="true" --http_command_executor="false" --http_credentials="/tmp/Endpoint_SlaveEndpointTest_NoAuthorizer_0_EUGQDC/http_credentials" --http_heartbeat_interval="30secs" --initialize_driver_logging="true" --isolation="posix/cpu,posix/mem" --launcher="posix" --launcher_dir="/mesos/mesos-1.3.0/_build/src" --logbufsecs="0" --logging_level="INFO" --max_completed_executors_per_framework="150" --oversubscribed_resources_interval="15secs" --perf_duration="10secs" --perf_interval="1mins" --port="5051" --qos_correction_interval_min="0ns" --quiet="false" --recover="reconnect" --recovery_timeout="15mins" --registration_backoff_factor="10ms" --resources="cpus:2;gpus:0;mem:1024;disk:1024;ports:[31000-32000]" --revocable_cpu_low_priority="true" --runtime_dir="/tmp/Endpoint_SlaveEndpointTest_NoAuthorizer_0_EUGQDC" --sandbox_directory="/mnt/mesos/sandbox" --strict="true" --switch_user="true" --systemd_enable_support="true" --systemd_runtime_directory="/run/systemd/system" --version="false" --work_dir="/tmp/Endpoint_SlaveEndpointTest_NoAuthorizer_0_ms4e0z"
I0416 19:25:23.017695 15900 credentials.hpp:86] Loading credential for authentication from '/tmp/Endpoint_SlaveEndpointTest_NoAuthorizer_0_EUGQDC/credential'
I0416 19:25:23.017951 15900 slave.cpp:258] Agent using credential for: test-principal
I0416 19:25:23.017978 15900 credentials.hpp:37] Loading credentials for authentication from '/tmp/Endpoint_SlaveEndpointTest_NoAuthorizer_0_EUGQDC/http_credentials'
I0416 19:25:23.018373 15900 http.cpp:975] Creating default 'basic' HTTP authenticator for realm 'mesos-agent-executor'
I0416 19:25:23.018822 15900 http.cpp:996] Creating default 'jwt' HTTP authenticator for realm 'mesos-agent-executor'
I0416 19:25:23.019078 15900 http.cpp:975] Creating default 'basic' HTTP authenticator for realm 'mesos-agent-readonly'
I0416 19:25:23.019214 15900 http.cpp:996] Creating default 'jwt' HTTP authenticator for realm 'mesos-agent-readonly'
I0416 19:25:23.019418 15900 http.cpp:975] Creating default 'basic' HTTP authenticator for realm 'mesos-agent-readwrite'
I0416 19:25:23.019529 15900 http.cpp:996] Creating default 'jwt' HTTP authenticator for realm 'mesos-agent-readwrite'
I0416 19:25:23.021515 15900 slave.cpp:525] Agent resources: cpus(*):2; mem(*):1024; disk(*):1024; ports(*):[31000-32000]
I0416 19:25:23.021647 15900 slave.cpp:533] Agent attributes: [ ]
I0416 19:25:23.021668 15900 slave.cpp:538] Agent hostname: 63c907e4ed7d
I0416 19:25:23.022256 15903 status_update_manager.cpp:177] Pausing sending status updates
I0416 19:25:23.023860 15902 state.cpp:62] Recovering state from '/tmp/Endpoint_SlaveEndpointTest_NoAuthorizer_0_ms4e0z/meta'
I0416 19:25:23.024355 15911 status_update_manager.cpp:203] Recovering status update manager
I0416 19:25:23.024565 15911 containerizer.cpp:608] Recovering containerizer
I0416 19:25:23.026815 15911 provisioner.cpp:410] Provisioner recovery complete
I0416 19:25:23.027369 15911 slave.cpp:5963] Finished recovery
I0416 19:25:23.027961 15911 slave.cpp:6145] Querying resource estimator for oversubscribable resources
I0416 19:25:23.028646 15911 slave.cpp:6159] Received oversubscribable resources {} from the resource estimator
I0416 19:25:23.032559 15905 process.cpp:3722] Handling HTTP event for process 'slave(734)' with path: '/slave(734)/monitor/statistics'
I0416 19:25:23.034277 15902 http.cpp:1115] HTTP GET for /slave(734)/monitor/statistics from 172.17.0.2:42780
I0416 19:25:23.034381 15902 http.cpp:936] Authorizing principal 'test-principal' to GET the '/monitor/statistics' endpoint
I0416 19:25:23.037709 31324 slave.cpp:790] Agent terminating
[ OK ] Endpoint/SlaveEndpointTest.NoAuthorizer/0 (62 ms)
[ RUN ] Endpoint/SlaveEndpointTest.NoAuthorizer/1
I0416 19:25:23.059911 31324 containerizer.cpp:221] Using isolation: posix/cpu,posix/mem,filesystem/posix,network/cni
W0416 19:25:23.060639 31324 backend.cpp:76] Failed to create 'aufs' backend: AufsBackend requires root privileges
W0416 19:25:23.060789 31324 backend.cpp:76] Failed to create 'bind' backend: BindBackend requires root privileges
I0416 19:25:23.060883 31324 provisioner.cpp:249] Using default backend 'copy'
I0416 19:25:23.062677 31324 cluster.cpp:448] Creating default 'local' authorizer
I0416 19:25:23.064242 15911 slave.cpp:225] Mesos agent started on (735)@172.17.0.2:52167
I0416 19:25:23.064291 15911 slave.cpp:226] Flags at startup: --acls="" --appc_simple_discovery_uri_prefix="http://" --appc_store_dir="/tmp/mesos/store/appc" --authenticate_http_executors="true" --authenticate_http_readonly="true" --authenticate_http_readwrite="true" --authenticatee="crammd5" --authentication_backoff_factor="1secs" --authorizer="local" --cgroups_cpu_enable_pids_and_tids_count="false" --cgroups_enable_cfs="false" --cgroups_hierarchy="/sys/fs/cgroup" --cgroups_limit_swap="false" --cgroups_root="mesos" --container_disk_watch_interval="15secs" --containerizers="mesos" --credential="/tmp/Endpoint_SlaveEndpointTest_NoAuthorizer_1_xUXILN/credential" --default_role="*" --disk_watch_interval="1mins" --docker="docker" --docker_kill_orphans="true" --docker_registry="https://registry-1.docker.io" --docker_remove_delay="6hrs" --docker_socket="/var/run/docker.sock" --docker_stop_timeout="0ns" --docker_store_dir="/tmp/mesos/store/docker" --docker_volume_checkpoint_dir="/var/run/mesos/isolators/docker/volume" --enforce_container_disk_quota="false" --executor_registration_timeout="1mins" --executor_secret_key="/tmp/Endpoint_SlaveEndpointTest_NoAuthorizer_1_xUXILN/executor_secret_key" --executor_shutdown_grace_period="5secs" --fetcher_cache_dir="/tmp/Endpoint_SlaveEndpointTest_NoAuthorizer_1_xUXILN/fetch" --fetcher_cache_size="2GB" --frameworks_home="" --gc_delay="1weeks" --gc_disk_headroom="0.1" --hadoop_home="" --help="false" --hostname_lookup="true" --http_command_executor="false" --http_credentials="/tmp/Endpoint_SlaveEndpointTest_NoAuthorizer_1_xUXILN/http_credentials" --http_heartbeat_interval="30secs" --initialize_driver_logging="true" --isolation="posix/cpu,posix/mem" --launcher="posix" --launcher_dir="/mesos/mesos-1.3.0/_build/src" --logbufsecs="0" --logging_level="INFO" --max_completed_executors_per_framework="150" --oversubscribed_resources_interval="15secs" --perf_duration="10secs" --perf_interval="1mins" --port="5051" --qos_correction_interval_min="0ns" --quiet="false" --recover="reconnect" --recovery_timeout="15mins" --registration_backoff_factor="10ms" --resources="cpus:2;gpus:0;mem:1024;disk:1024;ports:[31000-32000]" --revocable_cpu_low_priority="true" --runtime_dir="/tmp/Endpoint_SlaveEndpointTest_NoAuthorizer_1_xUXILN" --sandbox_directory="/mnt/mesos/sandbox" --strict="true" --switch_user="true" --systemd_enable_support="true" --systemd_runtime_directory="/run/systemd/system" --version="false" --work_dir="/tmp/Endpoint_SlaveEndpointTest_NoAuthorizer_1_b9oXXK"
I0416 19:25:23.064779 15911 credentials.hpp:86] Loading credential for authentication from '/tmp/Endpoint_SlaveEndpointTest_NoAuthorizer_1_xUXILN/credential'
I0416 19:25:23.064968 15911 slave.cpp:258] Agent using credential for: test-principal
I0416 19:25:23.064990 15911 credentials.hpp:37] Loading credentials for authentication from '/tmp/Endpoint_SlaveEndpointTest_NoAuthorizer_1_xUXILN/http_credentials'
I0416 19:25:23.065256 15911 http.cpp:975] Creating default 'basic' HTTP authenticator for realm 'mesos-agent-executor'
I0416 19:25:23.065372 15911 http.cpp:996] Creating default 'jwt' HTTP authenticator for realm 'mesos-agent-executor'
I0416 19:25:23.065562 15911 http.cpp:975] Creating default 'basic' HTTP authenticator for realm 'mesos-agent-readonly'
I0416 19:25:23.065642 15911 http.cpp:996] Creating default 'jwt' HTTP authenticator for realm 'mesos-agent-readonly'
I0416 19:25:23.065796 15911 http.cpp:975] Creating default 'basic' HTTP authenticator for realm 'mesos-agent-readwrite'
I0416 19:25:23.065873 15911 http.cpp:996] Creating default 'jwt' HTTP authenticator for realm 'mesos-agent-readwrite'
I0416 19:25:23.067131 15911 slave.cpp:525] Agent resources: cpus(*):2; mem(*):1024; disk(*):1024; ports(*):[31000-32000]
I0416 19:25:23.067205 15911 slave.cpp:533] Agent attributes: [ ]
I0416 19:25:23.067216 15911 slave.cpp:538] Agent hostname: 63c907e4ed7d
I0416 19:25:23.067373 15900 status_update_manager.cpp:177] Pausing sending status updates
I0416 19:25:23.068678 15899 state.cpp:62] Recovering state from '/tmp/Endpoint_SlaveEndpointTest_NoAuthorizer_1_b9oXXK/meta'
I0416 19:25:23.068991 15907 status_update_manager.cpp:203] Recovering status update manager
I0416 19:25:23.069165 15911 containerizer.cpp:608] Recovering containerizer
I0416 19:25:23.070530 15906 provisioner.cpp:410] Provisioner recovery complete
I0416 19:25:23.070881 15907 slave.cpp:5963] Finished recovery
I0416 19:25:23.071425 15907 slave.cpp:6145] Querying resource estimator for oversubscribable resources
I0416 19:25:23.071653 15910 slave.cpp:6159] Received oversubscribable resources {} from the resource estimator
I0416 19:25:23.073787 15907 process.cpp:3722] Handling HTTP event for process 'slave(735)' with path: '/slave(735)/monitor/statistics.json'
I0416 19:25:23.075311 15906 http.cpp:1115] HTTP GET for /slave(735)/monitor/statistics.json from 172.17.0.2:42783
I0416 19:25:23.075381 15906 http.cpp:936] Authorizing principal 'test-principal' to GET the '/monitor/statistics.json' endpoint
I0416 19:25:23.078531 15906 slave.cpp:790] Agent terminating
[ OK ] Endpoint/SlaveEndpointTest.NoAuthorizer/1 (50 ms)
[ RUN ] Endpoint/SlaveEndpointTest.NoAuthorizer/2
I0416 19:25:23.109431 31324 containerizer.cpp:221] Using isolation: posix/cpu,posix/mem,filesystem/posix,network/cni
W0416 19:25:23.109918 31324 backend.cpp:76] Failed to create 'aufs' backend: AufsBackend requires root privileges
W0416 19:25:23.110038 31324 backend.cpp:76] Failed to create 'bind' backend: BindBackend requires root privileges
I0416 19:25:23.110082 31324 provisioner.cpp:249] Using default backend 'copy'
I0416 19:25:23.111651 31324 cluster.cpp:448] Creating default 'local' authorizer
I0416 19:25:23.113137 15908 slave.cpp:225] Mesos agent started on (736)@172.17.0.2:52167
I0416 19:25:23.113184 15908 slave.cpp:226] Flags at startup: --acls="" --appc_simple_discovery_uri_prefix="http://" --appc_store_dir="/tmp/mesos/store/appc" --authenticate_http_executors="true" --authenticate_http_readonly="true" --authenticate_http_readwrite="true" --authenticatee="crammd5" --authentication_backoff_factor="1secs" --authorizer="local" --cgroups_cpu_enable_pids_and_tids_count="false" --cgroups_enable_cfs="false" --cgroups_hierarchy="/sys/fs/cgroup" --cgroups_limit_swap="false" --cgroups_root="mesos" --container_disk_watch_interval="15secs" --containerizers="mesos" --credential="/tmp/Endpoint_SlaveEndpointTest_NoAuthorizer_2_zMX2oZ/credential" --default_role="*" --disk_watch_interval="1mins" --docker="docker" --docker_kill_orphans="true" --docker_registry="https://registry-1.docker.io" --docker_remove_delay="6hrs" --docker_socket="/var/run/docker.sock" --docker_stop_timeout="0ns" --docker_store_dir="/tmp/mesos/store/docker" --docker_volume_checkpoint_dir="/var/run/mesos/isolators/docker/volume" --enforce_container_disk_quota="false" --executor_registration_timeout="1mins" --executor_secret_key="/tmp/Endpoint_SlaveEndpointTest_NoAuthorizer_2_zMX2oZ/executor_secret_key" --executor_shutdown_grace_period="5secs" --fetcher_cache_dir="/tmp/Endpoint_SlaveEndpointTest_NoAuthorizer_2_zMX2oZ/fetch" --fetcher_cache_size="2GB" --frameworks_home="" --gc_delay="1weeks" --gc_disk_headroom="0.1" --hadoop_home="" --help="false" --hostname_lookup="true" --http_command_executor="false" --http_credentials="/tmp/Endpoint_SlaveEndpointTest_NoAuthorizer_2_zMX2oZ/http_credentials" --http_heartbeat_interval="30secs" --initialize_driver_logging="true" --isolation="posix/cpu,posix/mem" --launcher="posix" --launcher_dir="/mesos/mesos-1.3.0/_build/src" --logbufsecs="0" --logging_level="INFO" --max_completed_executors_per_framework="150" --oversubscribed_resources_interval="15secs" --perf_duration="10secs" --perf_interval="1mins" --port="5051" --qos_correction_interval_min="0ns" --quiet="false" --recover="reconnect" --recovery_timeout="15mins" --registration_backoff_factor="10ms" --resources="cpus:2;gpus:0;mem:1024;disk:1024;ports:[31000-32000]" --revocable_cpu_low_priority="true" --runtime_dir="/tmp/Endpoint_SlaveEndpointTest_NoAuthorizer_2_zMX2oZ" --sandbox_directory="/mnt/mesos/sandbox" --strict="true" --switch_user="true" --systemd_enable_support="true" --systemd_runtime_directory="/run/systemd/system" --version="false" --work_dir="/tmp/Endpoint_SlaveEndpointTest_NoAuthorizer_2_PD6atW"
I0416 19:25:23.113577 15908 credentials.hpp:86] Loading credential for authentication from '/tmp/Endpoint_SlaveEndpointTest_NoAuthorizer_2_zMX2oZ/credential'
I0416 19:25:23.113770 15908 slave.cpp:258] Agent using credential for: test-principal
I0416 19:25:23.113793 15908 credentials.hpp:37] Loading credentials for authentication from '/tmp/Endpoint_SlaveEndpointTest_NoAuthorizer_2_zMX2oZ/http_credentials'
I0416 19:25:23.114071 15908 http.cpp:975] Creating default 'basic' HTTP authenticator for realm 'mesos-agent-executor'
I0416 19:25:23.114199 15908 http.cpp:996] Creating default 'jwt' HTTP authenticator for realm 'mesos-agent-executor'
I0416 19:25:23.114454 15908 http.cpp:975] Creating default 'basic' HTTP authenticator for realm 'mesos-agent-readonly'
I0416 19:25:23.114552 15908 http.cpp:996] Creating default 'jwt' HTTP authenticator for realm 'mesos-agent-readonly'
I0416 19:25:23.114763 15908 http.cpp:975] Creating default 'basic' HTTP authenticator for realm 'mesos-agent-readwrite'
I0416 19:25:23.114876 15908 http.cpp:996] Creating default 'jwt' HTTP authenticator for realm 'mesos-agent-readwrite'
I0416 19:25:23.116325 15908 slave.cpp:525] Agent resources: cpus(*):2; mem(*):1024; disk(*):1024; ports(*):[31000-32000]
I0416 19:25:23.116405 15908 slave.cpp:533] Agent attributes: [ ]
I0416 19:25:23.116417 15908 slave.cpp:538] Agent hostname: 63c907e4ed7d
I0416 19:25:23.116576 15898 status_update_manager.cpp:177] Pausing sending status updates
I0416 19:25:23.118070 15905 state.cpp:62] Recovering state from '/tmp/Endpoint_SlaveEndpointTest_NoAuthorizer_2_PD6atW/meta'
I0416 19:25:23.118312 15899 status_update_manager.cpp:203] Recovering status update manager
I0416 19:25:23.118517 15909 containerizer.cpp:608] Recovering containerizer
I0416 19:25:23.119858 15904 provisioner.cpp:410] Provisioner recovery complete
I0416 19:25:23.120205 15903 slave.cpp:5963] Finished recovery
I0416 19:25:23.120764 15903 slave.cpp:6145] Querying resource estimator for oversubscribable resources
I0416 19:25:23.121019 15898 slave.cpp:6159] Received oversubscribable resources {} from the resource estimator
I0416 19:25:23.123272 15910 process.cpp:3722] Handling HTTP event for process 'slave(736)' with path: '/slave(736)/containers'
I0416 19:25:23.125264 15900 http.cpp:1115] HTTP GET for /slave(736)/containers from 172.17.0.2:42784
I0416 19:25:23.125331 15900 http.cpp:936] Authorizing principal 'test-principal' to GET the '/containers' endpoint
I0416 19:25:23.128763 15911 slave.cpp:790] Agent terminating
[ OK ] Endpoint/SlaveEndpointTest.NoAuthorizer/2 (33 ms)
[----------] 9 tests from Endpoint/SlaveEndpointTest (487 ms total)
[----------] Global test environment tear-down
../../src/tests/environment.cpp:742: Failure
Failed
Tests completed with child processes remaining:
-+- 31324 /mesos/mesos-1.3.0/_build/src/.libs/lt-mesos-tests
|--- 11436 /mesos/mesos-1.3.0/_build/src/.libs/lt-mesos-io-switchboard --heartbeat_interval=30secs --help=false --socket_address=/tmp/mesos-io-switchboard-2192eef8-52ca-4116-befc-eff2d33d6f97 --stderr_from_fd=21 --stderr_to_fd=2 --stdin_to_fd=21 --stdout_from_fd=21 --stdout_to_fd=1 --tty=true --wait_for_connection=false
\-+- 11437 /mesos/mesos-1.3.0/_build/src/.libs/lt-mesos-containerizer launch
\-+- 11464 sh -c sleep 1000
\--- 11474 sleep 1000
[==========] 1540 tests from 175 test cases ran. (695491 ms total)
[ PASSED ] 1539 tests.
[ FAILED ] 1 test, listed below:
[ FAILED ] IOSwitchboardTest.ContainerAttach
1 FAILED TEST
YOU HAVE 12 DISABLED TESTS
make[4]: *** [check-local] Error 1
make[4]: Leaving directory `/mesos/mesos-1.3.0/_build/src'
make[3]: *** [check-am] Error 2
make[3]: Leaving directory `/mesos/mesos-1.3.0/_build/src'
make[2]: *** [check] Error 2
make[2]: Leaving directory `/mesos/mesos-1.3.0/_build/src'
make[1]: *** [check-recursive] Error 1
make[1]: Leaving directory `/mesos/mesos-1.3.0/_build'
make: *** [distcheck] Error 1
+ docker rmi mesos-1492367283-24274
Untagged: mesos-1492367283-24274:latest
Deleted: sha256:186d93281bbe930578df6d5d709795d5f168e3bd525cfd8da78f9c4e25085ebb
Deleted: sha256:41b4e84a66eab614b2f4f4c4a33b31218d462941b7b3f5a22417a28c85e20ffa
Deleted: sha256:2c615c033b7906bb9d585d27fa827f154c09904c792eecac4ebfb07ff5746c43
Deleted: sha256:4315303a66f17357f3551ea6000c1ee7c6ca6a50669b73dd47520d10f43c595f
Deleted: sha256:ecd5ec9b473122e267596406efe21361f096d93c2917343fb08627bfd9aadd3b
Deleted: sha256:968be05cdf566bc8a111478fd8a379907c696a05c6451cee791bfed2bf14211c
Deleted: sha256:1009461d6b149b679822bc40857676744be2cee731ca4673d971e94428e8ceda
Deleted: sha256:8d0606a2cdebbc3dfe4580d846a26b62707a5f2533c5a296e066d90d3d76dfd9
Deleted: sha256:460f2a78c397ea90e939d195c88e20a71c84b53f6f925c1ededf8bf870dd2ed9
Deleted: sha256:b669935bb961efa2c66db187e183fe56efd233cb751d104465bbfa50f4106655
Deleted: sha256:f59ffb2c9886a312d0e7c1de497a2d9904f8dc994a7bbad74d096c8ab73af56e
Deleted: sha256:19d445c990edbfaf9aa4fdccf82fad3f158d14ac43a4a32b28bb0c1cf615dc02
Deleted: sha256:b5c0f0567f0e91d230f735d7a7a5f1f3900cd460579c2d75fb45b55c29433a91
Deleted: sha256:5c38d81d04ce710e730e3ebda2678c06b81c30fb15b5b6f8275dbe55710d6714
Deleted: sha256:43f1eb67df66a578d5ed3aa964c5e408a90de554a41042e9a5a0a388b93d0955
Deleted: sha256:1e9a81ab753c7b6e2fe87a1746835c3c4945228117ba55416ebf5d6ae79aa746
Deleted: sha256:6b0dd464e746fa8d4d190480840bd170612d225229db7920823aedc8ef232632
Deleted: sha256:7fe993958dd6d237932ab4838abc30c27ba1d075c60ed47ce1cdaecb363e9db0
Deleted: sha256:4658dc574b0f5b873d640bba4030d43ff57e789bb82899f2ecf27bf3c3b6b72b
Deleted: sha256:62036c9369cb877793ad0c1d2618f76fb8d44389b0bc61b765f6aafec2d073c5
Deleted: sha256:6a4c3670f323df11e471683d557ab25c4cc95bb5ed2db2a6bed70adba38fb1d9
Deleted: sha256:7eea70b11aae508a3fdfc8a37dd7b82118e5a75f99f5fd1a24e2d401bd093a5b
Deleted: sha256:3518112965922751413ac5d674e4d5b08ed15c137e1696b1b0118be76bc56f4b
Deleted: sha256:8a51cba1f1a335358039ad0d3e42b74d518ccd638f52ee2b5c0fc1e843ff7e9a
Build step 'Execute shell' marked build as failure
Build failed in Jenkins: Mesos-Buildbot » autotools,clang,--verbose --enable-libevent --enable-ssl,GLOG_v=1 MESOS_VERBOSE=1,ubuntu:14.04,(docker||Hadoop)&&(!ubuntu-us1)&&(!ubuntu-eu2) #3517
Posted by Apache Jenkins Server <je...@builds.apache.org>.
See <https://builds.apache.org/job/Mesos-Buildbot/BUILDTOOL=autotools,COMPILER=clang,CONFIGURATION=--verbose%20--enable-libevent%20--enable-ssl,ENVIRONMENT=GLOG_v=1%20MESOS_VERBOSE=1,OS=ubuntu%3A14.04,label_exp=(docker%7C%7CHadoop)&&(!ubuntu-us1)&&(!ubuntu-eu2)/3517/display/redirect>
------------------------------------------
Started by upstream project "Mesos-Buildbot" build number 3517
originally caused by:
Started by an SCM change
[EnvInject] - Loading node environment variables.
Building remotely on H5 (Hadoop) in workspace <https://builds.apache.org/job/Mesos-Buildbot/BUILDTOOL=autotools,COMPILER=clang,CONFIGURATION=--verbose%20--enable-libevent%20--enable-ssl,ENVIRONMENT=GLOG_v=1%20MESOS_VERBOSE=1,OS=ubuntu%3A14.04,label_exp=(docker%7C%7CHadoop)&&(!ubuntu-us1)&&(!ubuntu-eu2)/ws/>
Wiping out workspace first.
Cloning the remote Git repository
Cloning repository https://git-wip-us.apache.org/repos/asf/mesos.git
> git init <https://builds.apache.org/job/Mesos-Buildbot/BUILDTOOL=autotools,COMPILER=clang,CONFIGURATION=--verbose%20--enable-libevent%20--enable-ssl,ENVIRONMENT=GLOG_v=1%20MESOS_VERBOSE=1,OS=ubuntu%3A14.04,label_exp=(docker%7C%7CHadoop)&&(!ubuntu-us1)&&(!ubuntu-eu2)/ws/> # timeout=10
Fetching upstream changes from https://git-wip-us.apache.org/repos/asf/mesos.git
> git --version # timeout=10
> git fetch --tags --progress https://git-wip-us.apache.org/repos/asf/mesos.git +refs/heads/*:refs/remotes/origin/*
> git config remote.origin.url https://git-wip-us.apache.org/repos/asf/mesos.git # timeout=10
> git config --add remote.origin.fetch +refs/heads/*:refs/remotes/origin/* # timeout=10
> git config remote.origin.url https://git-wip-us.apache.org/repos/asf/mesos.git # timeout=10
Fetching upstream changes from https://git-wip-us.apache.org/repos/asf/mesos.git
> git fetch --tags --progress https://git-wip-us.apache.org/repos/asf/mesos.git +refs/heads/*:refs/remotes/origin/*
Checking out Revision c46b9c8ed2fb0cdb58c90fe6fc71dc9e2f49d98c (refs/tags/0.25.1, refs/tags/0.25.1-rc4)
> git config core.sparsecheckout # timeout=10
> git checkout -f c46b9c8ed2fb0cdb58c90fe6fc71dc9e2f49d98c
First time build. Skipping changelog.
[3b5a1cbc] $ /bin/bash -xe /tmp/hudson4819831068688471085.sh
+ '[' refs/tags/0.25.1 = origin/1.0.x ']'
+ ./support/jenkins/buildbot.sh
/tmp/hudson4819831068688471085.sh: line 6: ./support/jenkins/buildbot.sh: No such file or directory
Build step 'Execute shell' marked build as failure
Build failed in Jenkins: Mesos-Buildbot » autotools,clang,--verbose --enable-libevent --enable-ssl,GLOG_v=1 MESOS_VERBOSE=1,ubuntu:14.04,(docker||Hadoop)&&(!ubuntu-us1)&&(!ubuntu-eu2) #3516
Posted by Apache Jenkins Server <je...@builds.apache.org>.
See <https://builds.apache.org/job/Mesos-Buildbot/BUILDTOOL=autotools,COMPILER=clang,CONFIGURATION=--verbose%20--enable-libevent%20--enable-ssl,ENVIRONMENT=GLOG_v=1%20MESOS_VERBOSE=1,OS=ubuntu%3A14.04,label_exp=(docker%7C%7CHadoop)&&(!ubuntu-us1)&&(!ubuntu-eu2)/3516/display/redirect>
------------------------------------------
Started by upstream project "Mesos-Buildbot" build number 3516
originally caused by:
Started by an SCM change
Started by an SCM change
[EnvInject] - Loading node environment variables.
Building remotely on H5 (Hadoop) in workspace <https://builds.apache.org/job/Mesos-Buildbot/BUILDTOOL=autotools,COMPILER=clang,CONFIGURATION=--verbose%20--enable-libevent%20--enable-ssl,ENVIRONMENT=GLOG_v=1%20MESOS_VERBOSE=1,OS=ubuntu%3A14.04,label_exp=(docker%7C%7CHadoop)&&(!ubuntu-us1)&&(!ubuntu-eu2)/ws/>
Wiping out workspace first.
Cloning the remote Git repository
Cloning repository https://git-wip-us.apache.org/repos/asf/mesos.git
> git init <https://builds.apache.org/job/Mesos-Buildbot/BUILDTOOL=autotools,COMPILER=clang,CONFIGURATION=--verbose%20--enable-libevent%20--enable-ssl,ENVIRONMENT=GLOG_v=1%20MESOS_VERBOSE=1,OS=ubuntu%3A14.04,label_exp=(docker%7C%7CHadoop)&&(!ubuntu-us1)&&(!ubuntu-eu2)/ws/> # timeout=10
Fetching upstream changes from https://git-wip-us.apache.org/repos/asf/mesos.git
> git --version # timeout=10
> git fetch --tags --progress https://git-wip-us.apache.org/repos/asf/mesos.git +refs/heads/*:refs/remotes/origin/*
> git config remote.origin.url https://git-wip-us.apache.org/repos/asf/mesos.git # timeout=10
> git config --add remote.origin.fetch +refs/heads/*:refs/remotes/origin/* # timeout=10
> git config remote.origin.url https://git-wip-us.apache.org/repos/asf/mesos.git # timeout=10
Fetching upstream changes from https://git-wip-us.apache.org/repos/asf/mesos.git
> git fetch --tags --progress https://git-wip-us.apache.org/repos/asf/mesos.git +refs/heads/*:refs/remotes/origin/*
Checking out Revision e2eb20b864b119e5f2d0f5b167c435c393f1104a (refs/tags/0.24.2, refs/tags/0.24.2-rc5)
> git config core.sparsecheckout # timeout=10
> git checkout -f e2eb20b864b119e5f2d0f5b167c435c393f1104a
First time build. Skipping changelog.
[3b5a1cbc] $ /bin/bash -xe /tmp/hudson8284235872166035880.sh
+ '[' refs/tags/0.24.2 = origin/1.0.x ']'
+ ./support/jenkins/buildbot.sh
/tmp/hudson8284235872166035880.sh: line 6: ./support/jenkins/buildbot.sh: No such file or directory
Build step 'Execute shell' marked build as failure
Build failed in Jenkins: Mesos-Buildbot » autotools,clang,--verbose --enable-libevent --enable-ssl,GLOG_v=1 MESOS_VERBOSE=1,ubuntu:14.04,(docker||Hadoop)&&(!ubuntu-us1)&&(!ubuntu-eu2) #3515
Posted by Apache Jenkins Server <je...@builds.apache.org>.
See <https://builds.apache.org/job/Mesos-Buildbot/BUILDTOOL=autotools,COMPILER=clang,CONFIGURATION=--verbose%20--enable-libevent%20--enable-ssl,ENVIRONMENT=GLOG_v=1%20MESOS_VERBOSE=1,OS=ubuntu%3A14.04,label_exp=(docker%7C%7CHadoop)&&(!ubuntu-us1)&&(!ubuntu-eu2)/3515/display/redirect>
------------------------------------------
Started by upstream project "Mesos-Buildbot" build number 3515
originally caused by:
Started by an SCM change
[EnvInject] - Loading node environment variables.
Building remotely on H5 (Hadoop) in workspace <https://builds.apache.org/job/Mesos-Buildbot/BUILDTOOL=autotools,COMPILER=clang,CONFIGURATION=--verbose%20--enable-libevent%20--enable-ssl,ENVIRONMENT=GLOG_v=1%20MESOS_VERBOSE=1,OS=ubuntu%3A14.04,label_exp=(docker%7C%7CHadoop)&&(!ubuntu-us1)&&(!ubuntu-eu2)/ws/>
Wiping out workspace first.
Cloning the remote Git repository
Cloning repository https://git-wip-us.apache.org/repos/asf/mesos.git
> git init <https://builds.apache.org/job/Mesos-Buildbot/BUILDTOOL=autotools,COMPILER=clang,CONFIGURATION=--verbose%20--enable-libevent%20--enable-ssl,ENVIRONMENT=GLOG_v=1%20MESOS_VERBOSE=1,OS=ubuntu%3A14.04,label_exp=(docker%7C%7CHadoop)&&(!ubuntu-us1)&&(!ubuntu-eu2)/ws/> # timeout=10
Fetching upstream changes from https://git-wip-us.apache.org/repos/asf/mesos.git
> git --version # timeout=10
> git fetch --tags --progress https://git-wip-us.apache.org/repos/asf/mesos.git +refs/heads/*:refs/remotes/origin/*
> git config remote.origin.url https://git-wip-us.apache.org/repos/asf/mesos.git # timeout=10
> git config --add remote.origin.fetch +refs/heads/*:refs/remotes/origin/* # timeout=10
> git config remote.origin.url https://git-wip-us.apache.org/repos/asf/mesos.git # timeout=10
Fetching upstream changes from https://git-wip-us.apache.org/repos/asf/mesos.git
> git fetch --tags --progress https://git-wip-us.apache.org/repos/asf/mesos.git +refs/heads/*:refs/remotes/origin/*
Checking out Revision f81b5ed368ae359ad8fd472c2d1b8bbb50d1948c (refs/tags/0.24.2-rc1)
> git config core.sparsecheckout # timeout=10
> git checkout -f f81b5ed368ae359ad8fd472c2d1b8bbb50d1948c
First time build. Skipping changelog.
[3b5a1cbc] $ /bin/bash -xe /tmp/hudson5684149611701349151.sh
+ '[' refs/tags/0.24.2-rc1 = origin/1.0.x ']'
+ ./support/jenkins/buildbot.sh
/tmp/hudson5684149611701349151.sh: line 6: ./support/jenkins/buildbot.sh: No such file or directory
Build step 'Execute shell' marked build as failure
Build failed in Jenkins: Mesos-Buildbot » autotools,clang,--verbose --enable-libevent --enable-ssl,GLOG_v=1 MESOS_VERBOSE=1,ubuntu:14.04,(docker||Hadoop)&&(!ubuntu-us1)&&(!ubuntu-eu2) #3514
Posted by Apache Jenkins Server <je...@builds.apache.org>.
See <https://builds.apache.org/job/Mesos-Buildbot/BUILDTOOL=autotools,COMPILER=clang,CONFIGURATION=--verbose%20--enable-libevent%20--enable-ssl,ENVIRONMENT=GLOG_v=1%20MESOS_VERBOSE=1,OS=ubuntu%3A14.04,label_exp=(docker%7C%7CHadoop)&&(!ubuntu-us1)&&(!ubuntu-eu2)/3514/display/redirect>
------------------------------------------
Started by upstream project "Mesos-Buildbot" build number 3514
originally caused by:
Started by an SCM change
[EnvInject] - Loading node environment variables.
Building remotely on H5 (Hadoop) in workspace <https://builds.apache.org/job/Mesos-Buildbot/BUILDTOOL=autotools,COMPILER=clang,CONFIGURATION=--verbose%20--enable-libevent%20--enable-ssl,ENVIRONMENT=GLOG_v=1%20MESOS_VERBOSE=1,OS=ubuntu%3A14.04,label_exp=(docker%7C%7CHadoop)&&(!ubuntu-us1)&&(!ubuntu-eu2)/ws/>
Wiping out workspace first.
Cloning the remote Git repository
Cloning repository https://git-wip-us.apache.org/repos/asf/mesos.git
> git init <https://builds.apache.org/job/Mesos-Buildbot/BUILDTOOL=autotools,COMPILER=clang,CONFIGURATION=--verbose%20--enable-libevent%20--enable-ssl,ENVIRONMENT=GLOG_v=1%20MESOS_VERBOSE=1,OS=ubuntu%3A14.04,label_exp=(docker%7C%7CHadoop)&&(!ubuntu-us1)&&(!ubuntu-eu2)/ws/> # timeout=10
Fetching upstream changes from https://git-wip-us.apache.org/repos/asf/mesos.git
> git --version # timeout=10
> git fetch --tags --progress https://git-wip-us.apache.org/repos/asf/mesos.git +refs/heads/*:refs/remotes/origin/*
> git config remote.origin.url https://git-wip-us.apache.org/repos/asf/mesos.git # timeout=10
> git config --add remote.origin.fetch +refs/heads/*:refs/remotes/origin/* # timeout=10
> git config remote.origin.url https://git-wip-us.apache.org/repos/asf/mesos.git # timeout=10
Fetching upstream changes from https://git-wip-us.apache.org/repos/asf/mesos.git
> git fetch --tags --progress https://git-wip-us.apache.org/repos/asf/mesos.git +refs/heads/*:refs/remotes/origin/*
Checking out Revision 9965e96b6a4db89813731236427fbeeda92c0cd2 (refs/tags/0.26.0-rc1)
> git config core.sparsecheckout # timeout=10
> git checkout -f 9965e96b6a4db89813731236427fbeeda92c0cd2
First time build. Skipping changelog.
[3b5a1cbc] $ /bin/bash -xe /tmp/hudson6733594097703273346.sh
+ '[' refs/tags/0.26.0-rc1 = origin/1.0.x ']'
+ ./support/jenkins/buildbot.sh
/tmp/hudson6733594097703273346.sh: line 6: ./support/jenkins/buildbot.sh: No such file or directory
Build step 'Execute shell' marked build as failure
Build failed in Jenkins: Mesos-Buildbot » autotools,clang,--verbose --enable-libevent --enable-ssl,GLOG_v=1 MESOS_VERBOSE=1,ubuntu:14.04,(docker||Hadoop)&&(!ubuntu-us1)&&(!ubuntu-eu2) #3513
Posted by Apache Jenkins Server <je...@builds.apache.org>.
See <https://builds.apache.org/job/Mesos-Buildbot/BUILDTOOL=autotools,COMPILER=clang,CONFIGURATION=--verbose%20--enable-libevent%20--enable-ssl,ENVIRONMENT=GLOG_v=1%20MESOS_VERBOSE=1,OS=ubuntu%3A14.04,label_exp=(docker%7C%7CHadoop)&&(!ubuntu-us1)&&(!ubuntu-eu2)/3513/display/redirect>
------------------------------------------
Started by upstream project "Mesos-Buildbot" build number 3513
originally caused by:
Started by an SCM change
Started by an SCM change
[EnvInject] - Loading node environment variables.
Building remotely on H5 (Hadoop) in workspace <https://builds.apache.org/job/Mesos-Buildbot/BUILDTOOL=autotools,COMPILER=clang,CONFIGURATION=--verbose%20--enable-libevent%20--enable-ssl,ENVIRONMENT=GLOG_v=1%20MESOS_VERBOSE=1,OS=ubuntu%3A14.04,label_exp=(docker%7C%7CHadoop)&&(!ubuntu-us1)&&(!ubuntu-eu2)/ws/>
Wiping out workspace first.
Cloning the remote Git repository
Cloning repository https://git-wip-us.apache.org/repos/asf/mesos.git
> git init <https://builds.apache.org/job/Mesos-Buildbot/BUILDTOOL=autotools,COMPILER=clang,CONFIGURATION=--verbose%20--enable-libevent%20--enable-ssl,ENVIRONMENT=GLOG_v=1%20MESOS_VERBOSE=1,OS=ubuntu%3A14.04,label_exp=(docker%7C%7CHadoop)&&(!ubuntu-us1)&&(!ubuntu-eu2)/ws/> # timeout=10
Fetching upstream changes from https://git-wip-us.apache.org/repos/asf/mesos.git
> git --version # timeout=10
> git fetch --tags --progress https://git-wip-us.apache.org/repos/asf/mesos.git +refs/heads/*:refs/remotes/origin/*
> git config remote.origin.url https://git-wip-us.apache.org/repos/asf/mesos.git # timeout=10
> git config --add remote.origin.fetch +refs/heads/*:refs/remotes/origin/* # timeout=10
> git config remote.origin.url https://git-wip-us.apache.org/repos/asf/mesos.git # timeout=10
Fetching upstream changes from https://git-wip-us.apache.org/repos/asf/mesos.git
> git fetch --tags --progress https://git-wip-us.apache.org/repos/asf/mesos.git +refs/heads/*:refs/remotes/origin/*
Checking out Revision c76b7c062321cf07473f495e973b9ba78a6b7283 (refs/tags/0.25.0-rc1)
> git config core.sparsecheckout # timeout=10
> git checkout -f c76b7c062321cf07473f495e973b9ba78a6b7283
First time build. Skipping changelog.
[3b5a1cbc] $ /bin/bash -xe /tmp/hudson4866663204281862673.sh
+ '[' refs/tags/0.25.0-rc1 = origin/1.0.x ']'
+ ./support/jenkins/buildbot.sh
/tmp/hudson4866663204281862673.sh: line 6: ./support/jenkins/buildbot.sh: No such file or directory
Build step 'Execute shell' marked build as failure
Build failed in Jenkins: Mesos-Buildbot » autotools,clang,--verbose --enable-libevent --enable-ssl,GLOG_v=1 MESOS_VERBOSE=1,ubuntu:14.04,(docker||Hadoop)&&(!ubuntu-us1)&&(!ubuntu-eu2) #3512
Posted by Apache Jenkins Server <je...@builds.apache.org>.
See <https://builds.apache.org/job/Mesos-Buildbot/BUILDTOOL=autotools,COMPILER=clang,CONFIGURATION=--verbose%20--enable-libevent%20--enable-ssl,ENVIRONMENT=GLOG_v=1%20MESOS_VERBOSE=1,OS=ubuntu%3A14.04,label_exp=(docker%7C%7CHadoop)&&(!ubuntu-us1)&&(!ubuntu-eu2)/3512/display/redirect>
------------------------------------------
Started by upstream project "Mesos-Buildbot" build number 3512
originally caused by:
Started by an SCM change
[EnvInject] - Loading node environment variables.
Building remotely on H5 (Hadoop) in workspace <https://builds.apache.org/job/Mesos-Buildbot/BUILDTOOL=autotools,COMPILER=clang,CONFIGURATION=--verbose%20--enable-libevent%20--enable-ssl,ENVIRONMENT=GLOG_v=1%20MESOS_VERBOSE=1,OS=ubuntu%3A14.04,label_exp=(docker%7C%7CHadoop)&&(!ubuntu-us1)&&(!ubuntu-eu2)/ws/>
Wiping out workspace first.
Cloning the remote Git repository
Cloning repository https://git-wip-us.apache.org/repos/asf/mesos.git
> git init <https://builds.apache.org/job/Mesos-Buildbot/BUILDTOOL=autotools,COMPILER=clang,CONFIGURATION=--verbose%20--enable-libevent%20--enable-ssl,ENVIRONMENT=GLOG_v=1%20MESOS_VERBOSE=1,OS=ubuntu%3A14.04,label_exp=(docker%7C%7CHadoop)&&(!ubuntu-us1)&&(!ubuntu-eu2)/ws/> # timeout=10
Fetching upstream changes from https://git-wip-us.apache.org/repos/asf/mesos.git
> git --version # timeout=10
> git fetch --tags --progress https://git-wip-us.apache.org/repos/asf/mesos.git +refs/heads/*:refs/remotes/origin/*
> git config remote.origin.url https://git-wip-us.apache.org/repos/asf/mesos.git # timeout=10
> git config --add remote.origin.fetch +refs/heads/*:refs/remotes/origin/* # timeout=10
> git config remote.origin.url https://git-wip-us.apache.org/repos/asf/mesos.git # timeout=10
Fetching upstream changes from https://git-wip-us.apache.org/repos/asf/mesos.git
> git fetch --tags --progress https://git-wip-us.apache.org/repos/asf/mesos.git +refs/heads/*:refs/remotes/origin/*
Checking out Revision 93bc98bacf3e99ead93c253f7736cbed50d2170d (refs/tags/0.21.2, refs/tags/0.21.2-rc1)
> git config core.sparsecheckout # timeout=10
> git checkout -f 93bc98bacf3e99ead93c253f7736cbed50d2170d
First time build. Skipping changelog.
[3b5a1cbc] $ /bin/bash -xe /tmp/hudson8207946206108247572.sh
+ '[' refs/tags/0.21.2 = origin/1.0.x ']'
+ ./support/jenkins/buildbot.sh
/tmp/hudson8207946206108247572.sh: line 6: ./support/jenkins/buildbot.sh: No such file or directory
Build step 'Execute shell' marked build as failure
Build failed in Jenkins: Mesos-Buildbot » autotools,clang,--verbose --enable-libevent --enable-ssl,GLOG_v=1 MESOS_VERBOSE=1,ubuntu:14.04,(docker||Hadoop)&&(!ubuntu-us1)&&(!ubuntu-eu2) #3511
Posted by Apache Jenkins Server <je...@builds.apache.org>.
See <https://builds.apache.org/job/Mesos-Buildbot/BUILDTOOL=autotools,COMPILER=clang,CONFIGURATION=--verbose%20--enable-libevent%20--enable-ssl,ENVIRONMENT=GLOG_v=1%20MESOS_VERBOSE=1,OS=ubuntu%3A14.04,label_exp=(docker%7C%7CHadoop)&&(!ubuntu-us1)&&(!ubuntu-eu2)/3511/display/redirect>
------------------------------------------
Started by upstream project "Mesos-Buildbot" build number 3511
originally caused by:
Started by an SCM change
[EnvInject] - Loading node environment variables.
Building remotely on H5 (Hadoop) in workspace <https://builds.apache.org/job/Mesos-Buildbot/BUILDTOOL=autotools,COMPILER=clang,CONFIGURATION=--verbose%20--enable-libevent%20--enable-ssl,ENVIRONMENT=GLOG_v=1%20MESOS_VERBOSE=1,OS=ubuntu%3A14.04,label_exp=(docker%7C%7CHadoop)&&(!ubuntu-us1)&&(!ubuntu-eu2)/ws/>
Wiping out workspace first.
Cloning the remote Git repository
Cloning repository https://git-wip-us.apache.org/repos/asf/mesos.git
> git init <https://builds.apache.org/job/Mesos-Buildbot/BUILDTOOL=autotools,COMPILER=clang,CONFIGURATION=--verbose%20--enable-libevent%20--enable-ssl,ENVIRONMENT=GLOG_v=1%20MESOS_VERBOSE=1,OS=ubuntu%3A14.04,label_exp=(docker%7C%7CHadoop)&&(!ubuntu-us1)&&(!ubuntu-eu2)/ws/> # timeout=10
Fetching upstream changes from https://git-wip-us.apache.org/repos/asf/mesos.git
> git --version # timeout=10
> git fetch --tags --progress https://git-wip-us.apache.org/repos/asf/mesos.git +refs/heads/*:refs/remotes/origin/*
> git config remote.origin.url https://git-wip-us.apache.org/repos/asf/mesos.git # timeout=10
> git config --add remote.origin.fetch +refs/heads/*:refs/remotes/origin/* # timeout=10
> git config remote.origin.url https://git-wip-us.apache.org/repos/asf/mesos.git # timeout=10
Fetching upstream changes from https://git-wip-us.apache.org/repos/asf/mesos.git
> git fetch --tags --progress https://git-wip-us.apache.org/repos/asf/mesos.git +refs/heads/*:refs/remotes/origin/*
Checking out Revision 12e7f4599c077637516cd8415aa4706222ac0968 (refs/tags/0.22.2, refs/tags/0.22.2-rc1)
> git config core.sparsecheckout # timeout=10
> git checkout -f 12e7f4599c077637516cd8415aa4706222ac0968
First time build. Skipping changelog.
[3b5a1cbc] $ /bin/bash -xe /tmp/hudson9016540771211994910.sh
+ '[' refs/tags/0.22.2 = origin/1.0.x ']'
+ ./support/jenkins/buildbot.sh
/tmp/hudson9016540771211994910.sh: line 6: ./support/jenkins/buildbot.sh: No such file or directory
Build step 'Execute shell' marked build as failure
Build failed in Jenkins: Mesos-Buildbot » autotools,clang,--verbose --enable-libevent --enable-ssl,GLOG_v=1 MESOS_VERBOSE=1,ubuntu:14.04,(docker||Hadoop)&&(!ubuntu-us1)&&(!ubuntu-eu2) #3510
Posted by Apache Jenkins Server <je...@builds.apache.org>.
See <https://builds.apache.org/job/Mesos-Buildbot/BUILDTOOL=autotools,COMPILER=clang,CONFIGURATION=--verbose%20--enable-libevent%20--enable-ssl,ENVIRONMENT=GLOG_v=1%20MESOS_VERBOSE=1,OS=ubuntu%3A14.04,label_exp=(docker%7C%7CHadoop)&&(!ubuntu-us1)&&(!ubuntu-eu2)/3510/display/redirect>
------------------------------------------
Started by upstream project "Mesos-Buildbot" build number 3510
originally caused by:
Started by an SCM change
[EnvInject] - Loading node environment variables.
Building remotely on H5 (Hadoop) in workspace <https://builds.apache.org/job/Mesos-Buildbot/BUILDTOOL=autotools,COMPILER=clang,CONFIGURATION=--verbose%20--enable-libevent%20--enable-ssl,ENVIRONMENT=GLOG_v=1%20MESOS_VERBOSE=1,OS=ubuntu%3A14.04,label_exp=(docker%7C%7CHadoop)&&(!ubuntu-us1)&&(!ubuntu-eu2)/ws/>
Wiping out workspace first.
Cloning the remote Git repository
Cloning repository https://git-wip-us.apache.org/repos/asf/mesos.git
> git init <https://builds.apache.org/job/Mesos-Buildbot/BUILDTOOL=autotools,COMPILER=clang,CONFIGURATION=--verbose%20--enable-libevent%20--enable-ssl,ENVIRONMENT=GLOG_v=1%20MESOS_VERBOSE=1,OS=ubuntu%3A14.04,label_exp=(docker%7C%7CHadoop)&&(!ubuntu-us1)&&(!ubuntu-eu2)/ws/> # timeout=10
Fetching upstream changes from https://git-wip-us.apache.org/repos/asf/mesos.git
> git --version # timeout=10
> git fetch --tags --progress https://git-wip-us.apache.org/repos/asf/mesos.git +refs/heads/*:refs/remotes/origin/*
> git config remote.origin.url https://git-wip-us.apache.org/repos/asf/mesos.git # timeout=10
> git config --add remote.origin.fetch +refs/heads/*:refs/remotes/origin/* # timeout=10
> git config remote.origin.url https://git-wip-us.apache.org/repos/asf/mesos.git # timeout=10
Fetching upstream changes from https://git-wip-us.apache.org/repos/asf/mesos.git
> git fetch --tags --progress https://git-wip-us.apache.org/repos/asf/mesos.git +refs/heads/*:refs/remotes/origin/*
Checking out Revision a9ea8b104bf94902789d8691a21801335ccf2a9c (refs/tags/0.23.1, refs/tags/0.23.1-rc1)
> git config core.sparsecheckout # timeout=10
> git checkout -f a9ea8b104bf94902789d8691a21801335ccf2a9c
First time build. Skipping changelog.
[3b5a1cbc] $ /bin/bash -xe /tmp/hudson8300554015547221012.sh
+ '[' refs/tags/0.23.1 = origin/1.0.x ']'
+ ./support/jenkins/buildbot.sh
/tmp/hudson8300554015547221012.sh: line 6: ./support/jenkins/buildbot.sh: No such file or directory
Build step 'Execute shell' marked build as failure
Build failed in Jenkins: Mesos-Buildbot » autotools,clang,--verbose --enable-libevent --enable-ssl,GLOG_v=1 MESOS_VERBOSE=1,ubuntu:14.04,(docker||Hadoop)&&(!ubuntu-us1)&&(!ubuntu-eu2) #3509
Posted by Apache Jenkins Server <je...@builds.apache.org>.
See <https://builds.apache.org/job/Mesos-Buildbot/BUILDTOOL=autotools,COMPILER=clang,CONFIGURATION=--verbose%20--enable-libevent%20--enable-ssl,ENVIRONMENT=GLOG_v=1%20MESOS_VERBOSE=1,OS=ubuntu%3A14.04,label_exp=(docker%7C%7CHadoop)&&(!ubuntu-us1)&&(!ubuntu-eu2)/3509/display/redirect>
------------------------------------------
Started by upstream project "Mesos-Buildbot" build number 3509
originally caused by:
Started by an SCM change
[EnvInject] - Loading node environment variables.
Building remotely on H5 (Hadoop) in workspace <https://builds.apache.org/job/Mesos-Buildbot/BUILDTOOL=autotools,COMPILER=clang,CONFIGURATION=--verbose%20--enable-libevent%20--enable-ssl,ENVIRONMENT=GLOG_v=1%20MESOS_VERBOSE=1,OS=ubuntu%3A14.04,label_exp=(docker%7C%7CHadoop)&&(!ubuntu-us1)&&(!ubuntu-eu2)/ws/>
Wiping out workspace first.
Cloning the remote Git repository
Cloning repository https://git-wip-us.apache.org/repos/asf/mesos.git
> git init <https://builds.apache.org/job/Mesos-Buildbot/BUILDTOOL=autotools,COMPILER=clang,CONFIGURATION=--verbose%20--enable-libevent%20--enable-ssl,ENVIRONMENT=GLOG_v=1%20MESOS_VERBOSE=1,OS=ubuntu%3A14.04,label_exp=(docker%7C%7CHadoop)&&(!ubuntu-us1)&&(!ubuntu-eu2)/ws/> # timeout=10
Fetching upstream changes from https://git-wip-us.apache.org/repos/asf/mesos.git
> git --version # timeout=10
> git fetch --tags --progress https://git-wip-us.apache.org/repos/asf/mesos.git +refs/heads/*:refs/remotes/origin/*
> git config remote.origin.url https://git-wip-us.apache.org/repos/asf/mesos.git # timeout=10
> git config --add remote.origin.fetch +refs/heads/*:refs/remotes/origin/* # timeout=10
> git config remote.origin.url https://git-wip-us.apache.org/repos/asf/mesos.git # timeout=10
Fetching upstream changes from https://git-wip-us.apache.org/repos/asf/mesos.git
> git fetch --tags --progress https://git-wip-us.apache.org/repos/asf/mesos.git +refs/heads/*:refs/remotes/origin/*
Checking out Revision 69e99287448a3c2e24899618793573e76b250e05 (refs/tags/0.22.1-rc1)
> git config core.sparsecheckout # timeout=10
> git checkout -f 69e99287448a3c2e24899618793573e76b250e05
First time build. Skipping changelog.
[3b5a1cbc] $ /bin/bash -xe /tmp/hudson8695210233151634947.sh
+ '[' refs/tags/0.22.1-rc1 = origin/1.0.x ']'
+ ./support/jenkins/buildbot.sh
/tmp/hudson8695210233151634947.sh: line 6: ./support/jenkins/buildbot.sh: No such file or directory
Build step 'Execute shell' marked build as failure
Build failed in Jenkins: Mesos-Buildbot » autotools,clang,--verbose --enable-libevent --enable-ssl,GLOG_v=1 MESOS_VERBOSE=1,ubuntu:14.04,(docker||Hadoop)&&(!ubuntu-us1)&&(!ubuntu-eu2) #3508
Posted by Apache Jenkins Server <je...@builds.apache.org>.
See <https://builds.apache.org/job/Mesos-Buildbot/BUILDTOOL=autotools,COMPILER=clang,CONFIGURATION=--verbose%20--enable-libevent%20--enable-ssl,ENVIRONMENT=GLOG_v=1%20MESOS_VERBOSE=1,OS=ubuntu%3A14.04,label_exp=(docker%7C%7CHadoop)&&(!ubuntu-us1)&&(!ubuntu-eu2)/3508/display/redirect>
------------------------------------------
Started by upstream project "Mesos-Buildbot" build number 3508
originally caused by:
Started by an SCM change
Started by an SCM change
[EnvInject] - Loading node environment variables.
Building remotely on H5 (Hadoop) in workspace <https://builds.apache.org/job/Mesos-Buildbot/BUILDTOOL=autotools,COMPILER=clang,CONFIGURATION=--verbose%20--enable-libevent%20--enable-ssl,ENVIRONMENT=GLOG_v=1%20MESOS_VERBOSE=1,OS=ubuntu%3A14.04,label_exp=(docker%7C%7CHadoop)&&(!ubuntu-us1)&&(!ubuntu-eu2)/ws/>
Wiping out workspace first.
Cloning the remote Git repository
Cloning repository https://git-wip-us.apache.org/repos/asf/mesos.git
> git init <https://builds.apache.org/job/Mesos-Buildbot/BUILDTOOL=autotools,COMPILER=clang,CONFIGURATION=--verbose%20--enable-libevent%20--enable-ssl,ENVIRONMENT=GLOG_v=1%20MESOS_VERBOSE=1,OS=ubuntu%3A14.04,label_exp=(docker%7C%7CHadoop)&&(!ubuntu-us1)&&(!ubuntu-eu2)/ws/> # timeout=10
Fetching upstream changes from https://git-wip-us.apache.org/repos/asf/mesos.git
> git --version # timeout=10
> git fetch --tags --progress https://git-wip-us.apache.org/repos/asf/mesos.git +refs/heads/*:refs/remotes/origin/*
> git config remote.origin.url https://git-wip-us.apache.org/repos/asf/mesos.git # timeout=10
> git config --add remote.origin.fetch +refs/heads/*:refs/remotes/origin/* # timeout=10
> git config remote.origin.url https://git-wip-us.apache.org/repos/asf/mesos.git # timeout=10
Fetching upstream changes from https://git-wip-us.apache.org/repos/asf/mesos.git
> git fetch --tags --progress https://git-wip-us.apache.org/repos/asf/mesos.git +refs/heads/*:refs/remotes/origin/*
Checking out Revision 96d3f63866cabaf2396503ddfcc857e82779ab4d (refs/tags/0.22.0-rc3)
> git config core.sparsecheckout # timeout=10
> git checkout -f 96d3f63866cabaf2396503ddfcc857e82779ab4d
First time build. Skipping changelog.
[3b5a1cbc] $ /bin/bash -xe /tmp/hudson7149126720168710370.sh
+ '[' refs/tags/0.22.0-rc3 = origin/1.0.x ']'
+ ./support/jenkins/buildbot.sh
/tmp/hudson7149126720168710370.sh: line 6: ./support/jenkins/buildbot.sh: No such file or directory
Build step 'Execute shell' marked build as failure
Build failed in Jenkins: Mesos-Buildbot » autotools,clang,--verbose --enable-libevent --enable-ssl,GLOG_v=1 MESOS_VERBOSE=1,ubuntu:14.04,(docker||Hadoop)&&(!ubuntu-us1)&&(!ubuntu-eu2) #3507
Posted by Apache Jenkins Server <je...@builds.apache.org>.
See <https://builds.apache.org/job/Mesos-Buildbot/BUILDTOOL=autotools,COMPILER=clang,CONFIGURATION=--verbose%20--enable-libevent%20--enable-ssl,ENVIRONMENT=GLOG_v=1%20MESOS_VERBOSE=1,OS=ubuntu%3A14.04,label_exp=(docker%7C%7CHadoop)&&(!ubuntu-us1)&&(!ubuntu-eu2)/3507/display/redirect>
------------------------------------------
Started by upstream project "Mesos-Buildbot" build number 3507
originally caused by:
Started by an SCM change
[EnvInject] - Loading node environment variables.
Building remotely on H5 (Hadoop) in workspace <https://builds.apache.org/job/Mesos-Buildbot/BUILDTOOL=autotools,COMPILER=clang,CONFIGURATION=--verbose%20--enable-libevent%20--enable-ssl,ENVIRONMENT=GLOG_v=1%20MESOS_VERBOSE=1,OS=ubuntu%3A14.04,label_exp=(docker%7C%7CHadoop)&&(!ubuntu-us1)&&(!ubuntu-eu2)/ws/>
Wiping out workspace first.
Cloning the remote Git repository
Cloning repository https://git-wip-us.apache.org/repos/asf/mesos.git
> git init <https://builds.apache.org/job/Mesos-Buildbot/BUILDTOOL=autotools,COMPILER=clang,CONFIGURATION=--verbose%20--enable-libevent%20--enable-ssl,ENVIRONMENT=GLOG_v=1%20MESOS_VERBOSE=1,OS=ubuntu%3A14.04,label_exp=(docker%7C%7CHadoop)&&(!ubuntu-us1)&&(!ubuntu-eu2)/ws/> # timeout=10
Fetching upstream changes from https://git-wip-us.apache.org/repos/asf/mesos.git
> git --version # timeout=10
> git fetch --tags --progress https://git-wip-us.apache.org/repos/asf/mesos.git +refs/heads/*:refs/remotes/origin/*
> git config remote.origin.url https://git-wip-us.apache.org/repos/asf/mesos.git # timeout=10
> git config --add remote.origin.fetch +refs/heads/*:refs/remotes/origin/* # timeout=10
> git config remote.origin.url https://git-wip-us.apache.org/repos/asf/mesos.git # timeout=10
Fetching upstream changes from https://git-wip-us.apache.org/repos/asf/mesos.git
> git fetch --tags --progress https://git-wip-us.apache.org/repos/asf/mesos.git +refs/heads/*:refs/remotes/origin/*
Checking out Revision e51fb50e44b7de2e8403ead8439682b8e0bc7d59 (refs/tags/0.22.0-rc2)
> git config core.sparsecheckout # timeout=10
> git checkout -f e51fb50e44b7de2e8403ead8439682b8e0bc7d59
First time build. Skipping changelog.
[3b5a1cbc] $ /bin/bash -xe /tmp/hudson2525897119809232832.sh
+ '[' refs/tags/0.22.0-rc2 = origin/1.0.x ']'
+ ./support/jenkins/buildbot.sh
/tmp/hudson2525897119809232832.sh: line 6: ./support/jenkins/buildbot.sh: No such file or directory
Build step 'Execute shell' marked build as failure
Build failed in Jenkins: Mesos-Buildbot » autotools,clang,--verbose --enable-libevent --enable-ssl,GLOG_v=1 MESOS_VERBOSE=1,ubuntu:14.04,(docker||Hadoop)&&(!ubuntu-us1)&&(!ubuntu-eu2) #3506
Posted by Apache Jenkins Server <je...@builds.apache.org>.
See <https://builds.apache.org/job/Mesos-Buildbot/BUILDTOOL=autotools,COMPILER=clang,CONFIGURATION=--verbose%20--enable-libevent%20--enable-ssl,ENVIRONMENT=GLOG_v=1%20MESOS_VERBOSE=1,OS=ubuntu%3A14.04,label_exp=(docker%7C%7CHadoop)&&(!ubuntu-us1)&&(!ubuntu-eu2)/3506/display/redirect>
------------------------------------------
Started by upstream project "Mesos-Buildbot" build number 3506
originally caused by:
Started by an SCM change
[EnvInject] - Loading node environment variables.
Building remotely on H5 (Hadoop) in workspace <https://builds.apache.org/job/Mesos-Buildbot/BUILDTOOL=autotools,COMPILER=clang,CONFIGURATION=--verbose%20--enable-libevent%20--enable-ssl,ENVIRONMENT=GLOG_v=1%20MESOS_VERBOSE=1,OS=ubuntu%3A14.04,label_exp=(docker%7C%7CHadoop)&&(!ubuntu-us1)&&(!ubuntu-eu2)/ws/>
Wiping out workspace first.
Cloning the remote Git repository
Cloning repository https://git-wip-us.apache.org/repos/asf/mesos.git
> git init <https://builds.apache.org/job/Mesos-Buildbot/BUILDTOOL=autotools,COMPILER=clang,CONFIGURATION=--verbose%20--enable-libevent%20--enable-ssl,ENVIRONMENT=GLOG_v=1%20MESOS_VERBOSE=1,OS=ubuntu%3A14.04,label_exp=(docker%7C%7CHadoop)&&(!ubuntu-us1)&&(!ubuntu-eu2)/ws/> # timeout=10
Fetching upstream changes from https://git-wip-us.apache.org/repos/asf/mesos.git
> git --version # timeout=10
> git fetch --tags --progress https://git-wip-us.apache.org/repos/asf/mesos.git +refs/heads/*:refs/remotes/origin/*
> git config remote.origin.url https://git-wip-us.apache.org/repos/asf/mesos.git # timeout=10
> git config --add remote.origin.fetch +refs/heads/*:refs/remotes/origin/* # timeout=10
> git config remote.origin.url https://git-wip-us.apache.org/repos/asf/mesos.git # timeout=10
Fetching upstream changes from https://git-wip-us.apache.org/repos/asf/mesos.git
> git fetch --tags --progress https://git-wip-us.apache.org/repos/asf/mesos.git +refs/heads/*:refs/remotes/origin/*
Checking out Revision fe0a39112f3304283f970f1b08b322b1e970829d (refs/tags/0.20.1-rc3, refs/tags/0.20.1)
> git config core.sparsecheckout # timeout=10
> git checkout -f fe0a39112f3304283f970f1b08b322b1e970829d
First time build. Skipping changelog.
[3b5a1cbc] $ /bin/bash -xe /tmp/hudson1714544106344619972.sh
+ '[' refs/tags/0.20.1-rc3 = origin/1.0.x ']'
+ ./support/jenkins/buildbot.sh
/tmp/hudson1714544106344619972.sh: line 6: ./support/jenkins/buildbot.sh: No such file or directory
Build step 'Execute shell' marked build as failure
Build failed in Jenkins: Mesos-Buildbot » autotools,clang,--verbose --enable-libevent --enable-ssl,GLOG_v=1 MESOS_VERBOSE=1,ubuntu:14.04,(docker||Hadoop)&&(!ubuntu-us1)&&(!ubuntu-eu2) #3505
Posted by Apache Jenkins Server <je...@builds.apache.org>.
See <https://builds.apache.org/job/Mesos-Buildbot/BUILDTOOL=autotools,COMPILER=clang,CONFIGURATION=--verbose%20--enable-libevent%20--enable-ssl,ENVIRONMENT=GLOG_v=1%20MESOS_VERBOSE=1,OS=ubuntu%3A14.04,label_exp=(docker%7C%7CHadoop)&&(!ubuntu-us1)&&(!ubuntu-eu2)/3505/display/redirect>
------------------------------------------
Started by upstream project "Mesos-Buildbot" build number 3505
originally caused by:
Started by an SCM change
[EnvInject] - Loading node environment variables.
Building remotely on H5 (Hadoop) in workspace <https://builds.apache.org/job/Mesos-Buildbot/BUILDTOOL=autotools,COMPILER=clang,CONFIGURATION=--verbose%20--enable-libevent%20--enable-ssl,ENVIRONMENT=GLOG_v=1%20MESOS_VERBOSE=1,OS=ubuntu%3A14.04,label_exp=(docker%7C%7CHadoop)&&(!ubuntu-us1)&&(!ubuntu-eu2)/ws/>
Wiping out workspace first.
Cloning the remote Git repository
Cloning repository https://git-wip-us.apache.org/repos/asf/mesos.git
> git init <https://builds.apache.org/job/Mesos-Buildbot/BUILDTOOL=autotools,COMPILER=clang,CONFIGURATION=--verbose%20--enable-libevent%20--enable-ssl,ENVIRONMENT=GLOG_v=1%20MESOS_VERBOSE=1,OS=ubuntu%3A14.04,label_exp=(docker%7C%7CHadoop)&&(!ubuntu-us1)&&(!ubuntu-eu2)/ws/> # timeout=10
Fetching upstream changes from https://git-wip-us.apache.org/repos/asf/mesos.git
> git --version # timeout=10
> git fetch --tags --progress https://git-wip-us.apache.org/repos/asf/mesos.git +refs/heads/*:refs/remotes/origin/*
> git config remote.origin.url https://git-wip-us.apache.org/repos/asf/mesos.git # timeout=10
> git config --add remote.origin.fetch +refs/heads/*:refs/remotes/origin/* # timeout=10
> git config remote.origin.url https://git-wip-us.apache.org/repos/asf/mesos.git # timeout=10
Fetching upstream changes from https://git-wip-us.apache.org/repos/asf/mesos.git
> git fetch --tags --progress https://git-wip-us.apache.org/repos/asf/mesos.git +refs/heads/*:refs/remotes/origin/*
Checking out Revision dc0b7bf2a1a7981079b33a16b689892f9cda0d8d (refs/tags/0.19.1, refs/tags/0.19.1-rc1)
> git config core.sparsecheckout # timeout=10
> git checkout -f dc0b7bf2a1a7981079b33a16b689892f9cda0d8d
First time build. Skipping changelog.
[3b5a1cbc] $ /bin/bash -xe /tmp/hudson5878282736399040204.sh
+ '[' refs/tags/0.19.1 = origin/1.0.x ']'
+ ./support/jenkins/buildbot.sh
/tmp/hudson5878282736399040204.sh: line 6: ./support/jenkins/buildbot.sh: No such file or directory
Build step 'Execute shell' marked build as failure
Build failed in Jenkins: Mesos-Buildbot » autotools,clang,--verbose --enable-libevent --enable-ssl,GLOG_v=1 MESOS_VERBOSE=1,ubuntu:14.04,(docker||Hadoop)&&(!ubuntu-us1)&&(!ubuntu-eu2) #3504
Posted by Apache Jenkins Server <je...@builds.apache.org>.
See <https://builds.apache.org/job/Mesos-Buildbot/BUILDTOOL=autotools,COMPILER=clang,CONFIGURATION=--verbose%20--enable-libevent%20--enable-ssl,ENVIRONMENT=GLOG_v=1%20MESOS_VERBOSE=1,OS=ubuntu%3A14.04,label_exp=(docker%7C%7CHadoop)&&(!ubuntu-us1)&&(!ubuntu-eu2)/3504/display/redirect>
------------------------------------------
Started by upstream project "Mesos-Buildbot" build number 3504
originally caused by:
Started by an SCM change
Started by an SCM change
[EnvInject] - Loading node environment variables.
Building remotely on H5 (Hadoop) in workspace <https://builds.apache.org/job/Mesos-Buildbot/BUILDTOOL=autotools,COMPILER=clang,CONFIGURATION=--verbose%20--enable-libevent%20--enable-ssl,ENVIRONMENT=GLOG_v=1%20MESOS_VERBOSE=1,OS=ubuntu%3A14.04,label_exp=(docker%7C%7CHadoop)&&(!ubuntu-us1)&&(!ubuntu-eu2)/ws/>
Wiping out workspace first.
Cloning the remote Git repository
Cloning repository https://git-wip-us.apache.org/repos/asf/mesos.git
> git init <https://builds.apache.org/job/Mesos-Buildbot/BUILDTOOL=autotools,COMPILER=clang,CONFIGURATION=--verbose%20--enable-libevent%20--enable-ssl,ENVIRONMENT=GLOG_v=1%20MESOS_VERBOSE=1,OS=ubuntu%3A14.04,label_exp=(docker%7C%7CHadoop)&&(!ubuntu-us1)&&(!ubuntu-eu2)/ws/> # timeout=10
Fetching upstream changes from https://git-wip-us.apache.org/repos/asf/mesos.git
> git --version # timeout=10
> git fetch --tags --progress https://git-wip-us.apache.org/repos/asf/mesos.git +refs/heads/*:refs/remotes/origin/*
> git config remote.origin.url https://git-wip-us.apache.org/repos/asf/mesos.git # timeout=10
> git config --add remote.origin.fetch +refs/heads/*:refs/remotes/origin/* # timeout=10
> git config remote.origin.url https://git-wip-us.apache.org/repos/asf/mesos.git # timeout=10
Fetching upstream changes from https://git-wip-us.apache.org/repos/asf/mesos.git
> git fetch --tags --progress https://git-wip-us.apache.org/repos/asf/mesos.git +refs/heads/*:refs/remotes/origin/*
Checking out Revision 453b973bf93d55a3a8e5d7059e99c00ea460530e (refs/tags/0.18.2-rc1, refs/tags/0.18.2)
> git config core.sparsecheckout # timeout=10
> git checkout -f 453b973bf93d55a3a8e5d7059e99c00ea460530e
First time build. Skipping changelog.
[3b5a1cbc] $ /bin/bash -xe /tmp/hudson5482030477123388265.sh
+ '[' refs/tags/0.18.2-rc1 = origin/1.0.x ']'
+ ./support/jenkins/buildbot.sh
/tmp/hudson5482030477123388265.sh: line 6: ./support/jenkins/buildbot.sh: No such file or directory
Build step 'Execute shell' marked build as failure
Build failed in Jenkins: Mesos-Buildbot » autotools,clang,--verbose --enable-libevent --enable-ssl,GLOG_v=1 MESOS_VERBOSE=1,ubuntu:14.04,(docker||Hadoop)&&(!ubuntu-us1)&&(!ubuntu-eu2) #3503
Posted by Apache Jenkins Server <je...@builds.apache.org>.
See <https://builds.apache.org/job/Mesos-Buildbot/BUILDTOOL=autotools,COMPILER=clang,CONFIGURATION=--verbose%20--enable-libevent%20--enable-ssl,ENVIRONMENT=GLOG_v=1%20MESOS_VERBOSE=1,OS=ubuntu%3A14.04,label_exp=(docker%7C%7CHadoop)&&(!ubuntu-us1)&&(!ubuntu-eu2)/3503/display/redirect>
------------------------------------------
Started by upstream project "Mesos-Buildbot" build number 3503
originally caused by:
Started by an SCM change
[EnvInject] - Loading node environment variables.
Building remotely on H5 (Hadoop) in workspace <https://builds.apache.org/job/Mesos-Buildbot/BUILDTOOL=autotools,COMPILER=clang,CONFIGURATION=--verbose%20--enable-libevent%20--enable-ssl,ENVIRONMENT=GLOG_v=1%20MESOS_VERBOSE=1,OS=ubuntu%3A14.04,label_exp=(docker%7C%7CHadoop)&&(!ubuntu-us1)&&(!ubuntu-eu2)/ws/>
Wiping out workspace first.
Cloning the remote Git repository
Cloning repository https://git-wip-us.apache.org/repos/asf/mesos.git
> git init <https://builds.apache.org/job/Mesos-Buildbot/BUILDTOOL=autotools,COMPILER=clang,CONFIGURATION=--verbose%20--enable-libevent%20--enable-ssl,ENVIRONMENT=GLOG_v=1%20MESOS_VERBOSE=1,OS=ubuntu%3A14.04,label_exp=(docker%7C%7CHadoop)&&(!ubuntu-us1)&&(!ubuntu-eu2)/ws/> # timeout=10
Fetching upstream changes from https://git-wip-us.apache.org/repos/asf/mesos.git
> git --version # timeout=10
> git fetch --tags --progress https://git-wip-us.apache.org/repos/asf/mesos.git +refs/heads/*:refs/remotes/origin/*
> git config remote.origin.url https://git-wip-us.apache.org/repos/asf/mesos.git # timeout=10
> git config --add remote.origin.fetch +refs/heads/*:refs/remotes/origin/* # timeout=10
> git config remote.origin.url https://git-wip-us.apache.org/repos/asf/mesos.git # timeout=10
Fetching upstream changes from https://git-wip-us.apache.org/repos/asf/mesos.git
> git fetch --tags --progress https://git-wip-us.apache.org/repos/asf/mesos.git +refs/heads/*:refs/remotes/origin/*
Checking out Revision 1094c1baba95e2fce8ce76b8f46967774dde5a35 (refs/tags/0.17.0-rc2, refs/tags/0.17.0)
> git config core.sparsecheckout # timeout=10
> git checkout -f 1094c1baba95e2fce8ce76b8f46967774dde5a35
First time build. Skipping changelog.
[3b5a1cbc] $ /bin/bash -xe /tmp/hudson7386899973168855886.sh
+ '[' refs/tags/0.17.0-rc2 = origin/1.0.x ']'
+ ./support/jenkins/buildbot.sh
/tmp/hudson7386899973168855886.sh: line 6: ./support/jenkins/buildbot.sh: No such file or directory
Build step 'Execute shell' marked build as failure
Build failed in Jenkins: Mesos-Buildbot » autotools,clang,--verbose --enable-libevent --enable-ssl,GLOG_v=1 MESOS_VERBOSE=1,ubuntu:14.04,(docker||Hadoop)&&(!ubuntu-us1)&&(!ubuntu-eu2) #3502
Posted by Apache Jenkins Server <je...@builds.apache.org>.
See <https://builds.apache.org/job/Mesos-Buildbot/BUILDTOOL=autotools,COMPILER=clang,CONFIGURATION=--verbose%20--enable-libevent%20--enable-ssl,ENVIRONMENT=GLOG_v=1%20MESOS_VERBOSE=1,OS=ubuntu%3A14.04,label_exp=(docker%7C%7CHadoop)&&(!ubuntu-us1)&&(!ubuntu-eu2)/3502/display/redirect>
------------------------------------------
Started by upstream project "Mesos-Buildbot" build number 3502
originally caused by:
Started by an SCM change
[EnvInject] - Loading node environment variables.
Building remotely on H5 (Hadoop) in workspace <https://builds.apache.org/job/Mesos-Buildbot/BUILDTOOL=autotools,COMPILER=clang,CONFIGURATION=--verbose%20--enable-libevent%20--enable-ssl,ENVIRONMENT=GLOG_v=1%20MESOS_VERBOSE=1,OS=ubuntu%3A14.04,label_exp=(docker%7C%7CHadoop)&&(!ubuntu-us1)&&(!ubuntu-eu2)/ws/>
Wiping out workspace first.
Cloning the remote Git repository
Cloning repository https://git-wip-us.apache.org/repos/asf/mesos.git
> git init <https://builds.apache.org/job/Mesos-Buildbot/BUILDTOOL=autotools,COMPILER=clang,CONFIGURATION=--verbose%20--enable-libevent%20--enable-ssl,ENVIRONMENT=GLOG_v=1%20MESOS_VERBOSE=1,OS=ubuntu%3A14.04,label_exp=(docker%7C%7CHadoop)&&(!ubuntu-us1)&&(!ubuntu-eu2)/ws/> # timeout=10
Fetching upstream changes from https://git-wip-us.apache.org/repos/asf/mesos.git
> git --version # timeout=10
> git fetch --tags --progress https://git-wip-us.apache.org/repos/asf/mesos.git +refs/heads/*:refs/remotes/origin/*
> git config remote.origin.url https://git-wip-us.apache.org/repos/asf/mesos.git # timeout=10
> git config --add remote.origin.fetch +refs/heads/*:refs/remotes/origin/* # timeout=10
> git config remote.origin.url https://git-wip-us.apache.org/repos/asf/mesos.git # timeout=10
Fetching upstream changes from https://git-wip-us.apache.org/repos/asf/mesos.git
> git fetch --tags --progress https://git-wip-us.apache.org/repos/asf/mesos.git +refs/heads/*:refs/remotes/origin/*
Checking out Revision b7e27cfac378c9e0a81596081fa4c65c7cea301a (refs/tags/0.16.0-rc5, refs/tags/0.16.0)
> git config core.sparsecheckout # timeout=10
> git checkout -f b7e27cfac378c9e0a81596081fa4c65c7cea301a
First time build. Skipping changelog.
[3b5a1cbc] $ /bin/bash -xe /tmp/hudson1843951354281681199.sh
+ '[' refs/tags/0.16.0-rc5 = origin/1.0.x ']'
+ ./support/jenkins/buildbot.sh
/tmp/hudson1843951354281681199.sh: line 6: ./support/jenkins/buildbot.sh: No such file or directory
Build step 'Execute shell' marked build as failure
Build failed in Jenkins: Mesos-Buildbot » autotools,clang,--verbose --enable-libevent --enable-ssl,GLOG_v=1 MESOS_VERBOSE=1,ubuntu:14.04,(docker||Hadoop)&&(!ubuntu-us1)&&(!ubuntu-eu2) #3501
Posted by Apache Jenkins Server <je...@builds.apache.org>.
See <https://builds.apache.org/job/Mesos-Buildbot/BUILDTOOL=autotools,COMPILER=clang,CONFIGURATION=--verbose%20--enable-libevent%20--enable-ssl,ENVIRONMENT=GLOG_v=1%20MESOS_VERBOSE=1,OS=ubuntu%3A14.04,label_exp=(docker%7C%7CHadoop)&&(!ubuntu-us1)&&(!ubuntu-eu2)/3501/display/redirect>
------------------------------------------
Started by upstream project "Mesos-Buildbot" build number 3501
originally caused by:
Started by an SCM change
[EnvInject] - Loading node environment variables.
Building remotely on H5 (Hadoop) in workspace <https://builds.apache.org/job/Mesos-Buildbot/BUILDTOOL=autotools,COMPILER=clang,CONFIGURATION=--verbose%20--enable-libevent%20--enable-ssl,ENVIRONMENT=GLOG_v=1%20MESOS_VERBOSE=1,OS=ubuntu%3A14.04,label_exp=(docker%7C%7CHadoop)&&(!ubuntu-us1)&&(!ubuntu-eu2)/ws/>
Wiping out workspace first.
Cloning the remote Git repository
Cloning repository https://git-wip-us.apache.org/repos/asf/mesos.git
> git init <https://builds.apache.org/job/Mesos-Buildbot/BUILDTOOL=autotools,COMPILER=clang,CONFIGURATION=--verbose%20--enable-libevent%20--enable-ssl,ENVIRONMENT=GLOG_v=1%20MESOS_VERBOSE=1,OS=ubuntu%3A14.04,label_exp=(docker%7C%7CHadoop)&&(!ubuntu-us1)&&(!ubuntu-eu2)/ws/> # timeout=10
Fetching upstream changes from https://git-wip-us.apache.org/repos/asf/mesos.git
> git --version # timeout=10
> git fetch --tags --progress https://git-wip-us.apache.org/repos/asf/mesos.git +refs/heads/*:refs/remotes/origin/*
> git config remote.origin.url https://git-wip-us.apache.org/repos/asf/mesos.git # timeout=10
> git config --add remote.origin.fetch +refs/heads/*:refs/remotes/origin/* # timeout=10
> git config remote.origin.url https://git-wip-us.apache.org/repos/asf/mesos.git # timeout=10
Fetching upstream changes from https://git-wip-us.apache.org/repos/asf/mesos.git
> git fetch --tags --progress https://git-wip-us.apache.org/repos/asf/mesos.git +refs/heads/*:refs/remotes/origin/*
Checking out Revision 0547cde8cdfc23b4810691ba5f83234b1930c835 (refs/tags/0.16.0-rc2)
> git config core.sparsecheckout # timeout=10
> git checkout -f 0547cde8cdfc23b4810691ba5f83234b1930c835
First time build. Skipping changelog.
[3b5a1cbc] $ /bin/bash -xe /tmp/hudson8728582721861240401.sh
+ '[' refs/tags/0.16.0-rc2 = origin/1.0.x ']'
+ ./support/jenkins/buildbot.sh
/tmp/hudson8728582721861240401.sh: line 6: ./support/jenkins/buildbot.sh: No such file or directory
Build step 'Execute shell' marked build as failure
Build failed in Jenkins: Mesos-Buildbot » autotools,clang,--verbose --enable-libevent --enable-ssl,GLOG_v=1 MESOS_VERBOSE=1,ubuntu:14.04,(docker||Hadoop)&&(!ubuntu-us1)&&(!ubuntu-eu2) #3500
Posted by Apache Jenkins Server <je...@builds.apache.org>.
See <https://builds.apache.org/job/Mesos-Buildbot/BUILDTOOL=autotools,COMPILER=clang,CONFIGURATION=--verbose%20--enable-libevent%20--enable-ssl,ENVIRONMENT=GLOG_v=1%20MESOS_VERBOSE=1,OS=ubuntu%3A14.04,label_exp=(docker%7C%7CHadoop)&&(!ubuntu-us1)&&(!ubuntu-eu2)/3500/display/redirect>
------------------------------------------
Started by upstream project "Mesos-Buildbot" build number 3500
originally caused by:
Started by an SCM change
[EnvInject] - Loading node environment variables.
Building remotely on H5 (Hadoop) in workspace <https://builds.apache.org/job/Mesos-Buildbot/BUILDTOOL=autotools,COMPILER=clang,CONFIGURATION=--verbose%20--enable-libevent%20--enable-ssl,ENVIRONMENT=GLOG_v=1%20MESOS_VERBOSE=1,OS=ubuntu%3A14.04,label_exp=(docker%7C%7CHadoop)&&(!ubuntu-us1)&&(!ubuntu-eu2)/ws/>
Wiping out workspace first.
Cloning the remote Git repository
Cloning repository https://git-wip-us.apache.org/repos/asf/mesos.git
> git init <https://builds.apache.org/job/Mesos-Buildbot/BUILDTOOL=autotools,COMPILER=clang,CONFIGURATION=--verbose%20--enable-libevent%20--enable-ssl,ENVIRONMENT=GLOG_v=1%20MESOS_VERBOSE=1,OS=ubuntu%3A14.04,label_exp=(docker%7C%7CHadoop)&&(!ubuntu-us1)&&(!ubuntu-eu2)/ws/> # timeout=10
Fetching upstream changes from https://git-wip-us.apache.org/repos/asf/mesos.git
> git --version # timeout=10
> git fetch --tags --progress https://git-wip-us.apache.org/repos/asf/mesos.git +refs/heads/*:refs/remotes/origin/*
> git config remote.origin.url https://git-wip-us.apache.org/repos/asf/mesos.git # timeout=10
> git config --add remote.origin.fetch +refs/heads/*:refs/remotes/origin/* # timeout=10
> git config remote.origin.url https://git-wip-us.apache.org/repos/asf/mesos.git # timeout=10
Fetching upstream changes from https://git-wip-us.apache.org/repos/asf/mesos.git
> git fetch --tags --progress https://git-wip-us.apache.org/repos/asf/mesos.git +refs/heads/*:refs/remotes/origin/*
Checking out Revision b73591057d06c79f241ca81737bcb61e56963e2b (refs/tags/0.15.0, refs/tags/0.15.0-rc5)
> git config core.sparsecheckout # timeout=10
> git checkout -f b73591057d06c79f241ca81737bcb61e56963e2b
First time build. Skipping changelog.
[3b5a1cbc] $ /bin/bash -xe /tmp/hudson1029761292155389869.sh
+ '[' refs/tags/0.15.0 = origin/1.0.x ']'
+ ./support/jenkins/buildbot.sh
/tmp/hudson1029761292155389869.sh: line 6: ./support/jenkins/buildbot.sh: No such file or directory
Build step 'Execute shell' marked build as failure
Build failed in Jenkins: Mesos-Buildbot » autotools,clang,--verbose --enable-libevent --enable-ssl,GLOG_v=1 MESOS_VERBOSE=1,ubuntu:14.04,(docker||Hadoop)&&(!ubuntu-us1)&&(!ubuntu-eu2) #3499
Posted by Apache Jenkins Server <je...@builds.apache.org>.
See <https://builds.apache.org/job/Mesos-Buildbot/BUILDTOOL=autotools,COMPILER=clang,CONFIGURATION=--verbose%20--enable-libevent%20--enable-ssl,ENVIRONMENT=GLOG_v=1%20MESOS_VERBOSE=1,OS=ubuntu%3A14.04,label_exp=(docker%7C%7CHadoop)&&(!ubuntu-us1)&&(!ubuntu-eu2)/3499/display/redirect>
------------------------------------------
Started by upstream project "Mesos-Buildbot" build number 3499
originally caused by:
Started by an SCM change
Started by an SCM change
[EnvInject] - Loading node environment variables.
Building remotely on H5 (Hadoop) in workspace <https://builds.apache.org/job/Mesos-Buildbot/BUILDTOOL=autotools,COMPILER=clang,CONFIGURATION=--verbose%20--enable-libevent%20--enable-ssl,ENVIRONMENT=GLOG_v=1%20MESOS_VERBOSE=1,OS=ubuntu%3A14.04,label_exp=(docker%7C%7CHadoop)&&(!ubuntu-us1)&&(!ubuntu-eu2)/ws/>
Wiping out workspace first.
Cloning the remote Git repository
Cloning repository https://git-wip-us.apache.org/repos/asf/mesos.git
> git init <https://builds.apache.org/job/Mesos-Buildbot/BUILDTOOL=autotools,COMPILER=clang,CONFIGURATION=--verbose%20--enable-libevent%20--enable-ssl,ENVIRONMENT=GLOG_v=1%20MESOS_VERBOSE=1,OS=ubuntu%3A14.04,label_exp=(docker%7C%7CHadoop)&&(!ubuntu-us1)&&(!ubuntu-eu2)/ws/> # timeout=10
Fetching upstream changes from https://git-wip-us.apache.org/repos/asf/mesos.git
> git --version # timeout=10
> git fetch --tags --progress https://git-wip-us.apache.org/repos/asf/mesos.git +refs/heads/*:refs/remotes/origin/*
> git config remote.origin.url https://git-wip-us.apache.org/repos/asf/mesos.git # timeout=10
> git config --add remote.origin.fetch +refs/heads/*:refs/remotes/origin/* # timeout=10
> git config remote.origin.url https://git-wip-us.apache.org/repos/asf/mesos.git # timeout=10
Fetching upstream changes from https://git-wip-us.apache.org/repos/asf/mesos.git
> git fetch --tags --progress https://git-wip-us.apache.org/repos/asf/mesos.git +refs/heads/*:refs/remotes/origin/*
Checking out Revision 81fe81bbf9f35d271c0543eb40b6cb62288c852f (refs/tags/0.14.2-rc2, refs/tags/0.14.2)
> git config core.sparsecheckout # timeout=10
> git checkout -f 81fe81bbf9f35d271c0543eb40b6cb62288c852f
First time build. Skipping changelog.
[3b5a1cbc] $ /bin/bash -xe /tmp/hudson5776515559897022600.sh
+ '[' refs/tags/0.14.2-rc2 = origin/1.0.x ']'
+ ./support/jenkins/buildbot.sh
/tmp/hudson5776515559897022600.sh: line 6: ./support/jenkins/buildbot.sh: No such file or directory
Build step 'Execute shell' marked build as failure
Build failed in Jenkins: Mesos-Buildbot » autotools,clang,--verbose --enable-libevent --enable-ssl,GLOG_v=1 MESOS_VERBOSE=1,ubuntu:14.04,(docker||Hadoop)&&(!ubuntu-us1)&&(!ubuntu-eu2) #3498
Posted by Apache Jenkins Server <je...@builds.apache.org>.
See <https://builds.apache.org/job/Mesos-Buildbot/BUILDTOOL=autotools,COMPILER=clang,CONFIGURATION=--verbose%20--enable-libevent%20--enable-ssl,ENVIRONMENT=GLOG_v=1%20MESOS_VERBOSE=1,OS=ubuntu%3A14.04,label_exp=(docker%7C%7CHadoop)&&(!ubuntu-us1)&&(!ubuntu-eu2)/3498/display/redirect>
------------------------------------------
Started by upstream project "Mesos-Buildbot" build number 3498
originally caused by:
Started by an SCM change
[EnvInject] - Loading node environment variables.
Building remotely on H5 (Hadoop) in workspace <https://builds.apache.org/job/Mesos-Buildbot/BUILDTOOL=autotools,COMPILER=clang,CONFIGURATION=--verbose%20--enable-libevent%20--enable-ssl,ENVIRONMENT=GLOG_v=1%20MESOS_VERBOSE=1,OS=ubuntu%3A14.04,label_exp=(docker%7C%7CHadoop)&&(!ubuntu-us1)&&(!ubuntu-eu2)/ws/>
Wiping out workspace first.
Cloning the remote Git repository
Cloning repository https://git-wip-us.apache.org/repos/asf/mesos.git
> git init <https://builds.apache.org/job/Mesos-Buildbot/BUILDTOOL=autotools,COMPILER=clang,CONFIGURATION=--verbose%20--enable-libevent%20--enable-ssl,ENVIRONMENT=GLOG_v=1%20MESOS_VERBOSE=1,OS=ubuntu%3A14.04,label_exp=(docker%7C%7CHadoop)&&(!ubuntu-us1)&&(!ubuntu-eu2)/ws/> # timeout=10
Fetching upstream changes from https://git-wip-us.apache.org/repos/asf/mesos.git
> git --version # timeout=10
> git fetch --tags --progress https://git-wip-us.apache.org/repos/asf/mesos.git +refs/heads/*:refs/remotes/origin/*
> git config remote.origin.url https://git-wip-us.apache.org/repos/asf/mesos.git # timeout=10
> git config --add remote.origin.fetch +refs/heads/*:refs/remotes/origin/* # timeout=10
> git config remote.origin.url https://git-wip-us.apache.org/repos/asf/mesos.git # timeout=10
Fetching upstream changes from https://git-wip-us.apache.org/repos/asf/mesos.git
> git fetch --tags --progress https://git-wip-us.apache.org/repos/asf/mesos.git +refs/heads/*:refs/remotes/origin/*
Checking out Revision 3cf5803d42bd31bde7c20acb8b8384ecb933f0fd (refs/tags/0.14.1, refs/tags/0.14.1-rc1)
> git config core.sparsecheckout # timeout=10
> git checkout -f 3cf5803d42bd31bde7c20acb8b8384ecb933f0fd
First time build. Skipping changelog.
[3b5a1cbc] $ /bin/bash -xe /tmp/hudson3213679638864256865.sh
+ '[' refs/tags/0.14.1 = origin/1.0.x ']'
+ ./support/jenkins/buildbot.sh
/tmp/hudson3213679638864256865.sh: line 6: ./support/jenkins/buildbot.sh: No such file or directory
Build step 'Execute shell' marked build as failure
Build failed in Jenkins: Mesos-Buildbot » autotools,clang,--verbose --enable-libevent --enable-ssl,GLOG_v=1 MESOS_VERBOSE=1,ubuntu:14.04,(docker||Hadoop)&&(!ubuntu-us1)&&(!ubuntu-eu2) #3497
Posted by Apache Jenkins Server <je...@builds.apache.org>.
See <https://builds.apache.org/job/Mesos-Buildbot/BUILDTOOL=autotools,COMPILER=clang,CONFIGURATION=--verbose%20--enable-libevent%20--enable-ssl,ENVIRONMENT=GLOG_v=1%20MESOS_VERBOSE=1,OS=ubuntu%3A14.04,label_exp=(docker%7C%7CHadoop)&&(!ubuntu-us1)&&(!ubuntu-eu2)/3497/display/redirect>
------------------------------------------
Started by upstream project "Mesos-Buildbot" build number 3497
originally caused by:
Started by an SCM change
[EnvInject] - Loading node environment variables.
Building remotely on H5 (Hadoop) in workspace <https://builds.apache.org/job/Mesos-Buildbot/BUILDTOOL=autotools,COMPILER=clang,CONFIGURATION=--verbose%20--enable-libevent%20--enable-ssl,ENVIRONMENT=GLOG_v=1%20MESOS_VERBOSE=1,OS=ubuntu%3A14.04,label_exp=(docker%7C%7CHadoop)&&(!ubuntu-us1)&&(!ubuntu-eu2)/ws/>
Wiping out workspace first.
Cloning the remote Git repository
Cloning repository https://git-wip-us.apache.org/repos/asf/mesos.git
> git init <https://builds.apache.org/job/Mesos-Buildbot/BUILDTOOL=autotools,COMPILER=clang,CONFIGURATION=--verbose%20--enable-libevent%20--enable-ssl,ENVIRONMENT=GLOG_v=1%20MESOS_VERBOSE=1,OS=ubuntu%3A14.04,label_exp=(docker%7C%7CHadoop)&&(!ubuntu-us1)&&(!ubuntu-eu2)/ws/> # timeout=10
Fetching upstream changes from https://git-wip-us.apache.org/repos/asf/mesos.git
> git --version # timeout=10
> git fetch --tags --progress https://git-wip-us.apache.org/repos/asf/mesos.git +refs/heads/*:refs/remotes/origin/*
> git config remote.origin.url https://git-wip-us.apache.org/repos/asf/mesos.git # timeout=10
> git config --add remote.origin.fetch +refs/heads/*:refs/remotes/origin/* # timeout=10
> git config remote.origin.url https://git-wip-us.apache.org/repos/asf/mesos.git # timeout=10
Fetching upstream changes from https://git-wip-us.apache.org/repos/asf/mesos.git
> git fetch --tags --progress https://git-wip-us.apache.org/repos/asf/mesos.git +refs/heads/*:refs/remotes/origin/*
Checking out Revision a2d6e0f45e6d584f065baba5af8786f0fb9ffeea (refs/tags/0.13.0-rc8, refs/tags/0.13.0)
> git config core.sparsecheckout # timeout=10
> git checkout -f a2d6e0f45e6d584f065baba5af8786f0fb9ffeea
First time build. Skipping changelog.
[3b5a1cbc] $ /bin/bash -xe /tmp/hudson6422670997733277302.sh
+ '[' refs/tags/0.13.0-rc8 = origin/1.0.x ']'
+ ./support/jenkins/buildbot.sh
/tmp/hudson6422670997733277302.sh: line 6: ./support/jenkins/buildbot.sh: No such file or directory
Build step 'Execute shell' marked build as failure
Build failed in Jenkins: Mesos-Buildbot » autotools,clang,--verbose --enable-libevent --enable-ssl,GLOG_v=1 MESOS_VERBOSE=1,ubuntu:14.04,(docker||Hadoop)&&(!ubuntu-us1)&&(!ubuntu-eu2) #3496
Posted by Apache Jenkins Server <je...@builds.apache.org>.
See <https://builds.apache.org/job/Mesos-Buildbot/BUILDTOOL=autotools,COMPILER=clang,CONFIGURATION=--verbose%20--enable-libevent%20--enable-ssl,ENVIRONMENT=GLOG_v=1%20MESOS_VERBOSE=1,OS=ubuntu%3A14.04,label_exp=(docker%7C%7CHadoop)&&(!ubuntu-us1)&&(!ubuntu-eu2)/3496/display/redirect>
------------------------------------------
Started by upstream project "Mesos-Buildbot" build number 3496
originally caused by:
Started by an SCM change
Started by an SCM change
[EnvInject] - Loading node environment variables.
Building remotely on H5 (Hadoop) in workspace <https://builds.apache.org/job/Mesos-Buildbot/BUILDTOOL=autotools,COMPILER=clang,CONFIGURATION=--verbose%20--enable-libevent%20--enable-ssl,ENVIRONMENT=GLOG_v=1%20MESOS_VERBOSE=1,OS=ubuntu%3A14.04,label_exp=(docker%7C%7CHadoop)&&(!ubuntu-us1)&&(!ubuntu-eu2)/ws/>
Wiping out workspace first.
Cloning the remote Git repository
Cloning repository https://git-wip-us.apache.org/repos/asf/mesos.git
> git init <https://builds.apache.org/job/Mesos-Buildbot/BUILDTOOL=autotools,COMPILER=clang,CONFIGURATION=--verbose%20--enable-libevent%20--enable-ssl,ENVIRONMENT=GLOG_v=1%20MESOS_VERBOSE=1,OS=ubuntu%3A14.04,label_exp=(docker%7C%7CHadoop)&&(!ubuntu-us1)&&(!ubuntu-eu2)/ws/> # timeout=10
Fetching upstream changes from https://git-wip-us.apache.org/repos/asf/mesos.git
> git --version # timeout=10
> git fetch --tags --progress https://git-wip-us.apache.org/repos/asf/mesos.git +refs/heads/*:refs/remotes/origin/*
> git config remote.origin.url https://git-wip-us.apache.org/repos/asf/mesos.git # timeout=10
> git config --add remote.origin.fetch +refs/heads/*:refs/remotes/origin/* # timeout=10
> git config remote.origin.url https://git-wip-us.apache.org/repos/asf/mesos.git # timeout=10
Fetching upstream changes from https://git-wip-us.apache.org/repos/asf/mesos.git
> git fetch --tags --progress https://git-wip-us.apache.org/repos/asf/mesos.git +refs/heads/*:refs/remotes/origin/*
Checking out Revision 8f482137b3047d294cf3a8ae2f36b0d3ccb1c8b2 (refs/tags/0.12.1-rc3, refs/tags/0.12.1)
> git config core.sparsecheckout # timeout=10
> git checkout -f 8f482137b3047d294cf3a8ae2f36b0d3ccb1c8b2
First time build. Skipping changelog.
[3b5a1cbc] $ /bin/bash -xe /tmp/hudson4224877390820850985.sh
+ '[' refs/tags/0.12.1-rc3 = origin/1.0.x ']'
+ ./support/jenkins/buildbot.sh
/tmp/hudson4224877390820850985.sh: line 6: ./support/jenkins/buildbot.sh: No such file or directory
Build step 'Execute shell' marked build as failure
Build failed in Jenkins: Mesos-Buildbot » autotools,clang,--verbose --enable-libevent --enable-ssl,GLOG_v=1 MESOS_VERBOSE=1,ubuntu:14.04,(docker||Hadoop)&&(!ubuntu-us1)&&(!ubuntu-eu2) #3495
Posted by Apache Jenkins Server <je...@builds.apache.org>.
See <https://builds.apache.org/job/Mesos-Buildbot/BUILDTOOL=autotools,COMPILER=clang,CONFIGURATION=--verbose%20--enable-libevent%20--enable-ssl,ENVIRONMENT=GLOG_v=1%20MESOS_VERBOSE=1,OS=ubuntu%3A14.04,label_exp=(docker%7C%7CHadoop)&&(!ubuntu-us1)&&(!ubuntu-eu2)/3495/display/redirect>
------------------------------------------
Started by upstream project "Mesos-Buildbot" build number 3495
originally caused by:
Started by an SCM change
[EnvInject] - Loading node environment variables.
Building remotely on H5 (Hadoop) in workspace <https://builds.apache.org/job/Mesos-Buildbot/BUILDTOOL=autotools,COMPILER=clang,CONFIGURATION=--verbose%20--enable-libevent%20--enable-ssl,ENVIRONMENT=GLOG_v=1%20MESOS_VERBOSE=1,OS=ubuntu%3A14.04,label_exp=(docker%7C%7CHadoop)&&(!ubuntu-us1)&&(!ubuntu-eu2)/ws/>
Wiping out workspace first.
Cloning the remote Git repository
Cloning repository https://git-wip-us.apache.org/repos/asf/mesos.git
> git init <https://builds.apache.org/job/Mesos-Buildbot/BUILDTOOL=autotools,COMPILER=clang,CONFIGURATION=--verbose%20--enable-libevent%20--enable-ssl,ENVIRONMENT=GLOG_v=1%20MESOS_VERBOSE=1,OS=ubuntu%3A14.04,label_exp=(docker%7C%7CHadoop)&&(!ubuntu-us1)&&(!ubuntu-eu2)/ws/> # timeout=10
Fetching upstream changes from https://git-wip-us.apache.org/repos/asf/mesos.git
> git --version # timeout=10
> git fetch --tags --progress https://git-wip-us.apache.org/repos/asf/mesos.git +refs/heads/*:refs/remotes/origin/*
> git config remote.origin.url https://git-wip-us.apache.org/repos/asf/mesos.git # timeout=10
> git config --add remote.origin.fetch +refs/heads/*:refs/remotes/origin/* # timeout=10
> git config remote.origin.url https://git-wip-us.apache.org/repos/asf/mesos.git # timeout=10
Fetching upstream changes from https://git-wip-us.apache.org/repos/asf/mesos.git
> git fetch --tags --progress https://git-wip-us.apache.org/repos/asf/mesos.git +refs/heads/*:refs/remotes/origin/*
Checking out Revision 53724bebe0bce479721435f3bdb4db42caedf338 (refs/tags/0.12.1-rc2)
> git config core.sparsecheckout # timeout=10
> git checkout -f 53724bebe0bce479721435f3bdb4db42caedf338
First time build. Skipping changelog.
[3b5a1cbc] $ /bin/bash -xe /tmp/hudson3328928480084514918.sh
+ '[' refs/tags/0.12.1-rc2 = origin/1.0.x ']'
+ ./support/jenkins/buildbot.sh
/tmp/hudson3328928480084514918.sh: line 6: ./support/jenkins/buildbot.sh: No such file or directory
Build step 'Execute shell' marked build as failure