You are viewing a plain text version of this content. The canonical link for it is here.
Posted to dev@kafka.apache.org by Apache Jenkins Server <je...@builds.apache.org> on 2019/07/20 09:27:50 UTC

Build failed in Jenkins: kafka-trunk-jdk11 #708

See <https://builds.apache.org/job/kafka-trunk-jdk11/708/display/redirect?page=changes>

Changes:

[cmccabe] KAFKA-8435: replace delete groups request/response with automated

------------------------------------------
[...truncated 2.56 MB...]
org.apache.kafka.connect.transforms.TimestampConverterTest > testConfigMissingFormat PASSED

org.apache.kafka.connect.transforms.TimestampConverterTest > testSchemalessNullValueToDate STARTED

org.apache.kafka.connect.transforms.TimestampConverterTest > testSchemalessNullValueToDate PASSED

org.apache.kafka.connect.transforms.TimestampConverterTest > testSchemalessNullValueToTime STARTED

org.apache.kafka.connect.transforms.TimestampConverterTest > testSchemalessNullValueToTime PASSED

org.apache.kafka.connect.transforms.TimestampConverterTest > testSchemalessNullValueToUnix STARTED

org.apache.kafka.connect.transforms.TimestampConverterTest > testSchemalessNullValueToUnix PASSED

org.apache.kafka.connect.transforms.TimestampConverterTest > testWithSchemaNullFieldToDate STARTED

org.apache.kafka.connect.transforms.TimestampConverterTest > testWithSchemaNullFieldToDate PASSED

org.apache.kafka.connect.transforms.TimestampConverterTest > testWithSchemaNullFieldToTime STARTED

org.apache.kafka.connect.transforms.TimestampConverterTest > testWithSchemaNullFieldToTime PASSED

org.apache.kafka.connect.transforms.TimestampConverterTest > testWithSchemaNullFieldToUnix STARTED

org.apache.kafka.connect.transforms.TimestampConverterTest > testWithSchemaNullFieldToUnix PASSED

org.apache.kafka.connect.transforms.TimestampConverterTest > testConfigNoTargetType STARTED

org.apache.kafka.connect.transforms.TimestampConverterTest > testConfigNoTargetType PASSED

org.apache.kafka.connect.transforms.TimestampConverterTest > testWithSchemaStringToTimestamp STARTED

org.apache.kafka.connect.transforms.TimestampConverterTest > testWithSchemaStringToTimestamp PASSED

org.apache.kafka.connect.transforms.TimestampConverterTest > testWithSchemaTimeToTimestamp STARTED

org.apache.kafka.connect.transforms.TimestampConverterTest > testWithSchemaTimeToTimestamp PASSED

org.apache.kafka.connect.transforms.TimestampConverterTest > testSchemalessUnixToTimestamp STARTED

org.apache.kafka.connect.transforms.TimestampConverterTest > testSchemalessUnixToTimestamp PASSED

org.apache.kafka.connect.transforms.TimestampConverterTest > testWithSchemaTimestampToString STARTED

org.apache.kafka.connect.transforms.TimestampConverterTest > testWithSchemaTimestampToString PASSED

org.apache.kafka.connect.transforms.TimestampConverterTest > testConfigInvalidFormat STARTED

org.apache.kafka.connect.transforms.TimestampConverterTest > testConfigInvalidFormat PASSED

org.apache.kafka.connect.transforms.HoistFieldTest > withSchema STARTED

org.apache.kafka.connect.transforms.HoistFieldTest > withSchema PASSED

org.apache.kafka.connect.transforms.HoistFieldTest > schemaless STARTED

org.apache.kafka.connect.transforms.HoistFieldTest > schemaless PASSED

org.apache.kafka.connect.transforms.InsertFieldTest > schemalessInsertConfiguredFields STARTED

org.apache.kafka.connect.transforms.InsertFieldTest > schemalessInsertConfiguredFields PASSED

org.apache.kafka.connect.transforms.InsertFieldTest > topLevelStructRequired STARTED

org.apache.kafka.connect.transforms.InsertFieldTest > topLevelStructRequired PASSED

org.apache.kafka.connect.transforms.InsertFieldTest > copySchemaAndInsertConfiguredFields STARTED

org.apache.kafka.connect.transforms.InsertFieldTest > copySchemaAndInsertConfiguredFields PASSED

org.apache.kafka.connect.transforms.MaskFieldTest > withSchema STARTED

org.apache.kafka.connect.transforms.MaskFieldTest > withSchema PASSED

org.apache.kafka.connect.transforms.MaskFieldTest > schemaless STARTED

org.apache.kafka.connect.transforms.MaskFieldTest > schemaless PASSED

org.apache.kafka.connect.transforms.ExtractFieldTest > withSchema STARTED

org.apache.kafka.connect.transforms.ExtractFieldTest > withSchema PASSED

org.apache.kafka.connect.transforms.ExtractFieldTest > testNullWithSchema STARTED

org.apache.kafka.connect.transforms.ExtractFieldTest > testNullWithSchema PASSED

org.apache.kafka.connect.transforms.ExtractFieldTest > schemaless STARTED

org.apache.kafka.connect.transforms.ExtractFieldTest > schemaless PASSED

org.apache.kafka.connect.transforms.ExtractFieldTest > testNullSchemaless STARTED

org.apache.kafka.connect.transforms.ExtractFieldTest > testNullSchemaless PASSED

org.apache.kafka.connect.transforms.TimestampRouterTest > defaultConfiguration STARTED

org.apache.kafka.connect.transforms.TimestampRouterTest > defaultConfiguration PASSED

org.apache.kafka.connect.transforms.CastTest > castWholeDateRecordValueWithSchemaString STARTED

org.apache.kafka.connect.transforms.CastTest > castWholeDateRecordValueWithSchemaString PASSED

org.apache.kafka.connect.transforms.CastTest > castWholeRecordValueSchemalessBooleanTrue STARTED

org.apache.kafka.connect.transforms.CastTest > castWholeRecordValueSchemalessBooleanTrue PASSED

org.apache.kafka.connect.transforms.CastTest > testConfigInvalidTargetType STARTED

org.apache.kafka.connect.transforms.CastTest > testConfigInvalidTargetType PASSED

org.apache.kafka.connect.transforms.CastTest > testConfigMixWholeAndFieldTransformation STARTED

org.apache.kafka.connect.transforms.CastTest > testConfigMixWholeAndFieldTransformation PASSED

org.apache.kafka.connect.transforms.CastTest > castWholeRecordValueSchemalessFloat32 STARTED

org.apache.kafka.connect.transforms.CastTest > castWholeRecordValueSchemalessFloat32 PASSED

org.apache.kafka.connect.transforms.CastTest > castWholeRecordValueSchemalessFloat64 STARTED

org.apache.kafka.connect.transforms.CastTest > castWholeRecordValueSchemalessFloat64 PASSED

org.apache.kafka.connect.transforms.CastTest > castWholeRecordValueSchemalessUnsupportedType STARTED

org.apache.kafka.connect.transforms.CastTest > castWholeRecordValueSchemalessUnsupportedType PASSED

org.apache.kafka.connect.transforms.CastTest > castWholeRecordKeySchemaless STARTED

org.apache.kafka.connect.transforms.CastTest > castWholeRecordKeySchemaless PASSED

org.apache.kafka.connect.transforms.CastTest > castWholeRecordValueWithSchemaFloat32 STARTED

org.apache.kafka.connect.transforms.CastTest > castWholeRecordValueWithSchemaFloat32 PASSED

org.apache.kafka.connect.transforms.CastTest > castWholeRecordValueWithSchemaFloat64 STARTED

org.apache.kafka.connect.transforms.CastTest > castWholeRecordValueWithSchemaFloat64 PASSED

org.apache.kafka.connect.transforms.CastTest > castWholeRecordValueWithSchemaString STARTED

org.apache.kafka.connect.transforms.CastTest > castWholeRecordValueWithSchemaString PASSED

org.apache.kafka.connect.transforms.CastTest > testConfigEmpty STARTED

org.apache.kafka.connect.transforms.CastTest > testConfigEmpty PASSED

org.apache.kafka.connect.transforms.CastTest > castWholeRecordValueSchemalessInt16 STARTED

org.apache.kafka.connect.transforms.CastTest > castWholeRecordValueSchemalessInt16 PASSED

org.apache.kafka.connect.transforms.CastTest > castWholeRecordValueSchemalessInt32 STARTED

org.apache.kafka.connect.transforms.CastTest > castWholeRecordValueSchemalessInt32 PASSED

org.apache.kafka.connect.transforms.CastTest > castWholeRecordValueSchemalessInt64 STARTED

org.apache.kafka.connect.transforms.CastTest > castWholeRecordValueSchemalessInt64 PASSED

org.apache.kafka.connect.transforms.CastTest > castFieldsSchemaless STARTED

org.apache.kafka.connect.transforms.CastTest > castFieldsSchemaless PASSED

org.apache.kafka.connect.transforms.CastTest > testUnsupportedTargetType STARTED

org.apache.kafka.connect.transforms.CastTest > testUnsupportedTargetType PASSED

org.apache.kafka.connect.transforms.CastTest > castWholeRecordValueWithSchemaInt16 STARTED

org.apache.kafka.connect.transforms.CastTest > castWholeRecordValueWithSchemaInt16 PASSED

org.apache.kafka.connect.transforms.CastTest > castWholeRecordValueWithSchemaInt32 STARTED

org.apache.kafka.connect.transforms.CastTest > castWholeRecordValueWithSchemaInt32 PASSED

org.apache.kafka.connect.transforms.CastTest > castWholeRecordValueWithSchemaInt64 STARTED

org.apache.kafka.connect.transforms.CastTest > castWholeRecordValueWithSchemaInt64 PASSED

org.apache.kafka.connect.transforms.CastTest > castWholeBigDecimalRecordValueWithSchemaString STARTED

org.apache.kafka.connect.transforms.CastTest > castWholeBigDecimalRecordValueWithSchemaString PASSED

org.apache.kafka.connect.transforms.CastTest > castWholeRecordValueWithSchemaBooleanFalse STARTED

org.apache.kafka.connect.transforms.CastTest > castWholeRecordValueWithSchemaBooleanFalse PASSED

org.apache.kafka.connect.transforms.CastTest > testConfigInvalidMap STARTED

org.apache.kafka.connect.transforms.CastTest > testConfigInvalidMap PASSED

org.apache.kafka.connect.transforms.CastTest > castWholeRecordValueWithSchemaBooleanTrue STARTED

org.apache.kafka.connect.transforms.CastTest > castWholeRecordValueWithSchemaBooleanTrue PASSED

org.apache.kafka.connect.transforms.CastTest > castWholeRecordDefaultValue STARTED

org.apache.kafka.connect.transforms.CastTest > castWholeRecordDefaultValue PASSED

org.apache.kafka.connect.transforms.CastTest > castWholeRecordValueWithSchemaInt8 STARTED

org.apache.kafka.connect.transforms.CastTest > castWholeRecordValueWithSchemaInt8 PASSED

org.apache.kafka.connect.transforms.CastTest > castWholeRecordKeyWithSchema STARTED

org.apache.kafka.connect.transforms.CastTest > castWholeRecordKeyWithSchema PASSED

org.apache.kafka.connect.transforms.CastTest > castWholeRecordValueSchemalessInt8 STARTED

org.apache.kafka.connect.transforms.CastTest > castWholeRecordValueSchemalessInt8 PASSED

org.apache.kafka.connect.transforms.CastTest > castWholeRecordValueSchemalessBooleanFalse STARTED

org.apache.kafka.connect.transforms.CastTest > castWholeRecordValueSchemalessBooleanFalse PASSED

org.apache.kafka.connect.transforms.CastTest > testConfigInvalidSchemaType STARTED

org.apache.kafka.connect.transforms.CastTest > testConfigInvalidSchemaType PASSED

org.apache.kafka.connect.transforms.CastTest > castWholeRecordValueSchemalessString STARTED

org.apache.kafka.connect.transforms.CastTest > castWholeRecordValueSchemalessString PASSED

org.apache.kafka.connect.transforms.CastTest > castFieldsWithSchema STARTED

org.apache.kafka.connect.transforms.CastTest > castFieldsWithSchema PASSED

FAILURE: Build failed with an exception.

* What went wrong:
Execution failed for task ':core:test'.
> There were failing tests. See the report at: file://<https://builds.apache.org/job/kafka-trunk-jdk11/ws/core/build/reports/tests/test/index.html>

* Try:
Run with --stacktrace option to get the stack trace. Run with --info or --debug option to get more log output. Run with --scan to get full insights.

* Get more help at https://help.gradle.org

Deprecated Gradle features were used in this build, making it incompatible with Gradle 6.0.
Use '--warning-mode all' to show the individual deprecation warnings.
See https://docs.gradle.org/5.4.1/userguide/command_line_interface.html#sec:command_line_warnings

BUILD FAILED in 3h 7m 9s
178 actionable tasks: 152 executed, 26 up-to-date
Build step 'Execute shell' marked build as failure
Recording test results
ERROR: No tool found matching GRADLE_4_10_2_HOME
Setting GRADLE_4_10_3_HOME=/home/jenkins/tools/gradle/4.10.3
ERROR: No tool found matching GRADLE_4_10_2_HOME
Setting GRADLE_4_10_3_HOME=/home/jenkins/tools/gradle/4.10.3

Jenkins build is back to normal : kafka-trunk-jdk11 #711

Posted by Apache Jenkins Server <je...@builds.apache.org>.
See <https://builds.apache.org/job/kafka-trunk-jdk11/711/display/redirect?page=changes>


Build failed in Jenkins: kafka-trunk-jdk11 #710

Posted by Apache Jenkins Server <je...@builds.apache.org>.
See <https://builds.apache.org/job/kafka-trunk-jdk11/710/display/redirect?page=changes>

Changes:

[jason] KAFKA-8454; Add Java AdminClient Interface (KIP-476) (#7087)

[jason] KAFKA-8678; Fix leave group protocol bug in throttling and error

------------------------------------------
[...truncated 2.57 MB...]

org.apache.kafka.connect.json.JsonConverterTest > timestampToConnect STARTED

org.apache.kafka.connect.json.JsonConverterTest > timestampToConnect PASSED

org.apache.kafka.connect.json.JsonConverterTest > timestampToConnectWithDefaultValue STARTED

org.apache.kafka.connect.json.JsonConverterTest > timestampToConnectWithDefaultValue PASSED

org.apache.kafka.connect.json.JsonConverterTest > timeToConnectOptional STARTED

org.apache.kafka.connect.json.JsonConverterTest > timeToConnectOptional PASSED

org.apache.kafka.connect.json.JsonConverterTest > dateToConnectWithDefaultValue STARTED

org.apache.kafka.connect.json.JsonConverterTest > dateToConnectWithDefaultValue PASSED

org.apache.kafka.connect.json.JsonConverterTest > nullValueToJson STARTED

org.apache.kafka.connect.json.JsonConverterTest > nullValueToJson PASSED

org.apache.kafka.connect.json.JsonConverterTest > decimalToConnect STARTED

org.apache.kafka.connect.json.JsonConverterTest > decimalToConnect PASSED

org.apache.kafka.connect.json.JsonConverterTest > stringHeaderToConnect STARTED

org.apache.kafka.connect.json.JsonConverterTest > stringHeaderToConnect PASSED

org.apache.kafka.connect.json.JsonConverterTest > mapToJsonNonStringKeys STARTED

org.apache.kafka.connect.json.JsonConverterTest > mapToJsonNonStringKeys PASSED

org.apache.kafka.connect.json.JsonConverterTest > longToJson STARTED

org.apache.kafka.connect.json.JsonConverterTest > longToJson PASSED

org.apache.kafka.connect.json.JsonConverterTest > mismatchSchemaJson STARTED

org.apache.kafka.connect.json.JsonConverterTest > mismatchSchemaJson PASSED

org.apache.kafka.connect.json.JsonConverterTest > mapToConnectNonStringKeys STARTED

org.apache.kafka.connect.json.JsonConverterTest > mapToConnectNonStringKeys PASSED

org.apache.kafka.connect.json.JsonConverterTest > testJsonSchemaMetadataTranslation STARTED

org.apache.kafka.connect.json.JsonConverterTest > testJsonSchemaMetadataTranslation PASSED

org.apache.kafka.connect.json.JsonConverterTest > bytesToJson STARTED

org.apache.kafka.connect.json.JsonConverterTest > bytesToJson PASSED

org.apache.kafka.connect.json.JsonConverterTest > shortToConnect STARTED

org.apache.kafka.connect.json.JsonConverterTest > shortToConnect PASSED

org.apache.kafka.connect.json.JsonConverterTest > intToJson STARTED

org.apache.kafka.connect.json.JsonConverterTest > intToJson PASSED

org.apache.kafka.connect.json.JsonConverterTest > nullSchemaAndNullValueToJson STARTED

org.apache.kafka.connect.json.JsonConverterTest > nullSchemaAndNullValueToJson PASSED

org.apache.kafka.connect.json.JsonConverterTest > timestampToConnectOptional STARTED

org.apache.kafka.connect.json.JsonConverterTest > timestampToConnectOptional PASSED

org.apache.kafka.connect.json.JsonConverterTest > structToConnect STARTED

org.apache.kafka.connect.json.JsonConverterTest > structToConnect PASSED

org.apache.kafka.connect.json.JsonConverterTest > stringToJson STARTED

org.apache.kafka.connect.json.JsonConverterTest > stringToJson PASSED

org.apache.kafka.connect.json.JsonConverterTest > nullSchemaAndArrayToJson STARTED

org.apache.kafka.connect.json.JsonConverterTest > nullSchemaAndArrayToJson PASSED

org.apache.kafka.connect.json.JsonConverterTest > byteToConnect STARTED

org.apache.kafka.connect.json.JsonConverterTest > byteToConnect PASSED

org.apache.kafka.connect.json.JsonConverterTest > nullSchemaPrimitiveToConnect STARTED

org.apache.kafka.connect.json.JsonConverterTest > nullSchemaPrimitiveToConnect PASSED

org.apache.kafka.connect.json.JsonConverterTest > byteToJson STARTED

org.apache.kafka.connect.json.JsonConverterTest > byteToJson PASSED

org.apache.kafka.connect.json.JsonConverterTest > intToConnect STARTED

org.apache.kafka.connect.json.JsonConverterTest > intToConnect PASSED

org.apache.kafka.connect.json.JsonConverterTest > dateToJson STARTED

org.apache.kafka.connect.json.JsonConverterTest > dateToJson PASSED

org.apache.kafka.connect.json.JsonConverterTest > noSchemaToConnect STARTED

org.apache.kafka.connect.json.JsonConverterTest > noSchemaToConnect PASSED

org.apache.kafka.connect.json.JsonConverterTest > noSchemaToJson STARTED

org.apache.kafka.connect.json.JsonConverterTest > noSchemaToJson PASSED

org.apache.kafka.connect.json.JsonConverterTest > nullSchemaAndPrimitiveToJson STARTED

org.apache.kafka.connect.json.JsonConverterTest > nullSchemaAndPrimitiveToJson PASSED

org.apache.kafka.connect.json.JsonConverterTest > decimalToConnectOptionalWithDefaultValue STARTED

org.apache.kafka.connect.json.JsonConverterTest > decimalToConnectOptionalWithDefaultValue PASSED

org.apache.kafka.connect.json.JsonConverterTest > mapToJsonStringKeys STARTED

org.apache.kafka.connect.json.JsonConverterTest > mapToJsonStringKeys PASSED

org.apache.kafka.connect.json.JsonConverterTest > arrayToJson STARTED

org.apache.kafka.connect.json.JsonConverterTest > arrayToJson PASSED

org.apache.kafka.connect.json.JsonConverterTest > nullToConnect STARTED

org.apache.kafka.connect.json.JsonConverterTest > nullToConnect PASSED

org.apache.kafka.connect.json.JsonConverterTest > timeToJson STARTED

org.apache.kafka.connect.json.JsonConverterTest > timeToJson PASSED

org.apache.kafka.connect.json.JsonConverterTest > structToJson STARTED

org.apache.kafka.connect.json.JsonConverterTest > structToJson PASSED

org.apache.kafka.connect.json.JsonConverterTest > testConnectSchemaMetadataTranslation STARTED

org.apache.kafka.connect.json.JsonConverterTest > testConnectSchemaMetadataTranslation PASSED

org.apache.kafka.connect.json.JsonConverterTest > shortToJson STARTED

org.apache.kafka.connect.json.JsonConverterTest > shortToJson PASSED

org.apache.kafka.connect.json.JsonConverterTest > dateToConnect STARTED

org.apache.kafka.connect.json.JsonConverterTest > dateToConnect PASSED

org.apache.kafka.connect.json.JsonConverterTest > doubleToJson STARTED

org.apache.kafka.connect.json.JsonConverterTest > doubleToJson PASSED

org.apache.kafka.connect.json.JsonConverterTest > testStringHeaderToJson STARTED

org.apache.kafka.connect.json.JsonConverterTest > testStringHeaderToJson PASSED

org.apache.kafka.connect.json.JsonConverterTest > decimalToConnectOptional STARTED

org.apache.kafka.connect.json.JsonConverterTest > decimalToConnectOptional PASSED

org.apache.kafka.connect.json.JsonConverterTest > structSchemaIdentical STARTED

org.apache.kafka.connect.json.JsonConverterTest > structSchemaIdentical PASSED

org.apache.kafka.connect.json.JsonConverterTest > timeToConnectWithDefaultValue STARTED

org.apache.kafka.connect.json.JsonConverterTest > timeToConnectWithDefaultValue PASSED

org.apache.kafka.connect.json.JsonConverterTest > timeToConnect STARTED

org.apache.kafka.connect.json.JsonConverterTest > timeToConnect PASSED

org.apache.kafka.connect.json.JsonConverterTest > dateToConnectOptionalWithDefaultValue STARTED

org.apache.kafka.connect.json.JsonConverterTest > dateToConnectOptionalWithDefaultValue PASSED

org.apache.kafka.connect.json.JsonConverterTest > mapToConnectStringKeys STARTED

org.apache.kafka.connect.json.JsonConverterTest > mapToConnectStringKeys PASSED

org.apache.kafka.connect.json.JsonConverterTest > dateToConnectOptional STARTED

org.apache.kafka.connect.json.JsonConverterTest > dateToConnectOptional PASSED

org.apache.kafka.connect.json.JsonConverterTest > timeToConnectOptionalWithDefaultValue STARTED

org.apache.kafka.connect.json.JsonConverterTest > timeToConnectOptionalWithDefaultValue PASSED

org.apache.kafka.connect.json.JsonConverterTest > floatToConnect STARTED

org.apache.kafka.connect.json.JsonConverterTest > floatToConnect PASSED

org.apache.kafka.connect.json.JsonConverterTest > decimalToConnectWithDefaultValue STARTED

org.apache.kafka.connect.json.JsonConverterTest > decimalToConnectWithDefaultValue PASSED

org.apache.kafka.connect.json.JsonConverterTest > decimalToJson STARTED

org.apache.kafka.connect.json.JsonConverterTest > decimalToJson PASSED

org.apache.kafka.connect.json.JsonConverterTest > arrayToConnect STARTED

org.apache.kafka.connect.json.JsonConverterTest > arrayToConnect PASSED

org.apache.kafka.connect.json.JsonConverterTest > testCacheSchemaToConnectConversion STARTED

org.apache.kafka.connect.json.JsonConverterTest > testCacheSchemaToConnectConversion PASSED

org.apache.kafka.connect.json.JsonConverterTest > booleanToJson STARTED

org.apache.kafka.connect.json.JsonConverterTest > booleanToJson PASSED

org.apache.kafka.connect.json.JsonConverterTest > bytesToConnect STARTED

org.apache.kafka.connect.json.JsonConverterTest > bytesToConnect PASSED

org.apache.kafka.connect.json.JsonConverterTest > doubleToConnect STARTED

org.apache.kafka.connect.json.JsonConverterTest > doubleToConnect PASSED

org.apache.kafka.connect.json.JsonConverterTest > timestampToConnectOptionalWithDefaultValue STARTED

org.apache.kafka.connect.json.JsonConverterTest > timestampToConnectOptionalWithDefaultValue PASSED

FAILURE: Build failed with an exception.

* What went wrong:
Execution failed for task ':core:test'.
> There were failing tests. See the report at: file://<https://builds.apache.org/job/kafka-trunk-jdk11/ws/core/build/reports/tests/test/index.html>

* Try:
Run with --stacktrace option to get the stack trace. Run with --info or --debug option to get more log output. Run with --scan to get full insights.

* Get more help at https://help.gradle.org

Deprecated Gradle features were used in this build, making it incompatible with Gradle 6.0.
Use '--warning-mode all' to show the individual deprecation warnings.
See https://docs.gradle.org/5.4.1/userguide/command_line_interface.html#sec:command_line_warnings

BUILD FAILED in 4h 26m 57s
178 actionable tasks: 152 executed, 26 up-to-date
Build step 'Execute shell' marked build as failure
Recording test results
ERROR: No tool found matching GRADLE_4_10_2_HOME
Setting GRADLE_4_10_3_HOME=/home/jenkins/tools/gradle/4.10.3
ERROR: No tool found matching GRADLE_4_10_2_HOME
Setting GRADLE_4_10_3_HOME=/home/jenkins/tools/gradle/4.10.3
Not sending mail to unregistered user rajinisivaram@googlemail.com

Build failed in Jenkins: kafka-trunk-jdk11 #709

Posted by Apache Jenkins Server <je...@builds.apache.org>.
See <https://builds.apache.org/job/kafka-trunk-jdk11/709/display/redirect?page=changes>

Changes:

[rajinisivaram] MINOR: kafkatest - adding whitelist for interbroker sasl configs (#7093)

------------------------------------------
Started by an SCM change
[EnvInject] - Loading node environment variables.
Building remotely on H44 (ubuntu bionic) in workspace <https://builds.apache.org/job/kafka-trunk-jdk11/ws/>
[WS-CLEANUP] Deleting project workspace...
[WS-CLEANUP] Deferred wipeout is used...
No credentials specified
Cloning the remote Git repository
Cloning repository https://github.com/apache/kafka.git
 > git init <https://builds.apache.org/job/kafka-trunk-jdk11/ws/> # timeout=10
Fetching upstream changes from https://github.com/apache/kafka.git
 > git --version # timeout=10
 > git fetch --tags --progress https://github.com/apache/kafka.git +refs/heads/*:refs/remotes/origin/*
 > git config remote.origin.url https://github.com/apache/kafka.git # timeout=10
 > git config --add remote.origin.fetch +refs/heads/*:refs/remotes/origin/* # timeout=10
 > git config remote.origin.url https://github.com/apache/kafka.git # timeout=10
Fetching upstream changes from https://github.com/apache/kafka.git
 > git fetch --tags --progress https://github.com/apache/kafka.git +refs/heads/*:refs/remotes/origin/*
 > git rev-parse refs/remotes/origin/trunk^{commit} # timeout=10
 > git rev-parse refs/remotes/origin/origin/trunk^{commit} # timeout=10
Checking out Revision e5f7220b23ba556352d80a0575fcb6cbfe2d576d (refs/remotes/origin/trunk)
 > git config core.sparsecheckout # timeout=10
 > git checkout -f e5f7220b23ba556352d80a0575fcb6cbfe2d576d
Commit message: "MINOR: kafkatest - adding whitelist for interbroker sasl configs (#7093)"
 > git rev-list --no-walk e3524ef350830e3e1fa918ec0ae93b09d51fcf37 # timeout=10
ERROR: No tool found matching GRADLE_4_10_2_HOME
Setting GRADLE_4_10_3_HOME=/home/jenkins/tools/gradle/4.10.3
[kafka-trunk-jdk11] $ /bin/bash -xe /tmp/jenkins6064544410355678446.sh
+ rm -rf <https://builds.apache.org/job/kafka-trunk-jdk11/ws/.gradle>
+ /home/jenkins/tools/gradle/4.10.3/bin/gradle
/tmp/jenkins6064544410355678446.sh: line 4: /home/jenkins/tools/gradle/4.10.3/bin/gradle: No such file or directory
Build step 'Execute shell' marked build as failure
Recording test results
ERROR: No tool found matching GRADLE_4_10_2_HOME
Setting GRADLE_4_10_3_HOME=/home/jenkins/tools/gradle/4.10.3
ERROR: Step ?Publish JUnit test result report? failed: No test report files were found. Configuration error?
ERROR: No tool found matching GRADLE_4_10_2_HOME
Setting GRADLE_4_10_3_HOME=/home/jenkins/tools/gradle/4.10.3
Not sending mail to unregistered user rajinisivaram@googlemail.com