You are viewing a plain text version of this content. The canonical link for it is here.
Posted to builds@solr.apache.org by Policeman Jenkins Server <je...@thetaphi.de> on 2025/12/18 07:31:30 UTC

[JENKINS] Solr-main-Linux (64bit/hotspot/jdk-23.0.2) - Build # 29746 - Unstable!

Build: https://jenkins.thetaphi.de/job/Solr-main-Linux/29746/
Java: 64bit/hotspot/jdk-23.0.2 -XX:+UseCompressedOops -XX:+UseParallelGC

1 tests failed.
FAILED:  org.apache.solr.cloud.TestCloudConsistency.testOutOfSyncReplicasCannotBecomeLeader

Error Message:
java.lang.AssertionError: Timeout waiting for active collection
Timeout waiting to see state for collection=outOfSyncReplicasCannotBecomeLeader-false :DocCollection(outOfSyncReplicasCannotBecomeLeader-false//collections/outOfSyncReplicasCannotBecomeLeader-false/state.json/20 )={
  "pullReplicas":0,
  "configName":"outOfSyncReplicasCannotBecomeLeader-false.AUTOCREATED",
  "nrtReplicas":3,
  "replicationFactor":3,
  "tlogReplicas":0,
  "router":{"name":"compositeId"},
  "shards":{"shard1":{
      "range":"80000000-7fffffff",
      "replicas":{
        "core_node2":{
          "core":"outOfSyncReplicasCannotBecomeLeader-false_shard1_replica_n1",
          "node_name":"127.0.0.1:43373_solr",
          "type":"NRT",
          "state":"active",
          "leader":"true",
          "force_set_state":"false",
          "base_url":"https://127.0.0.1:43373/solr"},
        "core_node4":{
          "core":"outOfSyncReplicasCannotBecomeLeader-false_shard1_replica_n3",
          "node_name":"127.0.0.1:37507_solr",
          "type":"NRT",
          "state":"down",
          "force_set_state":"false",
          "base_url":"https://127.0.0.1:37507/solr"},
        "core_node6":{
          "core":"outOfSyncReplicasCannotBecomeLeader-false_shard1_replica_n5",
          "node_name":"127.0.0.1:39979_solr",
          "type":"NRT",
          "state":"down",
          "force_set_state":"false",
          "base_url":"https://127.0.0.1:39979/solr"}},
      "state":"active"}}}
Live Nodes: [127.0.0.1:35189_solr, 127.0.0.1:37507_solr, 127.0.0.1:39979_solr, 127.0.0.1:43373_solr]
Last available state: DocCollection(outOfSyncReplicasCannotBecomeLeader-false//collections/outOfSyncReplicasCannotBecomeLeader-false/state.json/20 )={
  "pullReplicas":0,
  "configName":"outOfSyncReplicasCannotBecomeLeader-false.AUTOCREATED",
  "nrtReplicas":3,
  "replicationFactor":3,
  "tlogReplicas":0,
  "router":{"name":"compositeId"},
  "shards":{"shard1":{
      "range":"80000000-7fffffff",
      "replicas":{
        "core_node2":{
          "core":"outOfSyncReplicasCannotBecomeLeader-false_shard1_replica_n1",
          "node_name":"127.0.0.1:43373_solr",
          "type":"NRT",
          "state":"active",
          "leader":"true",
          "force_set_state":"false",
          "base_url":"https://127.0.0.1:43373/solr"},
        "core_node4":{
          "core":"outOfSyncReplicasCannotBecomeLeader-false_shard1_replica_n3",
          "node_name":"127.0.0.1:37507_solr",
          "type":"NRT",
          "state":"down",
          "force_set_state":"false",
          "base_url":"https://127.0.0.1:37507/solr"},
        "core_node6":{
          "core":"outOfSyncReplicasCannotBecomeLeader-false_shard1_replica_n5",
          "node_name":"127.0.0.1:39979_solr",
          "type":"NRT",
          "state":"down",
          "force_set_state":"false",
          "base_url":"https://127.0.0.1:39979/solr"}},
      "state":"active"}}}

Stack Trace:
java.lang.AssertionError: Timeout waiting for active collection
Timeout waiting to see state for collection=outOfSyncReplicasCannotBecomeLeader-false :DocCollection(outOfSyncReplicasCannotBecomeLeader-false//collections/outOfSyncReplicasCannotBecomeLeader-false/state.json/20 )={
  "pullReplicas":0,
  "configName":"outOfSyncReplicasCannotBecomeLeader-false.AUTOCREATED",
  "nrtReplicas":3,
  "replicationFactor":3,
  "tlogReplicas":0,
  "router":{"name":"compositeId"},
  "shards":{"shard1":{
      "range":"80000000-7fffffff",
      "replicas":{
        "core_node2":{
          "core":"outOfSyncReplicasCannotBecomeLeader-false_shard1_replica_n1",
          "node_name":"127.0.0.1:43373_solr",
          "type":"NRT",
          "state":"active",
          "leader":"true",
          "force_set_state":"false",
          "base_url":"https://127.0.0.1:43373/solr"},
        "core_node4":{
          "core":"outOfSyncReplicasCannotBecomeLeader-false_shard1_replica_n3",
          "node_name":"127.0.0.1:37507_solr",
          "type":"NRT",
          "state":"down",
          "force_set_state":"false",
          "base_url":"https://127.0.0.1:37507/solr"},
        "core_node6":{
          "core":"outOfSyncReplicasCannotBecomeLeader-false_shard1_replica_n5",
          "node_name":"127.0.0.1:39979_solr",
          "type":"NRT",
          "state":"down",
          "force_set_state":"false",
          "base_url":"https://127.0.0.1:39979/solr"}},
      "state":"active"}}}
Live Nodes: [127.0.0.1:35189_solr, 127.0.0.1:37507_solr, 127.0.0.1:39979_solr, 127.0.0.1:43373_solr]
Last available state: DocCollection(outOfSyncReplicasCannotBecomeLeader-false//collections/outOfSyncReplicasCannotBecomeLeader-false/state.json/20 )={
  "pullReplicas":0,
  "configName":"outOfSyncReplicasCannotBecomeLeader-false.AUTOCREATED",
  "nrtReplicas":3,
  "replicationFactor":3,
  "tlogReplicas":0,
  "router":{"name":"compositeId"},
  "shards":{"shard1":{
      "range":"80000000-7fffffff",
      "replicas":{
        "core_node2":{
          "core":"outOfSyncReplicasCannotBecomeLeader-false_shard1_replica_n1",
          "node_name":"127.0.0.1:43373_solr",
          "type":"NRT",
          "state":"active",
          "leader":"true",
          "force_set_state":"false",
          "base_url":"https://127.0.0.1:43373/solr"},
        "core_node4":{
          "core":"outOfSyncReplicasCannotBecomeLeader-false_shard1_replica_n3",
          "node_name":"127.0.0.1:37507_solr",
          "type":"NRT",
          "state":"down",
          "force_set_state":"false",
          "base_url":"https://127.0.0.1:37507/solr"},
        "core_node6":{
          "core":"outOfSyncReplicasCannotBecomeLeader-false_shard1_replica_n5",
          "node_name":"127.0.0.1:39979_solr",
          "type":"NRT",
          "state":"down",
          "force_set_state":"false",
          "base_url":"https://127.0.0.1:39979/solr"}},
      "state":"active"}}}
	at __randomizedtesting.SeedInfo.seed([B22115E0961144E0:CCCA35F055764BDA]:0)
	at org.junit.Assert.fail(Assert.java:89)
	at org.apache.solr.cloud.SolrCloudTestCase.waitForState(SolrCloudTestCase.java:233)
	at org.apache.solr.cloud.SolrCloudTestCase.waitForState(SolrCloudTestCase.java:201)
	at org.apache.solr.cloud.TestCloudConsistency.addDocWhenOtherReplicasAreNetworkPartitioned(TestCloudConsistency.java:285)
	at org.apache.solr.cloud.TestCloudConsistency.testOutOfSyncReplicasCannotBecomeLeader(TestCloudConsistency.java:136)
	at org.apache.solr.cloud.TestCloudConsistency.testOutOfSyncReplicasCannotBecomeLeader(TestCloudConsistency.java:99)
	at java.base/jdk.internal.reflect.DirectMethodHandleAccessor.invoke(DirectMethodHandleAccessor.java:103)
	at java.base/java.lang.reflect.Method.invoke(Method.java:580)
	at com.carrotsearch.randomizedtesting.RandomizedRunner.invoke(RandomizedRunner.java:1763)
	at com.carrotsearch.randomizedtesting.RandomizedRunner$8.evaluate(RandomizedRunner.java:946)
	at com.carrotsearch.randomizedtesting.RandomizedRunner$9.evaluate(RandomizedRunner.java:982)
	at com.carrotsearch.randomizedtesting.RandomizedRunner$10.evaluate(RandomizedRunner.java:996)
	at com.carrotsearch.randomizedtesting.rules.SystemPropertiesRestoreRule$1.evaluate(SystemPropertiesRestoreRule.java:80)
	at org.junit.rules.RunRules.evaluate(RunRules.java:20)
	at org.apache.lucene.tests.util.TestRuleSetupTeardownChained$1.evaluate(TestRuleSetupTeardownChained.java:48)
	at org.apache.lucene.tests.util.AbstractBeforeAfterRule$1.evaluate(AbstractBeforeAfterRule.java:43)
	at org.apache.lucene.tests.util.TestRuleThreadAndTestName$1.evaluate(TestRuleThreadAndTestName.java:45)
	at org.apache.lucene.tests.util.TestRuleIgnoreAfterMaxFailures$1.evaluate(TestRuleIgnoreAfterMaxFailures.java:60)
	at org.apache.lucene.tests.util.TestRuleMarkFailure$1.evaluate(TestRuleMarkFailure.java:44)
	at org.junit.rules.RunRules.evaluate(RunRules.java:20)
	at com.carrotsearch.randomizedtesting.rules.StatementAdapter.evaluate(StatementAdapter.java:36)
	at com.carrotsearch.randomizedtesting.ThreadLeakControl$StatementRunner.run(ThreadLeakControl.java:390)
	at com.carrotsearch.randomizedtesting.ThreadLeakControl.forkTimeoutingTask(ThreadLeakControl.java:843)
	at com.carrotsearch.randomizedtesting.ThreadLeakControl$3.evaluate(ThreadLeakControl.java:490)
	at com.carrotsearch.randomizedtesting.RandomizedRunner.runSingleTest(RandomizedRunner.java:955)
	at com.carrotsearch.randomizedtesting.RandomizedRunner$5.evaluate(RandomizedRunner.java:840)
	at com.carrotsearch.randomizedtesting.RandomizedRunner$6.evaluate(RandomizedRunner.java:891)
	at com.carrotsearch.randomizedtesting.RandomizedRunner$7.evaluate(RandomizedRunner.java:902)
	at com.carrotsearch.randomizedtesting.rules.StatementAdapter.evaluate(StatementAdapter.java:36)
	at com.carrotsearch.randomizedtesting.rules.StatementAdapter.evaluate(StatementAdapter.java:36)
	at org.apache.lucene.tests.util.AbstractBeforeAfterRule$1.evaluate(AbstractBeforeAfterRule.java:43)
	at com.carrotsearch.randomizedtesting.rules.SystemPropertiesRestoreRule$1.evaluate(SystemPropertiesRestoreRule.java:80)
	at org.junit.rules.RunRules.evaluate(RunRules.java:20)
	at org.apache.lucene.tests.util.AbstractBeforeAfterRule$1.evaluate(AbstractBeforeAfterRule.java:43)
	at com.carrotsearch.randomizedtesting.rules.StatementAdapter.evaluate(StatementAdapter.java:36)
	at org.apache.lucene.tests.util.TestRuleStoreClassName$1.evaluate(TestRuleStoreClassName.java:38)
	at com.carrotsearch.randomizedtesting.rules.NoShadowingOrOverridesOnMethodsRule$1.evaluate(NoShadowingOrOverridesOnMethodsRule.java:40)
	at com.carrotsearch.randomizedtesting.rules.NoShadowingOrOverridesOnMethodsRule$1.evaluate(NoShadowingOrOverridesOnMethodsRule.java:40)
	at com.carrotsearch.randomizedtesting.rules.StatementAdapter.evaluate(StatementAdapter.java:36)
	at com.carrotsearch.randomizedtesting.rules.StatementAdapter.evaluate(StatementAdapter.java:36)
	at org.apache.lucene.tests.util.TestRuleAssertionsRequired$1.evaluate(TestRuleAssertionsRequired.java:53)
	at org.apache.lucene.tests.util.AbstractBeforeAfterRule$1.evaluate(AbstractBeforeAfterRule.java:43)
	at org.apache.lucene.tests.util.TestRuleMarkFailure$1.evaluate(TestRuleMarkFailure.java:44)
	at org.apache.lucene.tests.util.TestRuleIgnoreAfterMaxFailures$1.evaluate(TestRuleIgnoreAfterMaxFailures.java:60)
	at org.apache.lucene.tests.util.TestRuleIgnoreTestSuites$1.evaluate(TestRuleIgnoreTestSuites.java:47)
	at org.junit.rules.RunRules.evaluate(RunRules.java:20)
	at com.carrotsearch.randomizedtesting.rules.StatementAdapter.evaluate(StatementAdapter.java:36)
	at com.carrotsearch.randomizedtesting.ThreadLeakControl$StatementRunner.run(ThreadLeakControl.java:390)
	at com.carrotsearch.randomizedtesting.ThreadLeakControl.lambda$forkTimeoutingTask$0(ThreadLeakControl.java:850)
	at java.base/java.lang.Thread.run(Thread.java:1575)