You are viewing a plain text version of this content. The canonical link for it is here.
Posted to commits@tomee.apache.org by Apache Jenkins Server <je...@builds.apache.org> on 2023/09/07 06:54:15 UTC

Build failed in Jenkins: TomEE » tomee-jakartaee-api-master #581

See <https://ci-builds.apache.org/job/Tomee/job/tomee-jakartaee-api-master/581/display/redirect?page=changes>

Changes:

[Richard Zowalla] Updates to ASF parent pom 30

[Richard Zowalla] Upgrades Tomcat to 10.1.13


------------------------------------------
Started by an SCM change
Running as SYSTEM
[EnvInject] - Loading node environment variables.
Building remotely on builds32 (ubuntu) in workspace <https://ci-builds.apache.org/job/Tomee/job/tomee-jakartaee-api-master/ws/>
The recommended git tool is: NONE
No credentials specified
 > git rev-parse --resolve-git-dir <https://ci-builds.apache.org/job/Tomee/job/tomee-jakartaee-api-master/ws/.git> # timeout=10
Fetching changes from the remote Git repository
 > git config remote.origin.url https://github.com/apache/tomee-jakartaee-api # timeout=10
Cleaning workspace
 > git rev-parse --verify HEAD # timeout=10
Resetting working tree
 > git reset --hard # timeout=10
 > git clean -fdx # timeout=10
Fetching upstream changes from https://github.com/apache/tomee-jakartaee-api
 > git --version # timeout=10
 > git --version # 'git version 2.17.1'
 > git fetch --tags --progress -- https://github.com/apache/tomee-jakartaee-api +refs/heads/*:refs/remotes/origin/* # timeout=10
 > git rev-parse refs/remotes/origin/main^{commit} # timeout=10
Checking out Revision 04b464bc7e6f3a2c6a07ab5825660afb10a47581 (refs/remotes/origin/main)
 > git config core.sparsecheckout # timeout=10
 > git checkout -f 04b464bc7e6f3a2c6a07ab5825660afb10a47581 # timeout=10
Commit message: "Upgrades Tomcat to 10.1.13 Switch to activation 2.1"
 > git rev-list --no-walk b3d5b7482f060e0f1891c5141b3439bc4eabe3e3 # timeout=10
Parsing POMs
ERROR: Failed to parse POMs
hudson.remoting.ProxyException: hudson.maven.MavenModuleSetBuild$MavenExecutionException: org.apache.maven.project.ProjectBuildingException: Some problems were encountered while processing the POMs:
[ERROR] 'dependencies.dependency.version' for org.apache.geronimo.specs:geronimo-activation_2.0_spec:jar must be a valid version but is '${geronimo-activation_2.0_spec.version}'. @ line 636, column 18
[ERROR] 'dependencies.dependency.version' for org.apache.geronimo.specs:geronimo-activation_2.0_spec:jar:sources must be a valid version but is '${geronimo-activation_2.0_spec.version}'. @ line 641, column 18

	at hudson.maven.MavenModuleSetBuild$PomParser.invoke(MavenModuleSetBuild.java:1391)
	at hudson.maven.MavenModuleSetBuild$PomParser.invoke(MavenModuleSetBuild.java:1124)
	at hudson.FilePath$FileCallableWrapper.call(FilePath.java:3578)
	at hudson.remoting.UserRequest.perform(UserRequest.java:211)
	at hudson.remoting.UserRequest.perform(UserRequest.java:54)
	at hudson.remoting.Request$2.run(Request.java:377)
	at hudson.remoting.InterceptingExecutorService.lambda$wrap$0(InterceptingExecutorService.java:78)
	at java.base/java.util.concurrent.FutureTask.run(FutureTask.java:264)
	at java.base/java.util.concurrent.ThreadPoolExecutor.runWorker(ThreadPoolExecutor.java:1128)
	at java.base/java.util.concurrent.ThreadPoolExecutor$Worker.run(ThreadPoolExecutor.java:628)
	at java.base/java.lang.Thread.run(Thread.java:829)
	Suppressed: hudson.remoting.Channel$CallSiteStackTrace: Remote call to builds32
		at hudson.remoting.Channel.attachCallSiteStackTrace(Channel.java:1784)
		at hudson.remoting.UserRequest$ExceptionResponse.retrieve(UserRequest.java:356)
		at hudson.remoting.Channel.call(Channel.java:1000)
		at hudson.FilePath.act(FilePath.java:1192)
		at hudson.FilePath.act(FilePath.java:1181)
		at hudson.maven.MavenModuleSetBuild$MavenModuleSetBuildExecution.parsePoms(MavenModuleSetBuild.java:985)
		at hudson.maven.MavenModuleSetBuild$MavenModuleSetBuildExecution.doRun(MavenModuleSetBuild.java:689)
		at hudson.model.AbstractBuild$AbstractBuildExecution.run(AbstractBuild.java:526)
		at hudson.model.Run.execute(Run.java:1900)
		at hudson.maven.MavenModuleSetBuild.run(MavenModuleSetBuild.java:543)
		at hudson.model.ResourceController.execute(ResourceController.java:101)
		at hudson.model.Executor.run(Executor.java:442)
Caused by: hudson.remoting.ProxyException: org.apache.maven.project.ProjectBuildingException: Some problems were encountered while processing the POMs:
[ERROR] 'dependencies.dependency.version' for org.apache.geronimo.specs:geronimo-activation_2.0_spec:jar must be a valid version but is '${geronimo-activation_2.0_spec.version}'. @ line 636, column 18
[ERROR] 'dependencies.dependency.version' for org.apache.geronimo.specs:geronimo-activation_2.0_spec:jar:sources must be a valid version but is '${geronimo-activation_2.0_spec.version}'. @ line 641, column 18

	at org.apache.maven.project.DefaultProjectBuilder.build(DefaultProjectBuilder.java:397)
	at hudson.maven.MavenEmbedder.buildProjects(MavenEmbedder.java:370)
	at hudson.maven.MavenEmbedder.readProjects(MavenEmbedder.java:340)
	at hudson.maven.MavenModuleSetBuild$PomParser.invoke(MavenModuleSetBuild.java:1330)
	... 10 more

Jenkins build is back to normal : TomEE » tomee-jakartaee-api-master #582

Posted by Apache Jenkins Server <je...@builds.apache.org>.
See <https://ci-builds.apache.org/job/Tomee/job/tomee-jakartaee-api-master/582/display/redirect?page=changes>