You are viewing a plain text version of this content. The canonical link for it is here.
Posted to hdfs-dev@hadoop.apache.org by Apache Jenkins Server <je...@builds.apache.org> on 2011/06/11 01:47:49 UTC
Hadoop-Hdfs-22-branch - Build # 65 - Still Failing
See https://builds.apache.org/job/Hadoop-Hdfs-22-branch/65/
###################################################################################
########################## LAST 60 LINES OF THE CONSOLE ###########################
[...truncated 3046 lines...]
compile-hdfs-test:
[delete] Deleting directory /grid/0/hudson/hudson-slave/workspace/Hadoop-Hdfs-22-branch/trunk/build-fi/test/cache
[mkdir] Created dir: /grid/0/hudson/hudson-slave/workspace/Hadoop-Hdfs-22-branch/trunk/build-fi/test/cache
[copy] Copying 1 file to /grid/0/hudson/hudson-slave/workspace/Hadoop-Hdfs-22-branch/trunk/build-fi/test/cache
[copy] Copying 1 file to /grid/0/hudson/hudson-slave/workspace/Hadoop-Hdfs-22-branch/trunk/build-fi/test/cache
[copy] Copying 1 file to /grid/0/hudson/hudson-slave/workspace/Hadoop-Hdfs-22-branch/trunk/build-fi/test/cache
[copy] Copying 1 file to /grid/0/hudson/hudson-slave/workspace/Hadoop-Hdfs-22-branch/trunk/build-fi/test/cache
[copy] Copying 1 file to /grid/0/hudson/hudson-slave/workspace/Hadoop-Hdfs-22-branch/trunk/build-fi/test/cache
[copy] Copying 1 file to /grid/0/hudson/hudson-slave/workspace/Hadoop-Hdfs-22-branch/trunk/build-fi/test/cache
[copy] Copying 1 file to /grid/0/hudson/hudson-slave/workspace/Hadoop-Hdfs-22-branch/trunk/build-fi/test/cache
[copy] Copying 1 file to /grid/0/hudson/hudson-slave/workspace/Hadoop-Hdfs-22-branch/trunk/build-fi/test/cache
[copy] Copying 1 file to /grid/0/hudson/hudson-slave/workspace/Hadoop-Hdfs-22-branch/trunk/build-fi/test/cache
[copy] Copying 1 file to /grid/0/hudson/hudson-slave/workspace/Hadoop-Hdfs-22-branch/trunk/build-fi/test/cache
run-test-hdfs-excluding-commit-and-smoke:
[mkdir] Created dir: /grid/0/hudson/hudson-slave/workspace/Hadoop-Hdfs-22-branch/trunk/build-fi/test/data
[mkdir] Created dir: /grid/0/hudson/hudson-slave/workspace/Hadoop-Hdfs-22-branch/trunk/build-fi/test/logs
[copy] Copying 1 file to /grid/0/hudson/hudson-slave/workspace/Hadoop-Hdfs-22-branch/trunk/build-fi/test/extraconf
[copy] Copying 1 file to /grid/0/hudson/hudson-slave/workspace/Hadoop-Hdfs-22-branch/trunk/build-fi/test/extraconf
[junit] WARNING: multiple versions of ant detected in path for junit
[junit] jar:file:/homes/hudson/tools/ant/latest/lib/ant.jar!/org/apache/tools/ant/Project.class
[junit] and jar:file:/homes/hudson/.ivy2/cache/ant/ant/jars/ant-1.6.5.jar!/org/apache/tools/ant/Project.class
[junit] Running org.apache.hadoop.fs.TestFiListPath
[junit] Tests run: 2, Failures: 0, Errors: 0, Time elapsed: 2.498 sec
[junit] Running org.apache.hadoop.fs.TestFiRename
[junit] Tests run: 4, Failures: 0, Errors: 0, Time elapsed: 5.626 sec
[junit] Running org.apache.hadoop.hdfs.TestFiHFlush
[junit] Tests run: 9, Failures: 0, Errors: 0, Time elapsed: 15.678 sec
[junit] Running org.apache.hadoop.hdfs.TestFiHftp
[junit] Tests run: 1, Failures: 0, Errors: 0, Time elapsed: 38.452 sec
[junit] Running org.apache.hadoop.hdfs.TestFiPipelines
[junit] Tests run: 3, Failures: 0, Errors: 0, Time elapsed: 5.491 sec
[junit] Running org.apache.hadoop.hdfs.server.datanode.TestFiDataTransferProtocol
[junit] Tests run: 29, Failures: 0, Errors: 0, Time elapsed: 210.399 sec
[junit] Running org.apache.hadoop.hdfs.server.datanode.TestFiDataTransferProtocol2
[junit] Tests run: 10, Failures: 0, Errors: 0, Time elapsed: 280.269 sec
[junit] Running org.apache.hadoop.hdfs.server.datanode.TestFiPipelineClose
[junit] Tests run: 3, Failures: 0, Errors: 0, Time elapsed: 35.794 sec
checkfailure:
-run-test-hdfs-fault-inject-withtestcaseonly:
run-test-hdfs-fault-inject:
BUILD FAILED
/grid/0/hudson/hudson-slave/workspace/Hadoop-Hdfs-22-branch/trunk/build.xml:747: Tests failed!
Total time: 73 minutes 34 seconds
[FINDBUGS] Skipping publisher since build result is FAILURE
Publishing Javadoc
Archiving artifacts
Recording test results
Recording fingerprints
Publishing Clover coverage report...
No Clover report will be published due to a Build Failure
Email was triggered for: Failure
Sending email for trigger: Failure
###################################################################################
############################## FAILED TESTS (if any) ##############################
2 tests failed.
REGRESSION: org.apache.hadoop.hdfs.TestLargeBlock.testLargeBlockSize
Error Message:
Timeout occurred. Please note the time in the report does not reflect the time until the timeout.
Stack Trace:
junit.framework.AssertionFailedError: Timeout occurred. Please note the time in the report does not reflect the time until the timeout.
REGRESSION: org.apache.hadoop.hdfs.server.balancer.TestBalancer.testBalancer2
Error Message:
127.0.0.1:34837is not an underUtilized node
Stack Trace:
junit.framework.AssertionFailedError: 127.0.0.1:34837is not an underUtilized node
at org.apache.hadoop.hdfs.server.balancer.Balancer.initNodes(Balancer.java:1011)
at org.apache.hadoop.hdfs.server.balancer.Balancer.initNodes(Balancer.java:953)
at org.apache.hadoop.hdfs.server.balancer.Balancer.run(Balancer.java:1496)
at org.apache.hadoop.hdfs.server.balancer.TestBalancer.runBalancerDefaultConstructor(TestBalancer.java:279)
at org.apache.hadoop.hdfs.server.balancer.TestBalancer.testBalancerDefaultConstructor(TestBalancer.java:376)
at org.apache.hadoop.hdfs.server.balancer.TestBalancer.__CLR3_0_2g13gq9p5s(TestBalancer.java:344)
at org.apache.hadoop.hdfs.server.balancer.TestBalancer.testBalancer2(TestBalancer.java:341)