You are viewing a plain text version of this content. The canonical link for it is here.
Posted to builds@solr.apache.org by Apache Jenkins Server <je...@builds.apache.org> on 2024/04/21 13:45:09 UTC
[JENKINS] Solr » Solr-Smoketest-9.5 - Build # 87 - Failure!
Build: https://ci-builds.apache.org/job/Solr/job/Solr-Smoketest-9.5/87/
Log:
Started by timer
Running as SYSTEM
[EnvInject] - Loading node environment variables.
Building remotely on lucene-solr-2 (solr lucene) in workspace /home/jenkins/jenkins-slave/workspace/Solr/Solr-Smoketest-9.5
[WS-CLEANUP] Deleting project workspace...
[WS-CLEANUP] Deferred wipeout is used...
[WS-CLEANUP] Done
The recommended git tool is: NONE
No credentials specified
Cloning the remote Git repository
Cloning repository https://github.com/apache/solr.git
> git init /home/jenkins/jenkins-slave/workspace/Solr/Solr-Smoketest-9.5 # timeout=10
Fetching upstream changes from https://github.com/apache/solr.git
> git --version # timeout=10
> git --version # 'git version 2.25.1'
> git fetch --tags --force --progress -- https://github.com/apache/solr.git +refs/heads/*:refs/remotes/origin/* # timeout=10
> git config remote.origin.url https://github.com/apache/solr.git # timeout=10
> git config --add remote.origin.fetch +refs/heads/*:refs/remotes/origin/* # timeout=10
Avoid second fetch
> git rev-parse origin/branch_9_5^{commit} # timeout=10
Checking out Revision 9ad8eaac11b9969e8be9e3f93154b3feef9f4fe3 (origin/branch_9_5)
> git config core.sparsecheckout # timeout=10
> git checkout -f 9ad8eaac11b9969e8be9e3f93154b3feef9f4fe3 # timeout=10
> git branch -a -v --no-abbrev # timeout=10
> git checkout -b branch_9_5 9ad8eaac11b9969e8be9e3f93154b3feef9f4fe3 # timeout=10
Commit message: "[RefGuide] Update system-requirements (#2361)"
> git rev-list --no-walk 9ad8eaac11b9969e8be9e3f93154b3feef9f4fe3 # timeout=10
No emails were triggered.
provisioning config files...
copy managed file [gradle.properties] to file:/home/jenkins/jenkins-slave/workspace/Solr/Solr-Smoketest-9.5/gradle.properties
[Gradle] - Launching build.
[Solr-Smoketest-9.5] $ /home/jenkins/jenkins-slave/workspace/Solr/Solr-Smoketest-9.5/gradlew -Dversion.suffix= -Dgradle.user.home=/home/jenkins/jenkins-slave/workspace/Solr/.gradle -Porg.gradle.daemon=false -Pvalidation.git.failOnModified=false --continue clean assembleRelease
Downloading gradle-wrapper.jar from https://raw.githubusercontent.com/gradle/gradle/v8.4.0/gradle/wrapper/gradle-wrapper.jar
To honour the JVM settings for this build a single-use Daemon process will be forked. For more on this, please refer to https://docs.gradle.org/8.4/userguide/gradle_daemon.html#sec:disabling_the_daemon in the Gradle documentation.
Daemon will be stopped at the end of the build
> Task :buildSrc:compileJava
Note: /home/jenkins/jenkins-slave/workspace/Solr/Solr-Smoketest-9.5/buildSrc/src/main/java/org/apache/lucene/gradle/Checksum.java uses or overrides a deprecated API.
Note: Recompile with -Xlint:deprecation for details.
> Task :buildSrc:compileGroovy NO-SOURCE
> Task :buildSrc:processResources NO-SOURCE
> Task :buildSrc:classes
> Task :buildSrc:jar
> Task :clean
> Task :solr:clean UP-TO-DATE
> Task :solr:api:clean
> Task :solr:benchmark:clean
> Task :solr:core:clean
> Task :solr:distribution:clean UP-TO-DATE
> Task :solr:docker:clean UP-TO-DATE
> Task :solr:documentation:clean UP-TO-DATE
> Task :solr:example:clean UP-TO-DATE
> Task :solr:modules:clean UP-TO-DATE
> Task :solr:packaging:clean UP-TO-DATE
> Task :solr:prometheus-exporter:clean
> Task :solr:server:clean
> Task :solr:solr-ref-guide:clean
> Task :solr:solrj:clean
> Task :solr:solrj-streaming:clean
> Task :solr:solrj-zookeeper:clean
> Task :solr:test-framework:clean
> Task :solr:webapp:clean
> Task :solr:modules:analysis-extras:clean
> Task :solr:modules:analytics:clean
> Task :solr:modules:clustering:clean
> Task :solr:modules:extraction:clean
> Task :solr:modules:gcs-repository:clean
> Task :solr:modules:hadoop-auth:clean
> Task :solr:modules:hdfs:clean
> Task :solr:modules:jaegertracer-configurator:clean
> Task :solr:modules:jwt-auth:clean
> Task :solr:modules:langid:clean
> Task :solr:modules:ltr:clean
> Task :solr:modules:opentelemetry:clean
> Task :solr:modules:s3-repository:clean
> Task :solr:modules:scripting:clean
> Task :solr:modules:sql:clean
> Task :mavenLocalClean UP-TO-DATE
> Task :solr-missing-doclet:compileJava
> Task :solr-missing-doclet:processResources NO-SOURCE
> Task :solr-missing-doclet:classes
> Task :solr-missing-doclet:jar
> Task :gitStatus
> Task :checkJdkInternalsExportedToGradle
> Task :solr:api:compileJava
> Task :solr:api:processResources NO-SOURCE
> Task :solr:api:classes
> Task :solr:api:jar
> Task :solr:api:generateMetadataFileForJarsPublication SKIPPED
> Task :solr:api:generatePomFileForJarsPublication
> Task :solr:api:renderJavadoc
> Task :solr:api:javadoc SKIPPED
> Task :solr:api:javadocJar
> Task :solr:api:sourcesJar
> Task :solr:api:signJarsPublication SKIPPED
> Task :solr:api:publishJarsPublicationToBuildRepository
> Task :solr:api:resolve
SLF4J(W): No SLF4J providers were found.
SLF4J(W): Defaulting to no-operation (NOP) logger implementation
SLF4J(W): See https://www.slf4j.org/codes.html#noProviders for further details.
> Task :solr:solrj:openApiGenerate
################################################################################
# Thanks for using OpenAPI Generator. #
# Please consider donation to help us maintain this project 🙏 #
# https://opencollective.com/openapi_generator/donate #
################################################################################
Successfully generated code to /home/jenkins/jenkins-slave/workspace/Solr/Solr-Smoketest-9.5/solr/solrj/build/generated/
> Task :spotlessInternalRegisterDependencies
> Task :solr:solrj:generatedSpotlessHelper
> Task :solr:solrj:generatedSpotless
> Task :solr:solrj:compileJava
Note: Some input files use or override a deprecated API.
Note: Recompile with -Xlint:deprecation for details.
> Task :solr:solrj-streaming:compileJava
Note: Some input files use or override a deprecated API.
Note: Recompile with -Xlint:deprecation for details.
> Task :solr:solrj-zookeeper:compileJava
Note: Some input files use or override a deprecated API.
Note: Recompile with -Xlint:deprecation for details.
> Task :solr:core:compileJava
Note: Some input files use or override a deprecated API.
Note: Recompile with -Xlint:deprecation for details.
> Task :solr:core:processResources
> Task :solr:core:classes
> Task :solr:core:jar
> Task :solr:core:generateMetadataFileForJarsPublication SKIPPED
> Task :solr:core:generatePomFileForJarsPublication
> Task :solr:solrj:renderJavadoc
> Task :solr:solrj-streaming:renderJavadoc
> Task :solr:solrj-zookeeper:renderJavadoc
> Task :solr:core:renderJavadoc
> Task :solr:core:javadoc SKIPPED
> Task :solr:core:javadocJar
> Task :solr:core:sourcesJar
> Task :solr:core:signJarsPublication SKIPPED
> Task :solr:core:publishJarsPublicationToBuildRepository
> Task :solr:prometheus-exporter:compileJava
Note: Some input files use or override a deprecated API.
Note: Recompile with -Xlint:deprecation for details.
> Task :solr:prometheus-exporter:processResources NO-SOURCE
> Task :solr:prometheus-exporter:classes
> Task :solr:prometheus-exporter:jar
> Task :solr:prometheus-exporter:generateMetadataFileForJarsPublication SKIPPED
> Task :solr:prometheus-exporter:generatePomFileForJarsPublication
> Task :solr:prometheus-exporter:renderJavadoc
> Task :solr:prometheus-exporter:javadoc SKIPPED
> Task :solr:prometheus-exporter:javadocJar
> Task :solr:prometheus-exporter:sourcesJar
> Task :solr:prometheus-exporter:signJarsPublication SKIPPED
> Task :solr:prometheus-exporter:publishJarsPublicationToBuildRepository
> Task :solr:solrj:processResources
> Task :solr:solrj:classes
> Task :solr:solrj:jar
> Task :solr:solrj:generateMetadataFileForJarsPublication SKIPPED
> Task :solr:solrj:generatePomFileForJarsPublication
> Task :solr:solrj:javadoc SKIPPED
> Task :solr:solrj:javadocJar
> Task :solr:solrj:sourcesJar
> Task :solr:solrj:signJarsPublication SKIPPED
> Task :solr:solrj:publishJarsPublicationToBuildRepository
> Task :solr:solrj-streaming:processResources
> Task :solr:solrj-streaming:classes
> Task :solr:solrj-streaming:jar
> Task :solr:solrj-streaming:generateMetadataFileForJarsPublication SKIPPED
> Task :solr:solrj-streaming:generatePomFileForJarsPublication
> Task :solr:solrj-streaming:javadoc SKIPPED
> Task :solr:solrj-streaming:javadocJar
> Task :solr:solrj-streaming:sourcesJar
> Task :solr:solrj-streaming:signJarsPublication SKIPPED
> Task :solr:solrj-streaming:publishJarsPublicationToBuildRepository
> Task :solr:solrj-zookeeper:processResources NO-SOURCE
> Task :solr:solrj-zookeeper:classes
> Task :solr:solrj-zookeeper:jar
> Task :solr:solrj-zookeeper:generateMetadataFileForJarsPublication SKIPPED
> Task :solr:solrj-zookeeper:generatePomFileForJarsPublication
> Task :solr:solrj-zookeeper:javadoc SKIPPED
> Task :solr:solrj-zookeeper:javadocJar
> Task :solr:solrj-zookeeper:sourcesJar
> Task :solr:solrj-zookeeper:signJarsPublication SKIPPED
> Task :solr:solrj-zookeeper:publishJarsPublicationToBuildRepository
> Task :solr:test-framework:compileJava
Note: Some input files use or override a deprecated API.
Note: Recompile with -Xlint:deprecation for details.
> Task :solr:test-framework:processResources
> Task :solr:test-framework:classes
> Task :solr:test-framework:jar
> Task :solr:test-framework:generateMetadataFileForJarsPublication SKIPPED
> Task :solr:test-framework:generatePomFileForJarsPublication
> Task :solr:test-framework:renderJavadoc
> Task :solr:test-framework:javadoc SKIPPED
> Task :solr:test-framework:javadocJar
> Task :solr:test-framework:sourcesJar
> Task :solr:test-framework:signJarsPublication SKIPPED
> Task :solr:test-framework:publishJarsPublicationToBuildRepository
> Task :solr:modules:analysis-extras:compileJava
Note: /home/jenkins/jenkins-slave/workspace/Solr/Solr-Smoketest-9.5/solr/modules/analysis-extras/src/java/org/apache/solr/schema/ICUCollationField.java uses or overrides a deprecated API.
Note: Recompile with -Xlint:deprecation for details.
> Task :solr:modules:analysis-extras:processResources NO-SOURCE
> Task :solr:modules:analysis-extras:classes
> Task :solr:modules:analysis-extras:jar
> Task :solr:modules:analysis-extras:generateMetadataFileForJarsPublication SKIPPED
> Task :solr:modules:analysis-extras:generatePomFileForJarsPublication
> Task :solr:modules:analysis-extras:renderJavadoc
> Task :solr:modules:analysis-extras:javadoc SKIPPED
> Task :solr:modules:analysis-extras:javadocJar
> Task :solr:modules:analysis-extras:sourcesJar
> Task :solr:modules:analysis-extras:signJarsPublication SKIPPED
> Task :solr:modules:analysis-extras:publishJarsPublicationToBuildRepository
> Task :solr:modules:analytics:compileJava
Note: Some input files use or override a deprecated API.
Note: Recompile with -Xlint:deprecation for details.
> Task :solr:modules:analytics:processResources NO-SOURCE
> Task :solr:modules:analytics:classes
> Task :solr:modules:analytics:jar
> Task :solr:modules:analytics:generateMetadataFileForJarsPublication SKIPPED
> Task :solr:modules:analytics:generatePomFileForJarsPublication
> Task :solr:modules:analytics:renderJavadoc
> Task :solr:modules:analytics:javadoc SKIPPED
> Task :solr:modules:analytics:javadocJar
> Task :solr:modules:analytics:sourcesJar
> Task :solr:modules:analytics:signJarsPublication SKIPPED
> Task :solr:modules:analytics:publishJarsPublicationToBuildRepository
> Task :solr:modules:clustering:compileJava
> Task :solr:modules:clustering:processResources NO-SOURCE
> Task :solr:modules:clustering:classes
> Task :solr:modules:clustering:jar
> Task :solr:modules:clustering:generateMetadataFileForJarsPublication SKIPPED
> Task :solr:modules:clustering:generatePomFileForJarsPublication
> Task :solr:modules:clustering:renderJavadoc
> Task :solr:modules:clustering:javadoc SKIPPED
> Task :solr:modules:clustering:javadocJar
> Task :solr:modules:clustering:sourcesJar
> Task :solr:modules:clustering:signJarsPublication SKIPPED
> Task :solr:modules:clustering:publishJarsPublicationToBuildRepository
> Task :solr:modules:extraction:compileJava
Note: /home/jenkins/jenkins-slave/workspace/Solr/Solr-Smoketest-9.5/solr/modules/extraction/src/java/org/apache/solr/handler/extraction/ExtractingDocumentLoader.java uses or overrides a deprecated API.
Note: Recompile with -Xlint:deprecation for details.
> Task :solr:modules:extraction:processResources
> Task :solr:modules:extraction:classes
> Task :solr:modules:extraction:jar
> Task :solr:modules:extraction:generateMetadataFileForJarsPublication SKIPPED
> Task :solr:modules:extraction:generatePomFileForJarsPublication
> Task :solr:modules:extraction:renderJavadoc
> Task :solr:modules:extraction:javadoc SKIPPED
> Task :solr:modules:extraction:javadocJar
> Task :solr:modules:extraction:sourcesJar
> Task :solr:modules:extraction:signJarsPublication SKIPPED
> Task :solr:modules:extraction:publishJarsPublicationToBuildRepository
> Task :solr:modules:gcs-repository:compileJava
Note: /home/jenkins/jenkins-slave/workspace/Solr/Solr-Smoketest-9.5/solr/modules/gcs-repository/src/java/org/apache/solr/gcs/GCSConfigParser.java uses or overrides a deprecated API.
Note: Recompile with -Xlint:deprecation for details.
> Task :solr:modules:gcs-repository:processResources NO-SOURCE
> Task :solr:modules:gcs-repository:classes
> Task :solr:modules:gcs-repository:jar
> Task :solr:modules:gcs-repository:generateMetadataFileForJarsPublication SKIPPED
> Task :solr:modules:gcs-repository:generatePomFileForJarsPublication
> Task :solr:modules:gcs-repository:renderJavadoc
> Task :solr:modules:gcs-repository:javadoc SKIPPED
> Task :solr:modules:gcs-repository:javadocJar
> Task :solr:modules:gcs-repository:sourcesJar
> Task :solr:modules:gcs-repository:signJarsPublication SKIPPED
> Task :solr:modules:gcs-repository:publishJarsPublicationToBuildRepository
> Task :solr:modules:hadoop-auth:compileJava
Note: Some input files use or override a deprecated API.
Note: Recompile with -Xlint:deprecation for details.
> Task :solr:modules:hadoop-auth:processResources NO-SOURCE
> Task :solr:modules:hadoop-auth:classes
> Task :solr:modules:hadoop-auth:jar
> Task :solr:modules:hadoop-auth:generateMetadataFileForJarsPublication SKIPPED
> Task :solr:modules:hadoop-auth:generatePomFileForJarsPublication
> Task :solr:modules:hadoop-auth:renderJavadoc
> Task :solr:modules:hadoop-auth:javadoc SKIPPED
> Task :solr:modules:hadoop-auth:javadocJar
> Task :solr:modules:hadoop-auth:sourcesJar
> Task :solr:modules:hadoop-auth:signJarsPublication SKIPPED
> Task :solr:modules:hadoop-auth:publishJarsPublicationToBuildRepository
> Task :solr:modules:hdfs:compileJava
Note: Some input files use or override a deprecated API.
Note: Recompile with -Xlint:deprecation for details.
> Task :solr:modules:hdfs:processResources NO-SOURCE
> Task :solr:modules:hdfs:classes
> Task :solr:modules:hdfs:jar
> Task :solr:modules:hdfs:generateMetadataFileForJarsPublication SKIPPED
> Task :solr:modules:hdfs:generatePomFileForJarsPublication
> Task :solr:modules:hdfs:renderJavadoc
> Task :solr:modules:hdfs:javadoc SKIPPED
> Task :solr:modules:hdfs:javadocJar
> Task :solr:modules:hdfs:sourcesJar
> Task :solr:modules:hdfs:signJarsPublication SKIPPED
> Task :solr:modules:hdfs:publishJarsPublicationToBuildRepository
> Task :solr:modules:jaegertracer-configurator:compileJava
> Task :solr:modules:jaegertracer-configurator:processResources NO-SOURCE
> Task :solr:modules:jaegertracer-configurator:classes
> Task :solr:modules:jaegertracer-configurator:jar
> Task :solr:modules:jaegertracer-configurator:generateMetadataFileForJarsPublication SKIPPED
> Task :solr:modules:jaegertracer-configurator:generatePomFileForJarsPublication
> Task :solr:modules:jaegertracer-configurator:renderJavadoc
> Task :solr:modules:jaegertracer-configurator:javadoc SKIPPED
> Task :solr:modules:jaegertracer-configurator:javadocJar
> Task :solr:modules:jaegertracer-configurator:sourcesJar
> Task :solr:modules:jaegertracer-configurator:signJarsPublication SKIPPED
> Task :solr:modules:jaegertracer-configurator:publishJarsPublicationToBuildRepository
> Task :solr:modules:jwt-auth:compileJava
> Task :solr:modules:jwt-auth:processResources NO-SOURCE
> Task :solr:modules:jwt-auth:classes
> Task :solr:modules:jwt-auth:jar
> Task :solr:modules:jwt-auth:generateMetadataFileForJarsPublication SKIPPED
> Task :solr:modules:jwt-auth:generatePomFileForJarsPublication
> Task :solr:modules:jwt-auth:renderJavadoc
> Task :solr:modules:jwt-auth:javadoc SKIPPED
> Task :solr:modules:jwt-auth:javadocJar
> Task :solr:modules:jwt-auth:sourcesJar
> Task :solr:modules:jwt-auth:signJarsPublication SKIPPED
> Task :solr:modules:jwt-auth:publishJarsPublicationToBuildRepository
> Task :solr:modules:langid:compileJava
Note: Some input files use or override a deprecated API.
Note: Recompile with -Xlint:deprecation for details.
> Task :solr:modules:langid:processResources
> Task :solr:modules:langid:classes
> Task :solr:modules:langid:jar
> Task :solr:modules:langid:generateMetadataFileForJarsPublication SKIPPED
> Task :solr:modules:langid:generatePomFileForJarsPublication
> Task :solr:modules:langid:renderJavadoc
> Task :solr:modules:langid:javadoc SKIPPED
> Task :solr:modules:langid:javadocJar
> Task :solr:modules:langid:sourcesJar
> Task :solr:modules:langid:signJarsPublication SKIPPED
> Task :solr:modules:langid:publishJarsPublicationToBuildRepository
> Task :solr:modules:ltr:compileJava
Note: Some input files use or override a deprecated API.
Note: Recompile with -Xlint:deprecation for details.
> Task :solr:modules:ltr:processResources NO-SOURCE
> Task :solr:modules:ltr:classes
> Task :solr:modules:ltr:jar
> Task :solr:modules:ltr:generateMetadataFileForJarsPublication SKIPPED
> Task :solr:modules:ltr:generatePomFileForJarsPublication
> Task :solr:modules:ltr:renderJavadoc
> Task :solr:modules:ltr:javadoc SKIPPED
> Task :solr:modules:ltr:javadocJar
> Task :solr:modules:ltr:sourcesJar
> Task :solr:modules:ltr:signJarsPublication SKIPPED
> Task :solr:modules:ltr:publishJarsPublicationToBuildRepository
> Task :solr:modules:opentelemetry:compileJava
> Task :solr:modules:opentelemetry:processResources NO-SOURCE
> Task :solr:modules:opentelemetry:classes
> Task :solr:modules:opentelemetry:jar
> Task :solr:modules:opentelemetry:generateMetadataFileForJarsPublication SKIPPED
> Task :solr:modules:opentelemetry:generatePomFileForJarsPublication
> Task :solr:modules:opentelemetry:renderJavadoc
> Task :solr:modules:opentelemetry:javadoc SKIPPED
> Task :solr:modules:opentelemetry:javadocJar
> Task :solr:modules:opentelemetry:sourcesJar
> Task :solr:modules:opentelemetry:signJarsPublication SKIPPED
> Task :solr:modules:opentelemetry:publishJarsPublicationToBuildRepository
> Task :solr:modules:s3-repository:compileJava
> Task :solr:modules:s3-repository:processResources NO-SOURCE
> Task :solr:modules:s3-repository:classes
> Task :solr:modules:s3-repository:jar
> Task :solr:modules:s3-repository:generateMetadataFileForJarsPublication SKIPPED
> Task :solr:modules:s3-repository:generatePomFileForJarsPublication
> Task :solr:modules:s3-repository:renderJavadoc
> Task :solr:modules:s3-repository:javadoc SKIPPED
> Task :solr:modules:s3-repository:javadocJar
> Task :solr:modules:s3-repository:sourcesJar
> Task :solr:modules:s3-repository:signJarsPublication SKIPPED
> Task :solr:modules:s3-repository:publishJarsPublicationToBuildRepository
> Task :solr:modules:scripting:compileJava
Note: /home/jenkins/jenkins-slave/workspace/Solr/Solr-Smoketest-9.5/solr/modules/scripting/src/java/org/apache/solr/scripting/xslt/XSLTUpdateRequestHandler.java uses or overrides a deprecated API.
Note: Recompile with -Xlint:deprecation for details.
> Task :solr:modules:scripting:processResources NO-SOURCE
> Task :solr:modules:scripting:classes
> Task :solr:modules:scripting:jar
> Task :solr:modules:scripting:generateMetadataFileForJarsPublication SKIPPED
> Task :solr:modules:scripting:generatePomFileForJarsPublication
> Task :solr:modules:scripting:renderJavadoc
> Task :solr:modules:scripting:javadoc SKIPPED
> Task :solr:modules:scripting:javadocJar
> Task :solr:modules:scripting:sourcesJar
> Task :solr:modules:scripting:signJarsPublication SKIPPED
> Task :solr:modules:scripting:publishJarsPublicationToBuildRepository
> Task :solr:modules:sql:compileJava
Note: Some input files use or override a deprecated API.
Note: Recompile with -Xlint:deprecation for details.
> Task :solr:modules:sql:processResources
> Task :solr:modules:sql:classes
> Task :solr:modules:sql:jar
> Task :solr:modules:sql:generateMetadataFileForJarsPublication SKIPPED
> Task :solr:modules:sql:generatePomFileForJarsPublication
> Task :solr:modules:sql:renderJavadoc
> Task :solr:modules:sql:javadoc SKIPPED
> Task :solr:modules:sql:javadocJar
> Task :solr:modules:sql:sourcesJar
> Task :solr:modules:sql:signJarsPublication SKIPPED
> Task :solr:modules:sql:publishJarsPublicationToBuildRepository
> Task :mavenToLocalFolder
Local maven artifacts (poms, jars) created at: /home/jenkins/jenkins-slave/workspace/Solr/Solr-Smoketest-9.5/build/maven-local
> Task :checkWorkingCopyClean
> Task :solr:distribution:assembleSourceTgz
> Task :solr:docker:createBodySnippetDockerfile
> Task :solr:docker:createDockerfileLocal
> Task :solr:docker:assemblePackaging
> Task :solr:documentation:changesToHtml
> Task :solr:documentation:copyDocumentationAssets
> Task :solr:documentation:markdownToHtml
> Task :solr:documentation:copyChangesToHtmlForMiniSite
> Task :solr:documentation:copyMiniDocumentationAssets
> Task :solr:documentation:createMiniDocumentationIndex
> Task :solr:documentation:documentationMinimal
> Task :solr:core:assemblePostJar
> Task :solr:example:assemblePackaging
> Task :solr:prometheus-exporter:assemblePackaging
> Task :solr:webapp:compileJava NO-SOURCE
> Task :solr:webapp:processResources NO-SOURCE
> Task :solr:webapp:classes UP-TO-DATE
> Task :solr:api:buildJSClient
################################################################################
# Thanks for using OpenAPI Generator. #
# Please consider donation to help us maintain this project 🙏 #
# https://opencollective.com/openapi_generator/donate #
################################################################################
Successfully generated code to /home/jenkins/jenkins-slave/workspace/Solr/Solr-Smoketest-9.5/solr/api/build/generated/js
> Task :solr:webapp:nodeSetup
> Task :solr:webapp:npmSetup SKIPPED
> Task :solr:webapp:downloadBrowserify
added 163 packages, changed 1 package, and audited 165 packages in 2s
31 packages are looking for funding
run `npm fund` for details
found 0 vulnerabilities
> Task :solr:webapp:syncJSClientSourceCode
> Task :solr:webapp:jsClientDownloadDeps
npm WARN deprecated @babel/plugin-proposal-nullish-coalescing-operator@7.18.6: This proposal has been merged to the ECMAScript standard and thus this plugin is no longer maintained. Please use @babel/plugin-transform-nullish-coalescing-operator instead.
npm WARN deprecated @babel/plugin-proposal-numeric-separator@7.18.6: This proposal has been merged to the ECMAScript standard and thus this plugin is no longer maintained. Please use @babel/plugin-transform-numeric-separator instead.
npm WARN deprecated @babel/plugin-proposal-json-strings@7.18.6: This proposal has been merged to the ECMAScript standard and thus this plugin is no longer maintained. Please use @babel/plugin-transform-json-strings instead.
npm WARN deprecated @babel/plugin-proposal-export-namespace-from@7.18.9: This proposal has been merged to the ECMAScript standard and thus this plugin is no longer maintained. Please use @babel/plugin-transform-export-namespace-from instead.
npm WARN deprecated @babel/plugin-proposal-class-properties@7.18.6: This proposal has been merged to the ECMAScript standard and thus this plugin is no longer maintained. Please use @babel/plugin-transform-class-properties instead.
npm WARN deprecated @babel/plugin-proposal-logical-assignment-operators@7.20.7: This proposal has been merged to the ECMAScript standard and thus this plugin is no longer maintained. Please use @babel/plugin-transform-logical-assignment-operators instead.
npm WARN deprecated @babel/plugin-proposal-optional-chaining@7.21.0: This proposal has been merged to the ECMAScript standard and thus this plugin is no longer maintained. Please use @babel/plugin-transform-optional-chaining instead.
npm WARN deprecated formidable@1.2.6: Please upgrade to latest, formidable@v2 or formidable@v3! Check these notes: https://bit.ly/2ZEqIau
npm WARN deprecated superagent@5.3.1: Please upgrade to v7.0.2+ of superagent. We have fixed numerous issues with streams, form-data, attach(), filesystem errors not bubbling up (ENOENT on attach()), and all tests are now passing. See the releases tab for more information at <https://github.com/visionmedia/superagent/releases>.
npm WARN deprecated sinon@7.5.0: 16.1.1
> v2_api@9.5.1 prepare
> npm run build
> v2_api@9.5.1 build
> babel src -d dist
Successfully compiled 80 files with Babel (1951ms).
added 357 packages, and audited 358 packages in 14s
42 packages are looking for funding
run `npm fund` for details
3 vulnerabilities (1 moderate, 2 high)
To address all issues (including breaking changes), run:
npm audit fix --force
Run `npm audit` for details.
> Task :solr:webapp:jsClientBuild
> v2_api@9.5.1 build
> babel src -d dist
Successfully compiled 80 files with Babel (2062ms).
> Task :solr:webapp:generateJsClientBundle
> Task :solr:webapp:finalizeJsBundleDir
> Task :solr:webapp:war
> Task :solr:server:assemblePackaging
> Task :solr:modules:analysis-extras:assemblePackaging
> Task :solr:modules:analytics:assemblePackaging
> Task :solr:modules:clustering:assemblePackaging
> Task :solr:modules:extraction:assemblePackaging
> Task :solr:modules:gcs-repository:assemblePackaging
> Task :solr:modules:hadoop-auth:assemblePackaging
> Task :solr:modules:hdfs:assemblePackaging
> Task :solr:modules:jaegertracer-configurator:assemblePackaging
> Task :solr:modules:jwt-auth:assemblePackaging
> Task :solr:modules:langid:assemblePackaging
> Task :solr:modules:ltr:assemblePackaging
> Task :solr:modules:opentelemetry:assemblePackaging
> Task :solr:modules:s3-repository:assemblePackaging
> Task :solr:modules:scripting:assemblePackaging
> Task :solr:modules:sql:assemblePackaging
> Task :solr:packaging:fullDistTar
> Task :solr:packaging:slimDistTar
> Task :solr:distribution:computeChecksums
> Task :solr:distribution:prepareGitRev
> Task :solr:docker:createDockerfileOfficialFull
> Task :solr:docker:createDockerfileOfficialSlim
> Task :solr:distribution:assembleRelease
Deprecated Gradle features were used in this build, making it incompatible with Gradle 9.0.
You can use '--warning-mode all' to show the individual deprecation warnings and determine if they come from your own scripts or plugins.
For more on this, please refer to https://docs.gradle.org/8.4/userguide/command_line_interface.html#sec:command_line_warnings in the Gradle documentation.
BUILD SUCCESSFUL in 4m 37s
254 actionable tasks: 246 executed, 8 up-to-date
Build step 'Invoke Gradle script' changed build result to SUCCESS
Run condition [Always] enabling perform for step [Execute shell]
[Solr-Smoketest-9.5] $ /bin/bash /tmp/jenkins8021408319852013928.sh
Installing Python script requirements
Defaulting to user installation because normal site-packages is not writeable
Requirement already satisfied: six~=1.16.0 in /home/jenkins/.local/lib/python3.8/site-packages (from -r dev-tools/scripts/requirements.txt (line 1)) (1.16.0)
Requirement already satisfied: Jinja2~=3.1.1 in /home/jenkins/.local/lib/python3.8/site-packages (from -r dev-tools/scripts/requirements.txt (line 2)) (3.1.2)
Requirement already satisfied: PyYAML~=6.0 in /home/jenkins/.local/lib/python3.8/site-packages (from -r dev-tools/scripts/requirements.txt (line 3)) (6.0)
Requirement already satisfied: holidays~=0.16 in /home/jenkins/.local/lib/python3.8/site-packages (from -r dev-tools/scripts/requirements.txt (line 4)) (0.21)
Requirement already satisfied: ics~=0.7.2 in /home/jenkins/.local/lib/python3.8/site-packages (from -r dev-tools/scripts/requirements.txt (line 5)) (0.7.2)
Requirement already satisfied: console-menu~=0.7.1 in /home/jenkins/.local/lib/python3.8/site-packages (from -r dev-tools/scripts/requirements.txt (line 6)) (0.7.1)
Requirement already satisfied: PyGithub~=1.56 in /home/jenkins/.local/lib/python3.8/site-packages (from -r dev-tools/scripts/requirements.txt (line 7)) (1.58.0)
Requirement already satisfied: jira~=3.4.1 in /home/jenkins/.local/lib/python3.8/site-packages (from -r dev-tools/scripts/requirements.txt (line 8)) (3.4.1)
Requirement already satisfied: MarkupSafe>=2.0 in /home/jenkins/.local/lib/python3.8/site-packages (from Jinja2~=3.1.1->-r dev-tools/scripts/requirements.txt (line 2)) (2.1.2)
Requirement already satisfied: PyMeeus in /home/jenkins/.local/lib/python3.8/site-packages (from holidays~=0.16->-r dev-tools/scripts/requirements.txt (line 4)) (0.5.11)
Requirement already satisfied: convertdate>=2.3.0 in /home/jenkins/.local/lib/python3.8/site-packages (from holidays~=0.16->-r dev-tools/scripts/requirements.txt (line 4)) (2.4.0)
Requirement already satisfied: hijri-converter in /home/jenkins/.local/lib/python3.8/site-packages (from holidays~=0.16->-r dev-tools/scripts/requirements.txt (line 4)) (2.2.3)
Requirement already satisfied: korean-lunar-calendar in /home/jenkins/.local/lib/python3.8/site-packages (from holidays~=0.16->-r dev-tools/scripts/requirements.txt (line 4)) (0.2.1)
Requirement already satisfied: python-dateutil in /usr/lib/python3/dist-packages (from holidays~=0.16->-r dev-tools/scripts/requirements.txt (line 4)) (2.7.3)
Requirement already satisfied: backports.zoneinfo in /home/jenkins/.local/lib/python3.8/site-packages (from holidays~=0.16->-r dev-tools/scripts/requirements.txt (line 4)) (0.2.1)
Requirement already satisfied: arrow>=0.11 in /home/jenkins/.local/lib/python3.8/site-packages (from ics~=0.7.2->-r dev-tools/scripts/requirements.txt (line 5)) (0.14.7)
Requirement already satisfied: tatsu>4.2 in /home/jenkins/.local/lib/python3.8/site-packages (from ics~=0.7.2->-r dev-tools/scripts/requirements.txt (line 5)) (5.6.1)
Requirement already satisfied: attrs>=19.1.0 in /usr/lib/python3/dist-packages (from ics~=0.7.2->-r dev-tools/scripts/requirements.txt (line 5)) (19.3.0)
Requirement already satisfied: ansiwrap in /home/jenkins/.local/lib/python3.8/site-packages (from console-menu~=0.7.1->-r dev-tools/scripts/requirements.txt (line 6)) (0.8.4)
Requirement already satisfied: deprecated in /home/jenkins/.local/lib/python3.8/site-packages (from PyGithub~=1.56->-r dev-tools/scripts/requirements.txt (line 7)) (1.2.13)
Requirement already satisfied: pyjwt>=2.4.0 in /home/jenkins/.local/lib/python3.8/site-packages (from PyGithub~=1.56->-r dev-tools/scripts/requirements.txt (line 7)) (2.6.0)
Requirement already satisfied: pynacl>=1.4.0 in /home/jenkins/.local/lib/python3.8/site-packages (from PyGithub~=1.56->-r dev-tools/scripts/requirements.txt (line 7)) (1.5.0)
Requirement already satisfied: requests>=2.14.0 in /usr/lib/python3/dist-packages (from PyGithub~=1.56->-r dev-tools/scripts/requirements.txt (line 7)) (2.22.0)
Requirement already satisfied: defusedxml in /home/jenkins/.local/lib/python3.8/site-packages (from jira~=3.4.1->-r dev-tools/scripts/requirements.txt (line 8)) (0.7.1)
Requirement already satisfied: packaging in /home/jenkins/.local/lib/python3.8/site-packages (from jira~=3.4.1->-r dev-tools/scripts/requirements.txt (line 8)) (23.0)
Requirement already satisfied: requests-oauthlib>=1.1.0 in /home/jenkins/.local/lib/python3.8/site-packages (from jira~=3.4.1->-r dev-tools/scripts/requirements.txt (line 8)) (1.3.1)
Requirement already satisfied: requests-toolbelt in /home/jenkins/.local/lib/python3.8/site-packages (from jira~=3.4.1->-r dev-tools/scripts/requirements.txt (line 8)) (0.9.1)
Requirement already satisfied: typing-extensions>=3.7.4.2 in /home/jenkins/.local/lib/python3.8/site-packages (from jira~=3.4.1->-r dev-tools/scripts/requirements.txt (line 8)) (4.5.0)
Requirement already satisfied: cffi>=1.4.1 in /usr/local/lib/python3.8/dist-packages (from pynacl>=1.4.0->PyGithub~=1.56->-r dev-tools/scripts/requirements.txt (line 7)) (1.14.2)
Requirement already satisfied: oauthlib>=3.0.0 in /usr/lib/python3/dist-packages (from requests-oauthlib>=1.1.0->jira~=3.4.1->-r dev-tools/scripts/requirements.txt (line 8)) (3.1.0)
Requirement already satisfied: textwrap3>=0.9.2 in /home/jenkins/.local/lib/python3.8/site-packages (from ansiwrap->console-menu~=0.7.1->-r dev-tools/scripts/requirements.txt (line 6)) (0.9.2)
Requirement already satisfied: wrapt<2,>=1.10 in /home/jenkins/.local/lib/python3.8/site-packages (from deprecated->PyGithub~=1.56->-r dev-tools/scripts/requirements.txt (line 7)) (1.13.3)
Requirement already satisfied: pycparser in /usr/local/lib/python3.8/dist-packages (from cffi>=1.4.1->pynacl>=1.4.0->PyGithub~=1.56->-r dev-tools/scripts/requirements.txt (line 7)) (2.20)
DEPRECATION: dblatex 0.3.11py3 has a non-standard version number. pip 24.1 will enforce this behaviour change. A possible replacement is to upgrade to a newer version of dblatex or contact the author to suggest that they release a version with a conforming version number. Discussion can be found at https://github.com/pypa/pip/issues/12063
DEPRECATION: devscripts 2.20.2ubuntu2 has a non-standard version number. pip 24.1 will enforce this behaviour change. A possible replacement is to upgrade to a newer version of devscripts or contact the author to suggest that they release a version with a conforming version number. Discussion can be found at https://github.com/pypa/pip/issues/12063
Starting Smoke tester in folder /home/jenkins/jenkins-slave/workspace/Solr/Solr-Smoketest-9.5
Java 11 JAVA_HOME=/home/jenkins/tools/java/latest11
NOTE: output encoding is utf-8
NOTE: Not running @Nightly or @BadApple tests. Please verify that recent Jenkins runs have passed.
Load release URL "file:///home/jenkins/jenkins-slave/workspace/Solr/Solr-Smoketest-9.5/solr/distribution/build/release"...
Get KEYS...
Downloading online KEYS file https://archive.apache.org/dist/solr/KEYS
Downloading https://archive.apache.org/dist/solr/KEYS
0.3 MB in 1.10 sec (0.3 MB/sec)
Test Solr...
test basics...
check changes HTML...
check OpenAPI specification...
download solr-9.5.1-slim.tgz...
Downloading file:///home/jenkins/jenkins-slave/workspace/Solr/Solr-Smoketest-9.5/solr/distribution/build/release/solr-9.5.1-slim.tgz
61.2 MB in 0.05 sec (1134.5 MB/sec)
verify sha512 digest
download solr-9.5.1-src.tgz...
Downloading file:///home/jenkins/jenkins-slave/workspace/Solr/Solr-Smoketest-9.5/solr/distribution/build/release/solr-9.5.1-src.tgz
86.0 MB in 0.07 sec (1231.2 MB/sec)
verify sha512 digest
download solr-9.5.1.tgz...
Downloading file:///home/jenkins/jenkins-slave/workspace/Solr/Solr-Smoketest-9.5/solr/distribution/build/release/solr-9.5.1.tgz
268.4 MB in 0.24 sec (1137.9 MB/sec)
verify sha512 digest
unpack solr-9.5.1.tgz...
solr-9.5.1.tgz
Checking LICENSE.txt
Checking NOTICE.txt
Checking README.txt
Checking CHANGES.txt
Checking bin
Checking modules
Checking docker
Checking prometheus-exporter
Checking docs
Checking example
Checking licenses
Checking server
Checking lib
verify JAR metadata/identity/no javax.* or java.* classes...
**WARNING**: skipping check of /home/jenkins/jenkins-slave/workspace/Solr/Solr-Smoketest-9.5/_tmp/smoke_1713704489/unpack/solr-9.5.1/modules/extraction/lib/unit-api-1.0.jar: it has javax.* classes
**WARNING**: skipping check of /home/jenkins/jenkins-slave/workspace/Solr/Solr-Smoketest-9.5/_tmp/smoke_1713704489/unpack/solr-9.5.1/modules/extraction/lib/jakarta.activation-1.2.2.jar: it has javax.* classes
**WARNING**: skipping check of /home/jenkins/jenkins-slave/workspace/Solr/Solr-Smoketest-9.5/_tmp/smoke_1713704489/unpack/solr-9.5.1/modules/extraction/lib/jakarta.activation-api-1.2.2.jar: it has javax.* classes
**WARNING**: skipping check of /home/jenkins/jenkins-slave/workspace/Solr/Solr-Smoketest-9.5/_tmp/smoke_1713704489/unpack/solr-9.5.1/modules/extraction/lib/jakarta.xml.bind-api-2.3.3.jar: it has javax.* classes
**WARNING**: skipping check of /home/jenkins/jenkins-slave/workspace/Solr/Solr-Smoketest-9.5/_tmp/smoke_1713704489/unpack/solr-9.5.1/server/solr-webapp/webapp/WEB-INF/lib/jakarta.validation-api-3.0.2.jar: it has javax.* classes
**WARNING**: skipping check of /home/jenkins/jenkins-slave/workspace/Solr/Solr-Smoketest-9.5/_tmp/smoke_1713704489/unpack/solr-9.5.1/server/solr-webapp/webapp/WEB-INF/lib/jakarta.annotation-api-2.1.1.jar: it has javax.* classes
**WARNING**: skipping check of /home/jenkins/jenkins-slave/workspace/Solr/Solr-Smoketest-9.5/_tmp/smoke_1713704489/unpack/solr-9.5.1/server/solr-webapp/webapp/WEB-INF/lib/jakarta.inject-api-2.0.1.jar: it has javax.* classes
**WARNING**: skipping check of /home/jenkins/jenkins-slave/workspace/Solr/Solr-Smoketest-9.5/_tmp/smoke_1713704489/unpack/solr-9.5.1/server/solr-webapp/webapp/WEB-INF/lib/jakarta.ws.rs-api-3.1.0.jar: it has javax.* classes
**WARNING**: skipping check of /home/jenkins/jenkins-slave/workspace/Solr/Solr-Smoketest-9.5/_tmp/smoke_1713704489/unpack/solr-9.5.1/server/lib/ext/jetty-servlet-api-4.0.6.jar: it has javax.* classes
copying unpacked distribution for Java 11 ...
test solr example w/ Java 11...
start Solr instance (log=/home/jenkins/jenkins-slave/workspace/Solr/Solr-Smoketest-9.5/_tmp/smoke_1713704489/unpack/solr-9.5.1-java11/solr-example.log)...
No process found for Solr node running on port 8983
Running techproducts example on port 8983 from /home/jenkins/jenkins-slave/workspace/Solr/Solr-Smoketest-9.5/_tmp/smoke_1713704489/unpack/solr-9.5.1-java11
*** [WARN] *** Your open file limit is currently 60000.
It should be set to 65000 to avoid operational disruption.
If you no longer wish to see this warning, set SOLR_ULIMIT_CHECKS to false in your profile or solr.in.sh
*** [WARN] *** Your Max Processes Limit is currently 30000.
It should be set to 65000 to avoid operational disruption.
If you no longer wish to see this warning, set SOLR_ULIMIT_CHECKS to false in your profile or solr.in.sh
Creating Solr home directory /home/jenkins/jenkins-slave/workspace/Solr/Solr-Smoketest-9.5/_tmp/smoke_1713704489/unpack/solr-9.5.1-java11/example/techproducts/solr
Starting up Solr on port 8983 using command:
"bin/solr" start -p 8983 -s "example/techproducts/solr"
*** [WARN] *** Your open file limit is currently 60000.
It should be set to 65000 to avoid operational disruption.
If you no longer wish to see this warning, set SOLR_ULIMIT_CHECKS to false in your profile or solr.in.sh
*** [WARN] *** Your Max Processes Limit is currently 30000.
It should be set to 65000 to avoid operational disruption.
If you no longer wish to see this warning, set SOLR_ULIMIT_CHECKS to false in your profile or solr.in.sh
Waiting up to 180 seconds to see Solr running on port 8983 [|] [/] [-] [\] [|]
Started Solr server on port 8983 (pid=2701837). Happy searching!
Created new core 'techproducts'
Indexing tech product example docs from /home/jenkins/jenkins-slave/workspace/Solr/Solr-Smoketest-9.5/_tmp/smoke_1713704489/unpack/solr-9.5.1-java11/example/exampledocs
SimplePostTool version 9.5.1
Posting files to [base] url http://localhost:8983/solr/techproducts/update using content-type application/xml...
POSTing file solr.xml to [base]
POSTing file sd500.xml to [base]
POSTing file hd.xml to [base]
POSTing file manufacturers.xml to [base]
POSTing file ipod_other.xml to [base]
POSTing file gb18030-example.xml to [base]
POSTing file mp500.xml to [base]
POSTing file vidcard.xml to [base]
POSTing file utf8-example.xml to [base]
POSTing file monitor2.xml to [base]
POSTing file money.xml to [base]
POSTing file monitor.xml to [base]
POSTing file ipod_video.xml to [base]
POSTing file mem.xml to [base]
14 files indexed.
COMMITting Solr index changes to http://localhost:8983/solr/techproducts/update...
Time spent: 0:00:00.447
test utf8...
run query...
stop server using: bin/solr stop -p 8983
Sending stop command to Solr running on port 8983 ... waiting up to 180 seconds to allow Jetty process 2701837 to stop gracefully.
[|] [/] [-] [\] unpack solr-9.5.1-slim.tgz...
solr-9.5.1-slim.tgz
Checking LICENSE.txt
Checking NOTICE.txt
Checking README.txt
Checking CHANGES.txt
Checking bin
Checking docker
Checking docs
Checking example
Checking licenses
Checking server
Checking lib
verify JAR metadata/identity/no javax.* or java.* classes...
**WARNING**: skipping check of /home/jenkins/jenkins-slave/workspace/Solr/Solr-Smoketest-9.5/_tmp/smoke_1713704489/unpack/solr-9.5.1-slim/server/solr-webapp/webapp/WEB-INF/lib/jakarta.validation-api-3.0.2.jar: it has javax.* classes
**WARNING**: skipping check of /home/jenkins/jenkins-slave/workspace/Solr/Solr-Smoketest-9.5/_tmp/smoke_1713704489/unpack/solr-9.5.1-slim/server/solr-webapp/webapp/WEB-INF/lib/jakarta.annotation-api-2.1.1.jar: it has javax.* classes
**WARNING**: skipping check of /home/jenkins/jenkins-slave/workspace/Solr/Solr-Smoketest-9.5/_tmp/smoke_1713704489/unpack/solr-9.5.1-slim/server/solr-webapp/webapp/WEB-INF/lib/jakarta.inject-api-2.0.1.jar: it has javax.* classes
**WARNING**: skipping check of /home/jenkins/jenkins-slave/workspace/Solr/Solr-Smoketest-9.5/_tmp/smoke_1713704489/unpack/solr-9.5.1-slim/server/solr-webapp/webapp/WEB-INF/lib/jakarta.ws.rs-api-3.1.0.jar: it has javax.* classes
**WARNING**: skipping check of /home/jenkins/jenkins-slave/workspace/Solr/Solr-Smoketest-9.5/_tmp/smoke_1713704489/unpack/solr-9.5.1-slim/server/lib/ext/jetty-servlet-api-4.0.6.jar: it has javax.* classes
copying unpacked distribution for Java 11 ...
test solr example w/ Java 11...
start Solr instance (log=/home/jenkins/jenkins-slave/workspace/Solr/Solr-Smoketest-9.5/_tmp/smoke_1713704489/unpack/solr-9.5.1-slim-java11/solr-example.log)...
No process found for Solr node running on port 8983
Running techproducts example on port 8983 from /home/jenkins/jenkins-slave/workspace/Solr/Solr-Smoketest-9.5/_tmp/smoke_1713704489/unpack/solr-9.5.1-slim-java11
*** [WARN] *** Your open file limit is currently 60000.
It should be set to 65000 to avoid operational disruption.
If you no longer wish to see this warning, set SOLR_ULIMIT_CHECKS to false in your profile or solr.in.sh
*** [WARN] *** Your Max Processes Limit is currently 30000.
It should be set to 65000 to avoid operational disruption.
If you no longer wish to see this warning, set SOLR_ULIMIT_CHECKS to false in your profile or solr.in.sh
Creating Solr home directory /home/jenkins/jenkins-slave/workspace/Solr/Solr-Smoketest-9.5/_tmp/smoke_1713704489/unpack/solr-9.5.1-slim-java11/example/techproducts/solr
Starting up Solr on port 8983 using command:
"bin/solr" start -p 8983 -s "example/techproducts/solr"
*** [WARN] *** Your open file limit is currently 60000.
It should be set to 65000 to avoid operational disruption.
If you no longer wish to see this warning, set SOLR_ULIMIT_CHECKS to false in your profile or solr.in.sh
*** [WARN] *** Your Max Processes Limit is currently 30000.
It should be set to 65000 to avoid operational disruption.
If you no longer wish to see this warning, set SOLR_ULIMIT_CHECKS to false in your profile or solr.in.sh
Waiting up to 180 seconds to see Solr running on port 8983 [|] [/] [-] [\] [|]
Started Solr server on port 8983 (pid=2702327). Happy searching!
Created new core 'techproducts'
Indexing tech product example docs from /home/jenkins/jenkins-slave/workspace/Solr/Solr-Smoketest-9.5/_tmp/smoke_1713704489/unpack/solr-9.5.1-slim-java11/example/exampledocs
SimplePostTool version 9.5.1
Posting files to [base] url http://localhost:8983/solr/techproducts/update using content-type application/xml...
POSTing file solr.xml to [base]
POSTing file sd500.xml to [base]
POSTing file hd.xml to [base]
POSTing file manufacturers.xml to [base]
POSTing file ipod_other.xml to [base]
POSTing file gb18030-example.xml to [base]
POSTing file mp500.xml to [base]
POSTing file vidcard.xml to [base]
POSTing file utf8-example.xml to [base]
POSTing file monitor2.xml to [base]
POSTing file money.xml to [base]
POSTing file monitor.xml to [base]
POSTing file ipod_video.xml to [base]
POSTing file mem.xml to [base]
14 files indexed.
COMMITting Solr index changes to http://localhost:8983/solr/techproducts/update...
Time spent: 0:00:00.462
test utf8...
run query...
stop server using: bin/solr stop -p 8983
Sending stop command to Solr running on port 8983 ... waiting up to 180 seconds to allow Jetty process 2702327 to stop gracefully.
[|] [/] [-] [\] unpack solr-9.5.1-src.tgz...
solr-9.5.1-src.tgz
Checking LICENSE.txt
Checking NOTICE.txt
Checking README.md
Checking CONTRIBUTING.md
Checking CHANGES.txt
Checking README.adoc
Checking buildSrc
Checking dev-docs
Checking dev-tools
Checking gradle
Checking help
Checking solr
Checking build.gradle
Checking gradlew
Checking gradlew.bat
Checking settings.gradle
Checking versions.lock
Checking versions.props
Checking benchmark
Checking bin
Checking modules
Checking api
Checking core
Checking docker
Checking documentation
Checking example
Checking licenses
Checking packaging
Checking distribution
Checking prometheus-exporter
Checking server
Checking solr-ref-guide
Checking solrj
Checking solrj-streaming
Checking solrj-zookeeper
Checking test-framework
Checking webapp
Checking .gitignore
Checking .gitattributes
Checking build.gradle
make sure no JARs/WARs in src dist...
run "./gradlew --no-daemon check -p solr/documentation"
run tests w/ Java 11 and testArgs='-Dtests.nightly=false -Dtests.badapples=false '...
command "export JAVA_HOME="/home/jenkins/tools/java/latest11" PATH="/home/jenkins/tools/java/latest11/bin:$PATH" JAVACMD="/home/jenkins/tools/java/latest11/bin/java"; ./gradlew --no-daemon test -Dtests.nightly=false -Dtests.badapples=false " failed:
To honour the JVM settings for this build a single-use Daemon process will be forked. For more on this, please refer to https://docs.gradle.org/8.4/userguide/gradle_daemon.html#sec:disabling_the_daemon in the Gradle documentation.
Daemon will be stopped at the end of the build
> Task :buildSrc:compileJava UP-TO-DATE
> Task :buildSrc:compileGroovy NO-SOURCE
> Task :buildSrc:processResources NO-SOURCE
> Task :buildSrc:classes UP-TO-DATE
> Task :buildSrc:jar UP-TO-DATE
> Task :solr:api:processResources NO-SOURCE
> Task :solr:api:processTestResources
> Task :solr:core:processResources UP-TO-DATE
> Task :solr:solrj:processResources UP-TO-DATE
> Task :solr:solrj-streaming:processResources UP-TO-DATE
> Task :solr:solrj-zookeeper:processResources NO-SOURCE
> Task :solr:test-framework:processResources
> Task :solr:benchmark:processResources
> Task :solr:benchmark:processTestResources
> Task :gitStatus
> Task :checkJdkInternalsExportedToGradle
> Task :solr:api:compileJava UP-TO-DATE
> Task :solr:api:classes UP-TO-DATE
> Task :solr:api:jar UP-TO-DATE
> Task :ensureJdkSupported
> Task :randomizationInfo
Running tests with randomization seed: tests.seed=68CC3D56FB3FDBC2
> Task :solr:api:resolve UP-TO-DATE
> Task :solr:core:processTestResources
> Task :solr:modules:analysis-extras:processResources NO-SOURCE
> Task :solr:prometheus-exporter:processResources NO-SOURCE
> Task :solr:prometheus-exporter:processTestResources
> Task :solr:server:compileJava SKIPPED
> Task :solr:server:processResources NO-SOURCE
> Task :solr:server:classes UP-TO-DATE
> Task :solr:server:compileTestJava NO-SOURCE
> Task :solr:server:processTestResources NO-SOURCE
> Task :solr:server:testClasses UP-TO-DATE
> Task :solr:server:test NO-SOURCE
> Task :solr:server:wipeTaskTemp
> Task :solr:solr-ref-guide:compileJava NO-SOURCE
> Task :solr:solr-ref-guide:processResources NO-SOURCE
> Task :solr:solr-ref-guide:classes UP-TO-DATE
> Task :solr:solr-ref-guide:copySolrjTestResources
> Task :solr:solr-ref-guide:processTestResources NO-SOURCE
> Task :solr:solrj-streaming:processTestResources
> Task :solr:modules:sql:processResources
> Task :solr:solrj-zookeeper:processTestResources
> Task :solr:test-framework:processTestResources
> Task :solr:webapp:processResources NO-SOURCE
> Task :solr:webapp:processTestResources NO-SOURCE
> Task :solr:modules:analysis-extras:processTestResources
> Task :solr:modules:analytics:processResources NO-SOURCE
> Task :solr:modules:analytics:processTestResources
> Task :solr:modules:clustering:processResources NO-SOURCE
> Task :solr:modules:clustering:processTestResources
> Task :solr:modules:extraction:processResources
> Task :solr:modules:extraction:processTestResources
> Task :solr:modules:gcs-repository:processResources NO-SOURCE
> Task :solr:modules:gcs-repository:processTestResources
> Task :solr:modules:hadoop-auth:processResources NO-SOURCE
> Task :solr:modules:hadoop-auth:copySolrCoreTestResources
> Task :solr:modules:hadoop-auth:processTestResources
> Task :solr:modules:hdfs:processResources NO-SOURCE
> Task :solr:modules:hdfs:copySolrCoreTestResources
> Task :solr:modules:hdfs:processTestResources
> Task :solr:modules:jaegertracer-configurator:processResources NO-SOURCE
> Task :solr:modules:jaegertracer-configurator:processTestResources
> Task :solr:modules:jwt-auth:processResources NO-SOURCE
> Task :solr:modules:jwt-auth:processTestResources
> Task :solr:modules:langid:processResources
> Task :solr:modules:langid:processTestResources
> Task :solr:modules:ltr:processResources NO-SOURCE
> Task :solr:modules:ltr:processTestResources
> Task :solr:modules:opentelemetry:processResources NO-SOURCE
> Task :solr:modules:opentelemetry:processTestResources
> Task :solr:modules:s3-repository:processResources NO-SOURCE
> Task :solr:modules:s3-repository:processTestResources
> Task :solr:modules:scripting:processResources NO-SOURCE
> Task :solr:modules:scripting:processTestResources
> Task :solr:modules:sql:copySolrCoreTestResources
> Task :solr:modules:sql:processTestResources
> Task :solr:solrj:openApiGenerate
################################################################################
# Thanks for using OpenAPI Generator. #
# Please consider donation to help us maintain this project 🙏 #
# https://opencollective.com/openapi_generator/donate #
################################################################################
Successfully generated code to /home/jenkins/jenkins-slave/workspace/Solr/Solr-Smoketest-9.5/_tmp/smoke_1713704489/unpack/solr-9.5.1/solr/solrj/build/generated/
> Task :spotlessInternalRegisterDependencies UP-TO-DATE
> Task :solr:solrj:compileJava UP-TO-DATE
> Task :solr:solrj-streaming:compileJava UP-TO-DATE
> Task :solr:solrj-zookeeper:compileJava UP-TO-DATE
> Task :solr:core:compileJava UP-TO-DATE
> Task :solr:test-framework:compileJava UP-TO-DATE
> Task :solr:solrj:generatedSpotlessHelper
> Task :solr:solrj:generatedSpotless
> Task :solr:core:classes UP-TO-DATE
> Task :solr:core:jar UP-TO-DATE
> Task :solr:solrj:classes UP-TO-DATE
> Task :solr:solrj:jar UP-TO-DATE
> Task :solr:solrj-streaming:classes UP-TO-DATE
> Task :solr:solrj-streaming:jar UP-TO-DATE
> Task :solr:solrj-zookeeper:classes UP-TO-DATE
> Task :solr:solrj-zookeeper:jar UP-TO-DATE
> Task :solr:test-framework:classes
> Task :solr:test-framework:jar
> Task :solr:api:compileTestJava
> Task :solr:api:testClasses
> Task :solr:benchmark:compileJava
Note: /home/jenkins/jenkins-slave/workspace/Solr/Solr-Smoketest-9.5/_tmp/smoke_1713704489/unpack/solr-9.5.1/solr/benchmark/src/java/org/apache/solr/bench/search/StreamingSearch.java uses or overrides a deprecated API.
Note: Recompile with -Xlint:deprecation for details.
> Task :solr:benchmark:classes
> Task :solr:benchmark:compileTestJava
> Task :solr:benchmark:testClasses
> Task :solr:api:test
:solr:api:test (SUCCESS): 6 test(s)
> Task :solr:api:wipeTaskTemp
> Task :solr:benchmark:test
:solr:benchmark:test (SUCCESS): 11 test(s)
> Task :solr:benchmark:wipeTaskTemp
> Task :solr:modules:analysis-extras:compileJava
Note: /home/jenkins/jenkins-slave/workspace/Solr/Solr-Smoketest-9.5/_tmp/smoke_1713704489/unpack/solr-9.5.1/solr/modules/analysis-extras/src/java/org/apache/solr/schema/ICUCollationField.java uses or overrides a deprecated API.
Note: Recompile with -Xlint:deprecation for details.
> Task :solr:modules:analysis-extras:classes
> Task :solr:modules:analysis-extras:jar
> Task :solr:prometheus-exporter:compileJava
Note: Some input files use or override a deprecated API.
Note: Recompile with -Xlint:deprecation for details.
> Task :solr:prometheus-exporter:classes
> Task :solr:prometheus-exporter:compileTestJava
Note: /home/jenkins/jenkins-slave/workspace/Solr/Solr-Smoketest-9.5/_tmp/smoke_1713704489/unpack/solr-9.5.1/solr/prometheus-exporter/src/test/org/apache/solr/prometheus/exporter/MetricsQueryTemplateTest.java uses or overrides a deprecated API.
Note: Recompile with -Xlint:deprecation for details.
> Task :solr:prometheus-exporter:testClasses
> Task :solr:core:compileTestJava
> Task :solr:prometheus-exporter:test
:solr:prometheus-exporter:test (SUCCESS): 23 test(s)
> Task :solr:prometheus-exporter:wipeTaskTemp
> Task :solr:solr-ref-guide:compileTestJava
Note: Some input files use or override a deprecated API.
Note: Recompile with -Xlint:deprecation for details.
> Task :solr:solr-ref-guide:testClasses
> Task :solr:solr-ref-guide:test
:solr:solr-ref-guide:test (SUCCESS): 32 test(s)
> Task :solr:solr-ref-guide:wipeTaskTemp
> Task :solr:core:compileTestJava
Note: Some input files use or override a deprecated API.
Note: Recompile with -Xlint:deprecation for details.
> Task :solr:core:testClasses
> Task :solr:solrj:compileTestJava
Note: Some input files use or override a deprecated API.
Note: Recompile with -Xlint:deprecation for details.
> Task :solr:core:test
WARNING: Test org.apache.solr.TestRandomFaceting wrote 11,735,904 bytes of output.
org.apache.solr.cluster.events.impl.CollectionsRepairEventListenerTest > classMethod FAILED
com.carrotsearch.randomizedtesting.ThreadLeakError: 1 thread leaked from SUITE scope at org.apache.solr.cluster.events.impl.CollectionsRepairEventListenerTest:
1) Thread[id=25025, name=aliveCheckExecutor-17879-thread-1, state=TIMED_WAITING, group=TGRP-CollectionsRepairEventListenerTest]
at java.base@11.0.16.1/jdk.internal.misc.Unsafe.park(Native Method)
at java.base@11.0.16.1/java.util.concurrent.locks.LockSupport.parkNanos(LockSupport.java:234)
at java.base@11.0.16.1/java.util.concurrent.locks.AbstractQueuedSynchronizer$ConditionObject.awaitNanos(AbstractQueuedSynchronizer.java:2123)
at java.base@11.0.16.1/java.util.concurrent.ScheduledThreadPoolExecutor$DelayedWorkQueue.take(ScheduledThreadPoolExecutor.java:1182)
at java.base@11.0.16.1/java.util.concurrent.ScheduledThreadPoolExecutor$DelayedWorkQueue.take(ScheduledThreadPoolExecutor.java:899)
at java.base@11.0.16.1/java.util.concurrent.ThreadPoolExecutor.getTask(ThreadPoolExecutor.java:1054)
at java.base@11.0.16.1/java.util.concurrent.ThreadPoolExecutor.runWorker(ThreadPoolExecutor.java:1114)
at java.base@11.0.16.1/java.util.concurrent.ThreadPoolExecutor$Worker.run(ThreadPoolExecutor.java:628)
at java.base@11.0.16.1/java.lang.Thread.run(Thread.java:829)
at __randomizedtesting.SeedInfo.seed([68CC3D56FB3FDBC2]:0)
org.apache.solr.cluster.events.impl.CollectionsRepairEventListenerTest > classMethod FAILED
com.carrotsearch.randomizedtesting.ThreadLeakError: There are still zombie threads that couldn't be terminated:
1) Thread[id=25025, name=aliveCheckExecutor-17879-thread-1, state=TIMED_WAITING, group=TGRP-CollectionsRepairEventListenerTest]
at java.base@11.0.16.1/jdk.internal.misc.Unsafe.park(Native Method)
at java.base@11.0.16.1/java.util.concurrent.locks.LockSupport.parkNanos(LockSupport.java:234)
at java.base@11.0.16.1/java.util.concurrent.locks.AbstractQueuedSynchronizer$ConditionObject.awaitNanos(AbstractQueuedSynchronizer.java:2123)
at java.base@11.0.16.1/java.util.concurrent.ScheduledThreadPoolExecutor$DelayedWorkQueue.take(ScheduledThreadPoolExecutor.java:1182)
at java.base@11.0.16.1/java.util.concurrent.ScheduledThreadPoolExecutor$DelayedWorkQueue.take(ScheduledThreadPoolExecutor.java:899)
at java.base@11.0.16.1/java.util.concurrent.ThreadPoolExecutor.getTask(ThreadPoolExecutor.java:1054)
at java.base@11.0.16.1/java.util.concurrent.ThreadPoolExecutor.runWorker(ThreadPoolExecutor.java:1114)
at java.base@11.0.16.1/java.util.concurrent.ThreadPoolExecutor$Worker.run(ThreadPoolExecutor.java:628)
at java.base@11.0.16.1/java.lang.Thread.run(Thread.java:829)
at __randomizedtesting.SeedInfo.seed([68CC3D56FB3FDBC2]:0)
org.apache.solr.cluster.events.impl.CollectionsRepairEventListenerTest > test suite's output saved to /home/jenkins/jenkins-slave/workspace/Solr/Solr-Smoketest-9.5/_tmp/smoke_1713704489/unpack/solr-9.5.1/solr/core/build/test-results/test/outputs/OUTPUT-org.apache.solr.cluster.events.impl.CollectionsRepairEventListenerTest.txt, copied below:
2> 1104960 INFO (SUITE-CollectionsRepairEventListenerTest-seed#[68CC3D56FB3FDBC2]-worker) [n: c: s: r: x: t:] o.a.s.SolrTestCase Setting 'solr.default.confdir' system property to test-framework derived value of '/home/jenkins/jenkins-slave/workspace/Solr/Solr-Smoketest-9.5/_tmp/smoke_1713704489/unpack/solr-9.5.1/solr/server/solr/configsets/_default/conf'
2> 1104960 INFO (SUITE-CollectionsRepairEventListenerTest-seed#[68CC3D56FB3FDBC2]-worker) [n: c: s: r: x: t:] o.a.s.SolrTestCaseJ4 SecureRandom sanity checks: test.solr.allowed.securerandom=null & java.security.egd=file:/dev/./urandom
2> 1104961 INFO (SUITE-CollectionsRepairEventListenerTest-seed#[68CC3D56FB3FDBC2]-worker) [n: c: s: r: x: t:] o.a.s.u.ErrorLogMuter Closing ErrorLogMuter-regex-316 after mutting 0 log messages
2> 1104961 INFO (SUITE-CollectionsRepairEventListenerTest-seed#[68CC3D56FB3FDBC2]-worker) [n: c: s: r: x: t:] o.a.s.u.ErrorLogMuter Creating ErrorLogMuter-regex-317 for ERROR logs matching regex: ignore_exception
2> 1104962 INFO (SUITE-CollectionsRepairEventListenerTest-seed#[68CC3D56FB3FDBC2]-worker) [n: c: s: r: x: t:] o.a.s.SolrTestCaseJ4 Created dataDir: /home/jenkins/jenkins-slave/workspace/Solr/Solr-Smoketest-9.5/_tmp/smoke_1713704489/unpack/solr-9.5.1/solr/core/build/tmp/tests-tmp/solr.cluster.events.impl.CollectionsRepairEventListenerTest_68CC3D56FB3FDBC2-001/data-dir-105-001
2> 1104962 INFO (SUITE-CollectionsRepairEventListenerTest-seed#[68CC3D56FB3FDBC2]-worker) [n: c: s: r: x: t:] o.a.s.SolrTestCaseJ4 Using PointFields (NUMERIC_POINTS_SYSPROP=true) w/NUMERIC_DOCVALUES_SYSPROP=false
2> 1104962 INFO (SUITE-CollectionsRepairEventListenerTest-seed#[68CC3D56FB3FDBC2]-worker) [n: c: s: r: x: t:] o.a.s.SolrTestCaseJ4 Randomized ssl (true) and clientAuth (false) via: @org.apache.solr.util.RandomizeSSL(reason="", ssl=0.0/0.0, value=0.0/0.0, clientAuth=0.0/0.0)
2> 1104963 INFO (SUITE-CollectionsRepairEventListenerTest-seed#[68CC3D56FB3FDBC2]-worker) [n: c: s: r: x: t:] o.a.s.u.t.SimplePropagator Always-on trace id generation enabled.
2> 1104963 INFO (SUITE-CollectionsRepairEventListenerTest-seed#[68CC3D56FB3FDBC2]-worker) [n: c: s: r: x: t:] o.a.s.c.MiniSolrCloudCluster Starting cluster of 3 servers in /home/jenkins/jenkins-slave/workspace/Solr/Solr-Smoketest-9.5/_tmp/smoke_1713704489/unpack/solr-9.5.1/solr/core/build/tmp/tests-tmp/solr.cluster.events.impl.CollectionsRepairEventListenerTest_68CC3D56FB3FDBC2-001/tempDir-001
2> 1104963 INFO (SUITE-CollectionsRepairEventListenerTest-seed#[68CC3D56FB3FDBC2]-worker) [n: c: s: r: x: t:] o.a.s.c.ZkTestServer STARTING ZK TEST SERVER
2> 1104964 INFO (ZkTestServer Run Thread) [n: c: s: r: x: t:] o.a.s.c.ZkTestServer client port: /127.0.0.1:0
2> 1104964 INFO (ZkTestServer Run Thread) [n: c: s: r: x: t:] o.a.s.c.ZkTestServer Starting server
2> 1104965 WARN (ZkTestServer Run Thread) [n: c: s: r: x: t:] o.a.z.s.ServerCnxnFactory maxCnxns is not configured, using default value 0.
2> 1105064 INFO (SUITE-CollectionsRepairEventListenerTest-seed#[68CC3D56FB3FDBC2]-worker) [n: c: s: r: x: t:] o.a.s.c.ZkTestServer start zk server on port: 42047
2> 1105065 WARN (SUITE-CollectionsRepairEventListenerTest-seed#[68CC3D56FB3FDBC2]-worker) [n: c: s: r: x: t:] o.a.s.c.c.SolrZkClient Using default ZkCredentialsInjector. ZkCredentialsInjector is not secure, it creates an empty list of credentials which leads to 'OPEN_ACL_UNSAFE' ACLs to Zookeeper nodes
2> 1105065 INFO (SUITE-CollectionsRepairEventListenerTest-seed#[68CC3D56FB3FDBC2]-worker) [n: c: s: r: x: t:] o.a.s.c.c.ConnectionManager Waiting up to 30000ms for client to connect to ZooKeeper
2> 1105067 INFO (zkConnectionManagerCallback-17764-thread-1) [n: c: s: r: x: t:] o.a.s.c.c.ConnectionManager zkClient has connected
2> 1105067 INFO (SUITE-CollectionsRepairEventListenerTest-seed#[68CC3D56FB3FDBC2]-worker) [n: c: s: r: x: t:] o.a.s.c.c.ConnectionManager Client is connected to ZooKeeper
2> 1105067 WARN (SUITE-CollectionsRepairEventListenerTest-seed#[68CC3D56FB3FDBC2]-worker) [n: c: s: r: x: t:] o.a.s.c.c.SolrZkClient Using default ZkACLProvider. DefaultZkACLProvider is not secure, it creates 'OPEN_ACL_UNSAFE' ACLs to Zookeeper nodes
2> 1105068 WARN (SUITE-CollectionsRepairEventListenerTest-seed#[68CC3D56FB3FDBC2]-worker) [n: c: s: r: x: t:] o.a.s.c.c.SolrZkClient Using default ZkCredentialsInjector. ZkCredentialsInjector is not secure, it creates an empty list of credentials which leads to 'OPEN_ACL_UNSAFE' ACLs to Zookeeper nodes
2> 1105072 INFO (SUITE-CollectionsRepairEventListenerTest-seed#[68CC3D56FB3FDBC2]-worker) [n: c: s: r: x: t:] o.a.s.c.c.ConnectionManager Waiting up to 30000ms for client to connect to ZooKeeper
2> 1105073 INFO (zkConnectionManagerCallback-17766-thread-1) [n: c: s: r: x: t:] o.a.s.c.c.ConnectionManager zkClient has connected
2> 1105073 INFO (SUITE-CollectionsRepairEventListenerTest-seed#[68CC3D56FB3FDBC2]-worker) [n: c: s: r: x: t:] o.a.s.c.c.ConnectionManager Client is connected to ZooKeeper
2> 1105073 WARN (SUITE-CollectionsRepairEventListenerTest-seed#[68CC3D56FB3FDBC2]-worker) [n: c: s: r: x: t:] o.a.s.c.c.SolrZkClient Using default ZkACLProvider. DefaultZkACLProvider is not secure, it creates 'OPEN_ACL_UNSAFE' ACLs to Zookeeper nodes
2> 1105073 WARN (SUITE-CollectionsRepairEventListenerTest-seed#[68CC3D56FB3FDBC2]-worker) [n: c: s: r: x: t:] o.a.s.c.c.SolrZkClient Using default ZkCredentialsInjector. ZkCredentialsInjector is not secure, it creates an empty list of credentials which leads to 'OPEN_ACL_UNSAFE' ACLs to Zookeeper nodes
2> 1105074 INFO (SUITE-CollectionsRepairEventListenerTest-seed#[68CC3D56FB3FDBC2]-worker) [n: c: s: r: x: t:] o.a.s.c.c.ConnectionManager Waiting up to 15000ms for client to connect to ZooKeeper
2> 1105076 INFO (zkConnectionManagerCallback-17768-thread-1) [n: c: s: r: x: t:] o.a.s.c.c.ConnectionManager zkClient has connected
2> 1105076 INFO (SUITE-CollectionsRepairEventListenerTest-seed#[68CC3D56FB3FDBC2]-worker) [n: c: s: r: x: t:] o.a.s.c.c.ConnectionManager Client is connected to ZooKeeper
2> 1105076 WARN (SUITE-CollectionsRepairEventListenerTest-seed#[68CC3D56FB3FDBC2]-worker) [n: c: s: r: x: t:] o.a.s.c.c.SolrZkClient Using default ZkACLProvider. DefaultZkACLProvider is not secure, it creates 'OPEN_ACL_UNSAFE' ACLs to Zookeeper nodes
2> 1105181 INFO (jetty-launcher-17769-thread-2) [n: c: s: r: x: t:] o.a.s.e.JettySolrRunner Start Jetty (configured port=0, binding port=0)
2> 1105181 INFO (jetty-launcher-17769-thread-1) [n: c: s: r: x: t:] o.a.s.e.JettySolrRunner Start Jetty (configured port=0, binding port=0)
2> 1105181 INFO (jetty-launcher-17769-thread-2) [n: c: s: r: x: t:] o.a.s.e.JettySolrRunner Trying to start Jetty on port 0 try number 2 ...
2> 1105181 INFO (jetty-launcher-17769-thread-1) [n: c: s: r: x: t:] o.a.s.e.JettySolrRunner Trying to start Jetty on port 0 try number 2 ...
2> 1105181 INFO (jetty-launcher-17769-thread-3) [n: c: s: r: x: t:] o.a.s.e.JettySolrRunner Start Jetty (configured port=0, binding port=0)
2> 1105181 INFO (jetty-launcher-17769-thread-3) [n: c: s: r: x: t:] o.a.s.e.JettySolrRunner Trying to start Jetty on port 0 try number 2 ...
2> 1105181 INFO (jetty-launcher-17769-thread-2) [n: c: s: r: x: t:] o.e.j.s.Server jetty-10.0.19; built: 2023-12-15T20:38:32.477Z; git: 8492d1c78f122bb30cce20aecfa07e7283facd47; jvm 11.0.16.1+1
2> 1105181 INFO (jetty-launcher-17769-thread-3) [n: c: s: r: x: t:] o.e.j.s.Server jetty-10.0.19; built: 2023-12-15T20:38:32.477Z; git: 8492d1c78f122bb30cce20aecfa07e7283facd47; jvm 11.0.16.1+1
2> 1105181 INFO (jetty-launcher-17769-thread-1) [n: c: s: r: x: t:] o.e.j.s.Server jetty-10.0.19; built: 2023-12-15T20:38:32.477Z; git: 8492d1c78f122bb30cce20aecfa07e7283facd47; jvm 11.0.16.1+1
2> 1105184 INFO (jetty-launcher-17769-thread-3) [n: c: s: r: x: t:] o.e.j.s.s.DefaultSessionIdManager Session workerName=node0
2> 1105187 INFO (jetty-launcher-17769-thread-3) [n: c: s: r: x: t:] o.e.j.s.h.ContextHandler Started o.e.j.s.ServletContextHandler@552581aa{/solr,file:///home/jenkins/jenkins-slave/workspace/Solr/Solr-Smoketest-9.5/_tmp/smoke_1713704489/unpack/solr-9.5.1/solr/core/build/tmp/tests-cwd/,AVAILABLE}
2> 1105188 INFO (jetty-launcher-17769-thread-3) [n: c: s: r: x: t:] o.e.j.s.AbstractConnector Started ServerConnector@5052330a{ssl, (ssl, alpn, http/1.1, h2)}{127.0.0.1:33831}
2> 1105188 INFO (jetty-launcher-17769-thread-3) [n: c: s: r: x: t:] o.e.j.s.Server Started Server@d752901{STARTING}[10.0.19,sto=0] @1105216ms
2> 1105188 ERROR (jetty-launcher-17769-thread-3) [n: c: s: r: x: t:] o.a.s.u.StartupLoggingUtils Missing Java Option solr.log.dir. Logging may be missing or incomplete.
2> 1105188 INFO (jetty-launcher-17769-thread-3) [n: c: s: r: x: t:] o.a.s.s.CoreContainerProvider Using logger factory org.apache.logging.slf4j.Log4jLoggerFactory
2> 1105188 INFO (jetty-launcher-17769-thread-3) [n: c: s: r: x: t:] o.a.s.s.CoreContainerProvider ___ _ Welcome to Apache Solr™ version 9.5.1
2> 1105188 INFO (jetty-launcher-17769-thread-3) [n: c: s: r: x: t:] o.a.s.s.CoreContainerProvider / __| ___| |_ _ Starting in cloud mode on port null
2> 1105188 INFO (jetty-launcher-17769-thread-3) [n: c: s: r: x: t:] o.a.s.s.CoreContainerProvider \__ \/ _ \ | '_| Install dir: /home/jenkins/jenkins-slave/workspace/Solr/Solr-Smoketest-9.5/_tmp/smoke_1713704489/unpack/solr-9.5.1/solr
2> 1105188 INFO (jetty-launcher-17769-thread-3) [n: c: s: r: x: t:] o.a.s.s.CoreContainerProvider |___/\___/_|_| Start time: 2024-04-21T13:25:08.119918Z
2> 1105189 INFO (jetty-launcher-17769-thread-3) [n: c: s: r: x: t:] o.a.s.s.CoreContainerProvider Solr Home: /home/jenkins/jenkins-slave/workspace/Solr/Solr-Smoketest-9.5/_tmp/smoke_1713704489/unpack/solr-9.5.1/solr/core/build/tmp/tests-tmp/solr.cluster.events.impl.CollectionsRepairEventListenerTest_68CC3D56FB3FDBC2-001/tempDir-001/node3 (source: servlet config: solr.solr.home)
2> 1105189 WARN (jetty-launcher-17769-thread-3) [n: c: s: r: x: t:] o.a.s.c.c.SolrZkClient Using default ZkCredentialsInjector. ZkCredentialsInjector is not secure, it creates an empty list of credentials which leads to 'OPEN_ACL_UNSAFE' ACLs to Zookeeper nodes
2> 1105190 INFO (jetty-launcher-17769-thread-3) [n: c: s: r: x: t:] o.a.s.c.c.ConnectionManager Waiting up to 30000ms for client to connect to ZooKeeper
2> 1105190 INFO (jetty-launcher-17769-thread-2) [n: c: s: r: x: t:] o.e.j.s.s.DefaultSessionIdManager Session workerName=node0
2> 1105192 INFO (zkConnectionManagerCallback-17771-thread-1) [n: c: s: r: x: t:] o.a.s.c.c.ConnectionManager zkClient has connected
2> 1105192 INFO (jetty-launcher-17769-thread-3) [n: c: s: r: x: t:] o.a.s.c.c.ConnectionManager Client is connected to ZooKeeper
2> 1105192 INFO (jetty-launcher-17769-thread-1) [n: c: s: r: x: t:] o.e.j.s.s.DefaultSessionIdManager Session workerName=node0
2> 1105192 WARN (jetty-launcher-17769-thread-3) [n: c: s: r: x: t:] o.a.s.c.c.SolrZkClient Using default ZkACLProvider. DefaultZkACLProvider is not secure, it creates 'OPEN_ACL_UNSAFE' ACLs to Zookeeper nodes
2> 1105193 INFO (jetty-launcher-17769-thread-1) [n: c: s: r: x: t:] o.e.j.s.h.ContextHandler Started o.e.j.s.ServletContextHandler@5bd9a0a1{/solr,file:///home/jenkins/jenkins-slave/workspace/Solr/Solr-Smoketest-9.5/_tmp/smoke_1713704489/unpack/solr-9.5.1/solr/core/build/tmp/tests-cwd/,AVAILABLE}
2> 1105193 INFO (jetty-launcher-17769-thread-3) [n: c: s: r: x: t:] o.a.s.c.NodeConfig solr.xml found in ZooKeeper. Loading...
2> 1105193 INFO (jetty-launcher-17769-thread-2) [n: c: s: r: x: t:] o.e.j.s.h.ContextHandler Started o.e.j.s.ServletContextHandler@374eff5f{/solr,file:///home/jenkins/jenkins-slave/workspace/Solr/Solr-Smoketest-9.5/_tmp/smoke_1713704489/unpack/solr-9.5.1/solr/core/build/tmp/tests-cwd/,AVAILABLE}
2> 1105194 INFO (jetty-launcher-17769-thread-2) [n: c: s: r: x: t:] o.e.j.s.AbstractConnector Started ServerConnector@4089a7c9{ssl, (ssl, alpn, http/1.1, h2)}{127.0.0.1:36633}
2> 1105194 INFO (jetty-launcher-17769-thread-2) [n: c: s: r: x: t:] o.e.j.s.Server Started Server@757feab4{STARTING}[10.0.19,sto=0] @1105222ms
2> 1105194 INFO (jetty-launcher-17769-thread-1) [n: c: s: r: x: t:] o.e.j.s.AbstractConnector Started ServerConnector@7796b4b5{ssl, (ssl, alpn, http/1.1, h2)}{127.0.0.1:46705}
2> 1105194 ERROR (jetty-launcher-17769-thread-2) [n: c: s: r: x: t:] o.a.s.u.StartupLoggingUtils Missing Java Option solr.log.dir. Logging may be missing or incomplete.
2> 1105194 INFO (jetty-launcher-17769-thread-2) [n: c: s: r: x: t:] o.a.s.s.CoreContainerProvider Using logger factory org.apache.logging.slf4j.Log4jLoggerFactory
2> 1105194 INFO (jetty-launcher-17769-thread-1) [n: c: s: r: x: t:] o.e.j.s.Server Started Server@54736b12{STARTING}[10.0.19,sto=0] @1105222ms
2> 1105194 INFO (jetty-launcher-17769-thread-2) [n: c: s: r: x: t:] o.a.s.s.CoreContainerProvider ___ _ Welcome to Apache Solr™ version 9.5.1
2> 1105194 INFO (jetty-launcher-17769-thread-2) [n: c: s: r: x: t:] o.a.s.s.CoreContainerProvider / __| ___| |_ _ Starting in cloud mode on port null
2> 1105194 INFO (jetty-launcher-17769-thread-2) [n: c: s: r: x: t:] o.a.s.s.CoreContainerProvider \__ \/ _ \ | '_| Install dir: /home/jenkins/jenkins-slave/workspace/Solr/Solr-Smoketest-9.5/_tmp/smoke_1713704489/unpack/solr-9.5.1/solr
2> 1105194 INFO (jetty-launcher-17769-thread-2) [n: c: s: r: x: t:] o.a.s.s.CoreContainerProvider |___/\___/_|_| Start time: 2024-04-21T13:25:08.125251Z
2> 1105194 ERROR (jetty-launcher-17769-thread-1) [n: c: s: r: x: t:] o.a.s.u.StartupLoggingUtils Missing Java Option solr.log.dir. Logging may be missing or incomplete.
2> 1105194 INFO (jetty-launcher-17769-thread-1) [n: c: s: r: x: t:] o.a.s.s.CoreContainerProvider Using logger factory org.apache.logging.slf4j.Log4jLoggerFactory
2> 1105194 INFO (jetty-launcher-17769-thread-1) [n: c: s: r: x: t:] o.a.s.s.CoreContainerProvider ___ _ Welcome to Apache Solr™ version 9.5.1
2> 1105194 INFO (jetty-launcher-17769-thread-1) [n: c: s: r: x: t:] o.a.s.s.CoreContainerProvider / __| ___| |_ _ Starting in cloud mode on port null
2> 1105194 INFO (jetty-launcher-17769-thread-2) [n: c: s: r: x: t:] o.a.s.s.CoreContainerProvider Solr Home: /home/jenkins/jenkins-slave/workspace/Solr/Solr-Smoketest-9.5/_tmp/smoke_1713704489/unpack/solr-9.5.1/solr/core/build/tmp/tests-tmp/solr.cluster.events.impl.CollectionsRepairEventListenerTest_68CC3D56FB3FDBC2-001/tempDir-001/node2 (source: servlet config: solr.solr.home)
2> 1105194 INFO (jetty-launcher-17769-thread-1) [n: c: s: r: x: t:] o.a.s.s.CoreContainerProvider \__ \/ _ \ | '_| Install dir: /home/jenkins/jenkins-slave/workspace/Solr/Solr-Smoketest-9.5/_tmp/smoke_1713704489/unpack/solr-9.5.1/solr
2> 1105194 INFO (jetty-launcher-17769-thread-1) [n: c: s: r: x: t:] o.a.s.s.CoreContainerProvider |___/\___/_|_| Start time: 2024-04-21T13:25:08.125359Z
2> 1105194 WARN (jetty-launcher-17769-thread-2) [n: c: s: r: x: t:] o.a.s.c.c.SolrZkClient Using default ZkCredentialsInjector. ZkCredentialsInjector is not secure, it creates an empty list of credentials which leads to 'OPEN_ACL_UNSAFE' ACLs to Zookeeper nodes
2> 1105194 INFO (jetty-launcher-17769-thread-1) [n: c: s: r: x: t:] o.a.s.s.CoreContainerProvider Solr Home: /home/jenkins/jenkins-slave/workspace/Solr/Solr-Smoketest-9.5/_tmp/smoke_1713704489/unpack/solr-9.5.1/solr/core/build/tmp/tests-tmp/solr.cluster.events.impl.CollectionsRepairEventListenerTest_68CC3D56FB3FDBC2-001/tempDir-001/node1 (source: servlet config: solr.solr.home)
2> 1105194 INFO (jetty-launcher-17769-thread-3) [n: c: s: r: x: t:] o.a.s.c.SolrXmlConfig Metrics collection is disabled.
2> 1105194 WARN (jetty-launcher-17769-thread-1) [n: c: s: r: x: t:] o.a.s.c.c.SolrZkClient Using default ZkCredentialsInjector. ZkCredentialsInjector is not secure, it creates an empty list of credentials which leads to 'OPEN_ACL_UNSAFE' ACLs to Zookeeper nodes
2> 1105200 INFO (jetty-launcher-17769-thread-2) [n: c: s: r: x: t:] o.a.s.c.c.ConnectionManager Waiting up to 30000ms for client to connect to ZooKeeper
2> 1105200 INFO (jetty-launcher-17769-thread-1) [n: c: s: r: x: t:] o.a.s.c.c.ConnectionManager Waiting up to 30000ms for client to connect to ZooKeeper
2> 1105204 INFO (zkConnectionManagerCallback-17773-thread-1) [n: c: s: r: x: t:] o.a.s.c.c.ConnectionManager zkClient has connected
2> 1105204 INFO (jetty-launcher-17769-thread-2) [n: c: s: r: x: t:] o.a.s.c.c.ConnectionManager Client is connected to ZooKeeper
2> 1105204 WARN (jetty-launcher-17769-thread-2) [n: c: s: r: x: t:] o.a.s.c.c.SolrZkClient Using default ZkACLProvider. DefaultZkACLProvider is not secure, it creates 'OPEN_ACL_UNSAFE' ACLs to Zookeeper nodes
2> 1105204 INFO (zkConnectionManagerCallback-17775-thread-1) [n: c: s: r: x: t:] o.a.s.c.c.ConnectionManager zkClient has connected
2> 1105204 INFO (jetty-launcher-17769-thread-1) [n: c: s: r: x: t:] o.a.s.c.c.ConnectionManager Client is connected to ZooKeeper
2> 1105204 WARN (jetty-launcher-17769-thread-1) [n: c: s: r: x: t:] o.a.s.c.c.SolrZkClient Using default ZkACLProvider. DefaultZkACLProvider is not secure, it creates 'OPEN_ACL_UNSAFE' ACLs to Zookeeper nodes
2> 1105204 INFO (jetty-launcher-17769-thread-2) [n: c: s: r: x: t:] o.a.s.c.NodeConfig solr.xml found in ZooKeeper. Loading...
2> 1105205 INFO (jetty-launcher-17769-thread-1) [n: c: s: r: x: t:] o.a.s.c.NodeConfig solr.xml found in ZooKeeper. Loading...
2> 1105206 INFO (jetty-launcher-17769-thread-2) [n: c: s: r: x: t:] o.a.s.c.SolrXmlConfig Metrics collection is disabled.
2> 1105207 INFO (jetty-launcher-17769-thread-1) [n: c: s: r: x: t:] o.a.s.c.SolrXmlConfig Metrics collection is disabled.
2> 1105297 WARN (jetty-launcher-17769-thread-3) [n: c: s: r: x: t:] o.e.j.u.s.S.config Trusting all certificates configured for Client@4fc021b4[provider=null,keyStore=null,trustStore=null]
2> 1105298 WARN (jetty-launcher-17769-thread-3) [n: c: s: r: x: t:] o.e.j.u.s.S.config No Client EndPointIdentificationAlgorithm configured for Client@4fc021b4[provider=null,keyStore=null,trustStore=null]
2> 1105300 WARN (jetty-launcher-17769-thread-3) [n: c: s: r: x: t:] o.e.j.u.s.S.config Trusting all certificates configured for Client@335e27af[provider=null,keyStore=null,trustStore=null]
2> 1105300 WARN (jetty-launcher-17769-thread-3) [n: c: s: r: x: t:] o.e.j.u.s.S.config No Client EndPointIdentificationAlgorithm configured for Client@335e27af[provider=null,keyStore=null,trustStore=null]
2> 1105306 INFO (jetty-launcher-17769-thread-3) [n: c: s: r: x: t:] o.a.s.c.ZkContainer Zookeeper client=127.0.0.1:42047/solr
2> 1105306 INFO (jetty-launcher-17769-thread-3) [n: c: s: r: x: t:] o.a.s.c.DistributedClusterStateUpdater Creating DistributedClusterStateUpdater with useDistributedStateUpdate=false. Solr will be using Overseer based cluster state updates.
2> 1105307 INFO (jetty-launcher-17769-thread-3) [n:127.0.0.1:33831_solr c: s: r: x: t:] o.a.s.c.c.ConnectionManager Waiting up to 15000ms for client to connect to ZooKeeper
2> 1105308 WARN (jetty-launcher-17769-thread-2) [n: c: s: r: x: t:] o.e.j.u.s.S.config Trusting all certificates configured for Client@3668e80c[provider=null,keyStore=null,trustStore=null]
2> 1105308 WARN (jetty-launcher-17769-thread-2) [n: c: s: r: x: t:] o.e.j.u.s.S.config No Client EndPointIdentificationAlgorithm configured for Client@3668e80c[provider=null,keyStore=null,trustStore=null]
2> 1105309 INFO (zkConnectionManagerCallback-17785-thread-1) [n: c: s: r: x: t:] o.a.s.c.c.ConnectionManager zkClient has connected
2> 1105309 WARN (jetty-launcher-17769-thread-1) [n: c: s: r: x: t:] o.e.j.u.s.S.config Trusting all certificates configured for Client@346cd8d1[provider=null,keyStore=null,trustStore=null]
2> 1105310 INFO (jetty-launcher-17769-thread-3) [n:127.0.0.1:33831_solr c: s: r: x: t:] o.a.s.c.c.ConnectionManager Client is connected to ZooKeeper
2> 1105311 WARN (jetty-launcher-17769-thread-1) [n: c: s: r: x: t:] o.e.j.u.s.S.config No Client EndPointIdentificationAlgorithm configured for Client@346cd8d1[provider=null,keyStore=null,trustStore=null]
2> 1105320 WARN (jetty-launcher-17769-thread-1) [n: c: s: r: x: t:] o.e.j.u.s.S.config Trusting all certificates configured for Client@43f18572[provider=null,keyStore=null,trustStore=null]
2> 1105320 WARN (jetty-launcher-17769-thread-1) [n: c: s: r: x: t:] o.e.j.u.s.S.config No Client EndPointIdentificationAlgorithm configured for Client@43f18572[provider=null,keyStore=null,trustStore=null]
2> 1105321 INFO (jetty-launcher-17769-thread-1) [n: c: s: r: x: t:] o.a.s.c.ZkContainer Zookeeper client=127.0.0.1:42047/solr
2> 1105321 WARN (jetty-launcher-17769-thread-2) [n: c: s: r: x: t:] o.e.j.u.s.S.config Trusting all certificates configured for Client@53c965e1[provider=null,keyStore=null,trustStore=null]
2> 1105321 INFO (jetty-launcher-17769-thread-1) [n: c: s: r: x: t:] o.a.s.c.DistributedClusterStateUpdater Creating DistributedClusterStateUpdater with useDistributedStateUpdate=false. Solr will be using Overseer based cluster state updates.
2> 1105321 WARN (jetty-launcher-17769-thread-2) [n: c: s: r: x: t:] o.e.j.u.s.S.config No Client EndPointIdentificationAlgorithm configured for Client@53c965e1[provider=null,keyStore=null,trustStore=null]
2> 1105322 INFO (jetty-launcher-17769-thread-1) [n:127.0.0.1:46705_solr c: s: r: x: t:] o.a.s.c.c.ConnectionManager Waiting up to 15000ms for client to connect to ZooKeeper
2> 1105324 INFO (jetty-launcher-17769-thread-2) [n: c: s: r: x: t:] o.a.s.c.ZkContainer Zookeeper client=127.0.0.1:42047/solr
2> 1105324 INFO (jetty-launcher-17769-thread-2) [n: c: s: r: x: t:] o.a.s.c.DistributedClusterStateUpdater Creating DistributedClusterStateUpdater with useDistributedStateUpdate=false. Solr will be using Overseer based cluster state updates.
2> 1105324 INFO (zkConnectionManagerCallback-17804-thread-1) [n: c: s: r: x: t:] o.a.s.c.c.ConnectionManager zkClient has connected
2> 1105324 INFO (jetty-launcher-17769-thread-1) [n:127.0.0.1:46705_solr c: s: r: x: t:] o.a.s.c.c.ConnectionManager Client is connected to ZooKeeper
2> 1105331 WARN (jetty-launcher-17769-thread-3) [n:127.0.0.1:33831_solr c: s: r: x: t:] o.a.s.c.ZkController Contents of zookeeper /security.json are world-readable; consider setting up ACLs as described in https://solr.apache.org/guide/solr/latest/deployment-guide/zookeeper-access-control.html
2> 1105331 WARN (jetty-launcher-17769-thread-1) [n:127.0.0.1:46705_solr c: s: r: x: t:] o.a.s.c.ZkController Contents of zookeeper /security.json are world-readable; consider setting up ACLs as described in https://solr.apache.org/guide/solr/latest/deployment-guide/zookeeper-access-control.html
2> 1105332 INFO (jetty-launcher-17769-thread-2) [n:127.0.0.1:36633_solr c: s: r: x: t:] o.a.s.c.c.ConnectionManager Waiting up to 15000ms for client to connect to ZooKeeper
2> 1105333 INFO (jetty-launcher-17769-thread-3) [n:127.0.0.1:33831_solr c: s: r: x: t:] o.a.s.c.DistributedClusterStateUpdater Creating DistributedClusterStateUpdater with useDistributedStateUpdate=false. Solr will be using Overseer based cluster state updates.
2> 1105333 INFO (jetty-launcher-17769-thread-1) [n:127.0.0.1:46705_solr c: s: r: x: t:] o.a.s.c.DistributedClusterStateUpdater Creating DistributedClusterStateUpdater with useDistributedStateUpdate=false. Solr will be using Overseer based cluster state updates.
2> 1105335 INFO (jetty-launcher-17769-thread-3) [n:127.0.0.1:33831_solr c: s: r: x: t:] o.a.s.c.OverseerElectionContext I am going to be the leader 127.0.0.1:33831_solr
2> 1105336 INFO (jetty-launcher-17769-thread-3) [n:127.0.0.1:33831_solr c: s: r: x: t:] o.a.s.c.Overseer Overseer (id=72070578786336774-127.0.0.1:33831_solr-n_0000000000) starting
2> 1105336 INFO (jetty-launcher-17769-thread-1) [n:127.0.0.1:46705_solr c: s: r: x: t:] o.a.s.c.ZkController Register node as live in ZooKeeper:/live_nodes/127.0.0.1:46705_solr
2> 1105340 WARN (jetty-launcher-17769-thread-1) [n:127.0.0.1:46705_solr c: s: r: x: t:] o.a.s.c.CoreContainer Not all security plugins configured! authentication=disabled authorization=disabled. Solr is only as secure as you make it. Consider configuring authentication/authorization before exposing Solr to users internal or external. See https://s.apache.org/solrsecurity for more info
2> 1105340 INFO (zkConnectionManagerCallback-17807-thread-1) [n: c: s: r: x: t:] o.a.s.c.c.ConnectionManager zkClient has connected
2> 1105340 INFO (jetty-launcher-17769-thread-2) [n:127.0.0.1:36633_solr c: s: r: x: t:] o.a.s.c.c.ConnectionManager Client is connected to ZooKeeper
2> 1105347 WARN (jetty-launcher-17769-thread-2) [n:127.0.0.1:36633_solr c: s: r: x: t:] o.a.s.c.ZkController Contents of zookeeper /security.json are world-readable; consider setting up ACLs as described in https://solr.apache.org/guide/solr/latest/deployment-guide/zookeeper-access-control.html
2> 1105347 INFO (jetty-launcher-17769-thread-2) [n:127.0.0.1:36633_solr c: s: r: x: t:] o.a.s.c.c.ZkStateReader Updated live nodes from ZooKeeper... (0) -> (1)
2> 1105350 INFO (jetty-launcher-17769-thread-2) [n:127.0.0.1:36633_solr c: s: r: x: t:] o.a.s.c.DistributedClusterStateUpdater Creating DistributedClusterStateUpdater with useDistributedStateUpdate=false. Solr will be using Overseer based cluster state updates.
2> 1105351 INFO (jetty-launcher-17769-thread-2) [n:127.0.0.1:36633_solr c: s: r: x: t:] o.a.s.c.ZkController Publish node=127.0.0.1:36633_solr as DOWN
2> 1105352 INFO (zkCallback-17803-thread-1) [n: c: s: r: x: t:] o.a.s.c.c.ZkStateReader Updated live nodes from ZooKeeper... (0) -> (1)
2> 1105352 INFO (jetty-launcher-17769-thread-2) [n:127.0.0.1:36633_solr c: s: r: x: t:] o.a.s.c.ZkController Register node as live in ZooKeeper:/live_nodes/127.0.0.1:36633_solr
2> 1105353 INFO (zkCallback-17784-thread-1) [n: c: s: r: x: t:] o.a.s.c.c.ZkStateReader Updated live nodes from ZooKeeper... (0) -> (1)
2> 1105353 INFO (zkCallback-17803-thread-1) [n: c: s: r: x: t:] o.a.s.c.c.ZkStateReader Updated live nodes from ZooKeeper... (1) -> (2)
2> 1105355 WARN (jetty-launcher-17769-thread-2) [n:127.0.0.1:36633_solr c: s: r: x: t:] o.a.s.c.CoreContainer Not all security plugins configured! authentication=disabled authorization=disabled. Solr is only as secure as you make it. Consider configuring authentication/authorization before exposing Solr to users internal or external. See https://s.apache.org/solrsecurity for more info
2> 1105360 INFO (jetty-launcher-17769-thread-3) [n:127.0.0.1:33831_solr c: s: r: x: t:] o.a.s.c.ZkController Publish node=127.0.0.1:33831_solr as DOWN
2> 1105361 INFO (jetty-launcher-17769-thread-3) [n:127.0.0.1:33831_solr c: s: r: x: t:] o.a.s.c.ZkController Register node as live in ZooKeeper:/live_nodes/127.0.0.1:33831_solr
2> 1105361 INFO (OverseerStateUpdate-72070578786336774-127.0.0.1:33831_solr-n_0000000000) [n:127.0.0.1:33831_solr c: s: r: x: t:] o.a.s.c.Overseer Starting to work on the main queue : 127.0.0.1:33831_solr
2> 1105363 INFO (zkCallback-17806-thread-1) [n: c: s: r: x: t:] o.a.s.c.c.ZkStateReader Updated live nodes from ZooKeeper... (1) -> (3)
2> 1105364 WARN (jetty-launcher-17769-thread-3) [n:127.0.0.1:33831_solr c: s: r: x: t:] o.a.s.c.CoreContainer Not all security plugins configured! authentication=disabled authorization=disabled. Solr is only as secure as you make it. Consider configuring authentication/authorization before exposing Solr to users internal or external. See https://s.apache.org/solrsecurity for more info
2> 1105364 INFO (zkCallback-17803-thread-1) [n: c: s: r: x: t:] o.a.s.c.c.ZkStateReader Updated live nodes from ZooKeeper... (2) -> (3)
2> 1105365 INFO (OverseerStateUpdate-72070578786336774-127.0.0.1:33831_solr-n_0000000000) [n:127.0.0.1:33831_solr c: s: r: x: t:] o.a.s.c.c.ZkStateReader Updated live nodes from ZooKeeper... (1) -> (3)
2> 1105373 INFO (jetty-launcher-17769-thread-2) [n:127.0.0.1:36633_solr c: s: r: x: t:] o.a.s.c.CorePropertiesLocator Found 0 core definitions underneath /home/jenkins/jenkins-slave/workspace/Solr/Solr-Smoketest-9.5/_tmp/smoke_1713704489/unpack/solr-9.5.1/solr/core/build/tmp/tests-tmp/solr.cluster.events.impl.CollectionsRepairEventListenerTest_68CC3D56FB3FDBC2-001/tempDir-001/node2
2> 1105382 INFO (jetty-launcher-17769-thread-3) [n:127.0.0.1:33831_solr c: s: r: x: t:] o.a.s.c.CorePropertiesLocator Found 0 core definitions underneath /home/jenkins/jenkins-slave/workspace/Solr/Solr-Smoketest-9.5/_tmp/smoke_1713704489/unpack/solr-9.5.1/solr/core/build/tmp/tests-tmp/solr.cluster.events.impl.CollectionsRepairEventListenerTest_68CC3D56FB3FDBC2-001/tempDir-001/node3
2> 1105393 INFO (jetty-launcher-17769-thread-1) [n:127.0.0.1:46705_solr c: s: r: x: t:] o.a.s.c.CorePropertiesLocator Found 0 core definitions underneath /home/jenkins/jenkins-slave/workspace/Solr/Solr-Smoketest-9.5/_tmp/smoke_1713704489/unpack/solr-9.5.1/solr/core/build/tmp/tests-tmp/solr.cluster.events.impl.CollectionsRepairEventListenerTest_68CC3D56FB3FDBC2-001/tempDir-001/node1
2> 1105417 INFO (jetty-launcher-17769-thread-2) [n:127.0.0.1:36633_solr c: s: r: x: t:] o.a.s.j.SolrRequestAuthorizer Creating a new SolrRequestAuthorizer
2> 1105429 INFO (jetty-launcher-17769-thread-3) [n:127.0.0.1:33831_solr c: s: r: x: t:] o.a.s.j.SolrRequestAuthorizer Creating a new SolrRequestAuthorizer
2> 1105429 INFO (jetty-launcher-17769-thread-2) [n:127.0.0.1:36633_solr c: s: r: x: t:] o.a.s.e.JettySolrRunner Jetty properties: {hostContext=/solr, hostPort=36633, zkHost=127.0.0.1:42047/solr}
2> 1105436 INFO (jetty-launcher-17769-thread-1) [n:127.0.0.1:46705_solr c: s: r: x: t:] o.a.s.j.SolrRequestAuthorizer Creating a new SolrRequestAuthorizer
2> 1105440 INFO (jetty-launcher-17769-thread-3) [n:127.0.0.1:33831_solr c: s: r: x: t:] o.a.s.e.JettySolrRunner Jetty properties: {hostContext=/solr, hostPort=33831, zkHost=127.0.0.1:42047/solr}
2> 1105450 INFO (jetty-launcher-17769-thread-1) [n:127.0.0.1:46705_solr c: s: r: x: t:] o.a.s.e.JettySolrRunner Jetty properties: {hostContext=/solr, hostPort=46705, zkHost=127.0.0.1:42047/solr}
2> 1105451 INFO (SUITE-CollectionsRepairEventListenerTest-seed#[68CC3D56FB3FDBC2]-worker) [n: c: s: r: x: t:] o.a.s.c.MiniSolrCloudCluster waitForAllNodes: numServers=3
2> 1105451 INFO (SUITE-CollectionsRepairEventListenerTest-seed#[68CC3D56FB3FDBC2]-worker) [n: c: s: r: x: t:] o.a.s.c.MiniSolrCloudCluster waitForNode: 127.0.0.1:36633_solr
2> 1105451 WARN (SUITE-CollectionsRepairEventListenerTest-seed#[68CC3D56FB3FDBC2]-worker) [n: c: s: r: x: t:] o.a.s.c.c.SolrZkClient Using default ZkCredentialsInjector. ZkCredentialsInjector is not secure, it creates an empty list of credentials which leads to 'OPEN_ACL_UNSAFE' ACLs to Zookeeper nodes
2> 1105452 INFO (SUITE-CollectionsRepairEventListenerTest-seed#[68CC3D56FB3FDBC2]-worker) [n: c: s: r: x: t:] o.a.s.c.c.ConnectionManager Waiting up to 15000ms for client to connect to ZooKeeper
2> 1105453 INFO (zkConnectionManagerCallback-17828-thread-1) [n: c: s: r: x: t:] o.a.s.c.c.ConnectionManager zkClient has connected
2> 1105453 INFO (SUITE-CollectionsRepairEventListenerTest-seed#[68CC3D56FB3FDBC2]-worker) [n: c: s: r: x: t:] o.a.s.c.c.ConnectionManager Client is connected to ZooKeeper
2> 1105453 WARN (SUITE-CollectionsRepairEventListenerTest-seed#[68CC3D56FB3FDBC2]-worker) [n: c: s: r: x: t:] o.a.s.c.c.SolrZkClient Using default ZkACLProvider. DefaultZkACLProvider is not secure, it creates 'OPEN_ACL_UNSAFE' ACLs to Zookeeper nodes
2> 1105453 INFO (SUITE-CollectionsRepairEventListenerTest-seed#[68CC3D56FB3FDBC2]-worker) [n: c: s: r: x: t:] o.a.s.c.c.ZkStateReader Updated live nodes from ZooKeeper... (0) -> (3)
2> 1105454 INFO (SUITE-CollectionsRepairEventListenerTest-seed#[68CC3D56FB3FDBC2]-worker) [n: c: s: r: x: t:] o.a.s
[...truncated too long message...]
Dtests.locale=ru-BY -Dtests.timezone=Europe/Podgorica -Dtests.asserts=true -Dtests.file.encoding=UTF-8
> Task :solr:solrj:processTestResources
> Task :solr:solrj:testClasses
> Task :solr:solrj:test
> Task :solr:core:test
WARNING: Test org.apache.solr.schema.DocValuesTest wrote 10,997,382 bytes of output.
WARNING: Test org.apache.solr.schema.TestCloudSchemaless wrote 13,352,693 bytes of output.
> Task :solr:solrj:test
:solr:solrj:test (SUCCESS): 1166 test(s), 40 skipped
> Task :solr:solrj:wipeTaskTemp
> Task :solr:solrj-streaming:compileTestJava
> Task :solr:solrj-streaming:testClasses
> Task :solr:modules:sql:compileJava
Note: Some input files use or override a deprecated API.
Note: Recompile with -Xlint:deprecation for details.
> Task :solr:modules:sql:classes
> Task :solr:modules:sql:jar
> Task :solr:solrj-streaming:test
:solr:solrj-streaming:test (SUCCESS): 608 test(s), 8 skipped
> Task :solr:solrj-streaming:wipeTaskTemp
> Task :solr:solrj-zookeeper:compileTestJava
Note: Some input files use or override a deprecated API.
Note: Recompile with -Xlint:deprecation for details.
> Task :solr:solrj-zookeeper:testClasses
> Task :solr:solrj-zookeeper:test
:solr:solrj-zookeeper:test (SUCCESS): 16 test(s)
> Task :solr:solrj-zookeeper:wipeTaskTemp
> Task :solr:test-framework:compileTestJava
Note: Some input files use or override a deprecated API.
Note: Recompile with -Xlint:deprecation for details.
> Task :solr:test-framework:testClasses
> Task :solr:test-framework:test
:solr:test-framework:test (SUCCESS): 18 test(s)
> Task :solr:test-framework:wipeTaskTemp
> Task :solr:webapp:compileJava NO-SOURCE
> Task :solr:webapp:classes UP-TO-DATE
> Task :solr:webapp:compileTestJava NO-SOURCE
> Task :solr:webapp:testClasses UP-TO-DATE
> Task :solr:webapp:test NO-SOURCE
> Task :solr:webapp:wipeTaskTemp
> Task :solr:modules:analysis-extras:compileTestJava
Note: /home/jenkins/jenkins-slave/workspace/Solr/Solr-Smoketest-9.5/_tmp/smoke_1713704489/unpack/solr-9.5.1/solr/modules/analysis-extras/src/test/org/apache/solr/schema/TestICUCollationFieldUDVAS.java uses or overrides a deprecated API.
Note: Recompile with -Xlint:deprecation for details.
> Task :solr:modules:analysis-extras:testClasses
> Task :solr:modules:analysis-extras:test
:solr:modules:analysis-extras:test (SUCCESS): 31 test(s)
> Task :solr:modules:analysis-extras:wipeTaskTemp
> Task :solr:modules:analytics:compileJava
Note: Some input files use or override a deprecated API.
Note: Recompile with -Xlint:deprecation for details.
> Task :solr:modules:analytics:classes
> Task :solr:modules:analytics:compileTestJava
Note: Some input files use or override a deprecated API.
Note: Recompile with -Xlint:deprecation for details.
> Task :solr:modules:analytics:testClasses
> Task :solr:core:test
WARNING: Test org.apache.solr.search.facet.TestCloudJSONFacetSKGEquiv wrote 14,971,629 bytes of output.
> Task :solr:modules:analytics:test
:solr:modules:analytics:test (SUCCESS): 472 test(s)
> Task :solr:modules:analytics:wipeTaskTemp
> Task :solr:modules:clustering:compileJava
> Task :solr:modules:clustering:classes
> Task :solr:modules:clustering:compileTestJava
> Task :solr:modules:clustering:testClasses
> Task :solr:modules:clustering:test
:solr:modules:clustering:test (SUCCESS): 15 test(s)
> Task :solr:modules:clustering:wipeTaskTemp
> Task :solr:modules:extraction:compileJava
Note: /home/jenkins/jenkins-slave/workspace/Solr/Solr-Smoketest-9.5/_tmp/smoke_1713704489/unpack/solr-9.5.1/solr/modules/extraction/src/java/org/apache/solr/handler/extraction/ExtractingDocumentLoader.java uses or overrides a deprecated API.
Note: Recompile with -Xlint:deprecation for details.
> Task :solr:modules:extraction:classes
> Task :solr:modules:extraction:compileTestJava
Note: /home/jenkins/jenkins-slave/workspace/Solr/Solr-Smoketest-9.5/_tmp/smoke_1713704489/unpack/solr-9.5.1/solr/modules/extraction/src/test/org/apache/solr/handler/extraction/ExtractingRequestHandlerTest.java uses or overrides a deprecated API.
Note: Recompile with -Xlint:deprecation for details.
> Task :solr:modules:extraction:testClasses
> Task :solr:modules:extraction:test
:solr:modules:extraction:test (SUCCESS): 20 test(s)
> Task :solr:modules:extraction:wipeTaskTemp
> Task :solr:modules:gcs-repository:compileJava
Note: /home/jenkins/jenkins-slave/workspace/Solr/Solr-Smoketest-9.5/_tmp/smoke_1713704489/unpack/solr-9.5.1/solr/modules/gcs-repository/src/java/org/apache/solr/gcs/GCSConfigParser.java uses or overrides a deprecated API.
Note: Recompile with -Xlint:deprecation for details.
> Task :solr:modules:gcs-repository:classes
> Task :solr:modules:gcs-repository:compileTestJava
Note: /home/jenkins/jenkins-slave/workspace/Solr/Solr-Smoketest-9.5/_tmp/smoke_1713704489/unpack/solr-9.5.1/solr/modules/gcs-repository/src/test/org/apache/solr/gcs/ConcurrentDelegatingStorage.java uses or overrides a deprecated API.
Note: Recompile with -Xlint:deprecation for details.
> Task :solr:modules:gcs-repository:testClasses
> Task :solr:modules:gcs-repository:test
:solr:modules:gcs-repository:test (SUCCESS): 21 test(s), 5 skipped
> Task :solr:modules:gcs-repository:wipeTaskTemp
> Task :solr:modules:hadoop-auth:compileJava
Note: Some input files use or override a deprecated API.
Note: Recompile with -Xlint:deprecation for details.
> Task :solr:modules:hadoop-auth:classes
> Task :solr:modules:hadoop-auth:compileTestJava
Note: Some input files use or override a deprecated API.
Note: Recompile with -Xlint:deprecation for details.
> Task :solr:modules:hadoop-auth:testClasses
> Task :solr:modules:hadoop-auth:test
:solr:modules:hadoop-auth:test (SUCCESS): 55 test(s), 1 skipped
> Task :solr:modules:hadoop-auth:wipeTaskTemp
> Task :solr:modules:hdfs:compileJava
Note: Some input files use or override a deprecated API.
Note: Recompile with -Xlint:deprecation for details.
> Task :solr:modules:hdfs:classes
> Task :solr:modules:hdfs:compileTestJava
Note: Some input files use or override a deprecated API.
Note: Recompile with -Xlint:deprecation for details.
> Task :solr:modules:hdfs:testClasses
> Task :solr:modules:hdfs:test
> Task :solr:core:test
:solr:core:test (FAILURE): 4954 test(s), 2 failure(s), 2243 skipped
4954 tests completed, 2 failed, 2243 skipped
> Task :solr:core:test FAILED
> Task :solr:core:wipeTaskTemp
> Task :solr:modules:hdfs:test
WARNING: Test org.apache.solr.hdfs.store.HdfsDirectoryTest wrote 12,935,133 bytes of output.
:solr:modules:hdfs:test (SUCCESS): 103 test(s), 41 skipped
> Task :solr:modules:hdfs:wipeTaskTemp
ERROR: The following test(s) have failed:
- org.apache.solr.cluster.events.impl.CollectionsRepairEventListenerTest.classMethod (:solr:core)
Test output: /home/jenkins/jenkins-slave/workspace/Solr/Solr-Smoketest-9.5/_tmp/smoke_1713704489/unpack/solr-9.5.1/solr/core/build/test-results/test/outputs/OUTPUT-org.apache.solr.cluster.events.impl.CollectionsRepairEventListenerTest.txt
Reproduce with: gradlew :solr:core:test --tests "org.apache.solr.cluster.events.impl.CollectionsRepairEventListenerTest.classMethod" -Ptests.jvms=2 "-Ptests.jvmargs=-XX:TieredStopAtLevel=1 -XX:+UseParallelGC -XX:ActiveProcessorCount=1 -XX:ReservedCodeCacheSize=120m" -Ptests.seed=68CC3D56FB3FDBC2 -Ptests.badapples=false -Ptests.file.encoding=ISO-8859-1
- org.apache.solr.cluster.events.impl.CollectionsRepairEventListenerTest.classMethod (:solr:core)
Test output: /home/jenkins/jenkins-slave/workspace/Solr/Solr-Smoketest-9.5/_tmp/smoke_1713704489/unpack/solr-9.5.1/solr/core/build/test-results/test/outputs/OUTPUT-org.apache.solr.cluster.events.impl.CollectionsRepairEventListenerTest.txt
Reproduce with: gradlew :solr:core:test --tests "org.apache.solr.cluster.events.impl.CollectionsRepairEventListenerTest.classMethod" -Ptests.jvms=2 "-Ptests.jvmargs=-XX:TieredStopAtLevel=1 -XX:+UseParallelGC -XX:ActiveProcessorCount=1 -XX:ReservedCodeCacheSize=120m" -Ptests.seed=68CC3D56FB3FDBC2 -Ptests.badapples=false -Ptests.file.encoding=ISO-8859-1
FAILURE: Build failed with an exception.
* What went wrong:
Execution failed for task ':solr:core:test'.
> There were failing tests. See the results at: file:///home/jenkins/jenkins-slave/workspace/Solr/Solr-Smoketest-9.5/_tmp/smoke_1713704489/unpack/solr-9.5.1/solr/core/build/test-results/test/
* Try:
> Run with --scan to get full insights.
BUILD FAILED in 40m 1s
120 actionable tasks: 102 executed, 18 up-to-date
Traceback (most recent call last):
File "dev-tools/scripts/smokeTestRelease.py", line 1196, in <module>
main()
File "dev-tools/scripts/smokeTestRelease.py", line 1122, in main
smokeTest(c.java, c.url, c.revision, c.version, c.tmp_dir, c.is_signed, c.local_keys, ' '.join(c.test_args),
File "dev-tools/scripts/smokeTestRelease.py", line 1184, in smokeTest
unpackAndVerify(java, tmpDir, 'solr-%s-src.tgz' % version, gitRevision, version, testArgs)
File "dev-tools/scripts/smokeTestRelease.py", line 575, in unpackAndVerify
verifyUnpacked(java, artifact, unpackPath, gitRevision, version, testArgs)
File "dev-tools/scripts/smokeTestRelease.py", line 666, in verifyUnpacked
java.run_java11('./gradlew --no-daemon test %s' % testArgs, '%s/test.log' % unpackPath)
File "dev-tools/scripts/smokeTestRelease.py", line 1032, in run_java
run('%s; %s' % (cmd_prefix, cmd), logfile)
File "dev-tools/scripts/smokeTestRelease.py", line 505, in run
raise RuntimeError('command "%s" failed; see log file %s' % (command, logPath))
RuntimeError: command "export JAVA_HOME="/home/jenkins/tools/java/latest11" PATH="/home/jenkins/tools/java/latest11/bin:$PATH" JAVACMD="/home/jenkins/tools/java/latest11/bin/java"; ./gradlew --no-daemon test -Dtests.nightly=false -Dtests.badapples=false " failed; see log file /home/jenkins/jenkins-slave/workspace/Solr/Solr-Smoketest-9.5/_tmp/smoke_1713704489/unpack/solr-9.5.1/test.log
Build step 'Run with timeout' marked build as failure
Email was triggered for: Failure - Any
Sending email for trigger: Failure - Any