You are viewing a plain text version of this content. The canonical link for it is here.
Posted to dev@lucene.apache.org by Policeman Jenkins Server <je...@thetaphi.de> on 2013/06/04 16:17:24 UTC

[JENKINS] Lucene-Solr-trunk-Linux (64bit/ibm-j9-jdk7) - Build # 5981 - Still Failing!

Build: http://jenkins.thetaphi.de/job/Lucene-Solr-trunk-Linux/5981/
Java: 64bit/ibm-j9-jdk7 -Xjit:exclude={org/apache/lucene/util/fst/FST.pack(IIF)Lorg/apache/lucene/util/fst/FST;}

1 tests failed.
REGRESSION:  org.apache.solr.core.TestJmxIntegration.testJmxRegistration

Error Message:
No SolrDynamicMBeans found

Stack Trace:
java.lang.AssertionError: No SolrDynamicMBeans found
	at __randomizedtesting.SeedInfo.seed([34B10D5242133434:BA6069682F526C51]:0)
	at org.junit.Assert.fail(Assert.java:93)
	at org.junit.Assert.assertTrue(Assert.java:43)
	at org.apache.solr.core.TestJmxIntegration.testJmxRegistration(TestJmxIntegration.java:94)
	at sun.reflect.NativeMethodAccessorImpl.invoke0(Native Method)
	at sun.reflect.NativeMethodAccessorImpl.invoke(NativeMethodAccessorImpl.java:88)
	at sun.reflect.DelegatingMethodAccessorImpl.invoke(DelegatingMethodAccessorImpl.java:55)
	at java.lang.reflect.Method.invoke(Method.java:613)
	at com.carrotsearch.randomizedtesting.RandomizedRunner.invoke(RandomizedRunner.java:1559)
	at com.carrotsearch.randomizedtesting.RandomizedRunner.access$600(RandomizedRunner.java:79)
	at com.carrotsearch.randomizedtesting.RandomizedRunner$6.evaluate(RandomizedRunner.java:737)
	at com.carrotsearch.randomizedtesting.RandomizedRunner$7.evaluate(RandomizedRunner.java:773)
	at com.carrotsearch.randomizedtesting.RandomizedRunner$8.evaluate(RandomizedRunner.java:787)
	at com.carrotsearch.randomizedtesting.rules.SystemPropertiesRestoreRule$1.evaluate(SystemPropertiesRestoreRule.java:53)
	at org.apache.lucene.util.TestRuleSetupTeardownChained$1.evaluate(TestRuleSetupTeardownChained.java:50)
	at org.apache.lucene.util.TestRuleFieldCacheSanity$1.evaluate(TestRuleFieldCacheSanity.java:51)
	at org.apache.lucene.util.AbstractBeforeAfterRule$1.evaluate(AbstractBeforeAfterRule.java:46)
	at com.carrotsearch.randomizedtesting.rules.SystemPropertiesInvariantRule$1.evaluate(SystemPropertiesInvariantRule.java:55)
	at org.apache.lucene.util.TestRuleThreadAndTestName$1.evaluate(TestRuleThreadAndTestName.java:49)
	at org.apache.lucene.util.TestRuleIgnoreAfterMaxFailures$1.evaluate(TestRuleIgnoreAfterMaxFailures.java:70)
	at org.apache.lucene.util.TestRuleMarkFailure$1.evaluate(TestRuleMarkFailure.java:48)
	at com.carrotsearch.randomizedtesting.rules.StatementAdapter.evaluate(StatementAdapter.java:36)
	at com.carrotsearch.randomizedtesting.ThreadLeakControl$StatementRunner.run(ThreadLeakControl.java:358)
	at com.carrotsearch.randomizedtesting.ThreadLeakControl.forkTimeoutingTask(ThreadLeakControl.java:782)
	at com.carrotsearch.randomizedtesting.ThreadLeakControl$3.evaluate(ThreadLeakControl.java:442)
	at com.carrotsearch.randomizedtesting.RandomizedRunner.runSingleTest(RandomizedRunner.java:746)
	at com.carrotsearch.randomizedtesting.RandomizedRunner$3.evaluate(RandomizedRunner.java:648)
	at com.carrotsearch.randomizedtesting.RandomizedRunner$4.evaluate(RandomizedRunner.java:682)
	at com.carrotsearch.randomizedtesting.RandomizedRunner$5.evaluate(RandomizedRunner.java:693)
	at com.carrotsearch.randomizedtesting.rules.StatementAdapter.evaluate(StatementAdapter.java:36)
	at com.carrotsearch.randomizedtesting.rules.SystemPropertiesRestoreRule$1.evaluate(SystemPropertiesRestoreRule.java:53)
	at org.apache.lucene.util.AbstractBeforeAfterRule$1.evaluate(AbstractBeforeAfterRule.java:46)
	at org.apache.lucene.util.TestRuleStoreClassName$1.evaluate(TestRuleStoreClassName.java:42)
	at com.carrotsearch.randomizedtesting.rules.SystemPropertiesInvariantRule$1.evaluate(SystemPropertiesInvariantRule.java:55)
	at com.carrotsearch.randomizedtesting.rules.NoShadowingOrOverridesOnMethodsRule$1.evaluate(NoShadowingOrOverridesOnMethodsRule.java:39)
	at com.carrotsearch.randomizedtesting.rules.NoShadowingOrOverridesOnMethodsRule$1.evaluate(NoShadowingOrOverridesOnMethodsRule.java:39)
	at com.carrotsearch.randomizedtesting.rules.StatementAdapter.evaluate(StatementAdapter.java:36)
	at org.apache.lucene.util.TestRuleAssertionsRequired$1.evaluate(TestRuleAssertionsRequired.java:43)
	at org.apache.lucene.util.TestRuleMarkFailure$1.evaluate(TestRuleMarkFailure.java:48)
	at org.apache.lucene.util.TestRuleIgnoreAfterMaxFailures$1.evaluate(TestRuleIgnoreAfterMaxFailures.java:70)
	at org.apache.lucene.util.TestRuleIgnoreTestSuites$1.evaluate(TestRuleIgnoreTestSuites.java:55)
	at com.carrotsearch.randomizedtesting.rules.StatementAdapter.evaluate(StatementAdapter.java:36)
	at com.carrotsearch.randomizedtesting.ThreadLeakControl$StatementRunner.run(ThreadLeakControl.java:358)
	at java.lang.Thread.run(Thread.java:780)




Build Log:
[...truncated 9223 lines...]
[junit4:junit4] Suite: org.apache.solr.core.TestJmxIntegration
[junit4:junit4]   2> 59220 T93 oas.SolrTestCaseJ4.initCore ####initCore
[junit4:junit4]   2> Creating dataDir: /mnt/ssd/jenkins/workspace/Lucene-Solr-trunk-Linux/solr/build/solr-core/test/J1/./solrtest-TestJmxIntegration-1370354827867
[junit4:junit4]   2> 59221 T93 oasc.SolrResourceLoader.<init> new SolrResourceLoader for directory: '/mnt/ssd/jenkins/workspace/Lucene-Solr-trunk-Linux/solr/build/solr-core/test-files/solr/collection1/'
[junit4:junit4]   2> 59222 T93 oasc.SolrResourceLoader.replaceClassLoader Adding 'file:/mnt/ssd/jenkins/workspace/Lucene-Solr-trunk-Linux/solr/build/solr-core/test-files/solr/collection1/lib/README' to classloader
[junit4:junit4]   2> 59232 T93 oasc.SolrResourceLoader.replaceClassLoader Adding 'file:/mnt/ssd/jenkins/workspace/Lucene-Solr-trunk-Linux/solr/build/solr-core/test-files/solr/collection1/lib/classes/' to classloader
[junit4:junit4]   2> 59304 T93 oasc.SolrConfig.<init> Using Lucene MatchVersion: LUCENE_50
[junit4:junit4]   2> 59358 T93 oasc.SolrConfig.<init> Loaded SolrConfig: solrconfig.xml
[junit4:junit4]   2> 59359 T93 oass.IndexSchema.readSchema Reading Solr Schema from schema.xml
[junit4:junit4]   2> 59364 T93 oass.IndexSchema.readSchema [null] Schema name=test
[junit4:junit4]   2> 59757 T93 oass.OpenExchangeRatesOrgProvider.init Initialized with rates=open-exchange-rates.json, refreshInterval=1440.
[junit4:junit4]   2> 59766 T93 oass.IndexSchema.readSchema default search field in schema is text
[junit4:junit4]   2> 59771 T93 oass.IndexSchema.readSchema unique key field: id
[junit4:junit4]   2> 59778 T93 oass.FileExchangeRateProvider.reload Reloading exchange rates from file currency.xml
[junit4:junit4]   2> 59785 T93 oass.FileExchangeRateProvider.reload Reloading exchange rates from file currency.xml
[junit4:junit4]   2> 59800 T93 oass.OpenExchangeRatesOrgProvider.reload Reloading exchange rates from open-exchange-rates.json
[junit4:junit4]   2> 59801 T93 oass.OpenExchangeRatesOrgProvider$OpenExchangeRates.<init> WARN Unknown key IMPORTANT NOTE
[junit4:junit4]   2> 59802 T93 oass.OpenExchangeRatesOrgProvider$OpenExchangeRates.<init> WARN Expected key, got STRING
[junit4:junit4]   2> 59803 T93 oass.OpenExchangeRatesOrgProvider.reload Reloading exchange rates from open-exchange-rates.json
[junit4:junit4]   2> 59803 T93 oass.OpenExchangeRatesOrgProvider$OpenExchangeRates.<init> WARN Unknown key IMPORTANT NOTE
[junit4:junit4]   2> 59804 T93 oass.OpenExchangeRatesOrgProvider$OpenExchangeRates.<init> WARN Expected key, got STRING
[junit4:junit4]   2> 59805 T93 oasc.SolrResourceLoader.locateSolrHome JNDI not configured for solr (NoInitialContextEx)
[junit4:junit4]   2> 59805 T93 oasc.SolrResourceLoader.locateSolrHome using system property solr.solr.home: /mnt/ssd/jenkins/workspace/Lucene-Solr-trunk-Linux/solr/build/solr-core/test-files/solr
[junit4:junit4]   2> 59806 T93 oasc.SolrResourceLoader.<init> new SolrResourceLoader for directory: '/mnt/ssd/jenkins/workspace/Lucene-Solr-trunk-Linux/solr/build/solr-core/test-files/solr/'
[junit4:junit4]   2> 59816 T93 oasc.CoreContainer.<init> New CoreContainer 293455692
[junit4:junit4]   2> 59861 T93 oasc.SolrCore.initDirectoryFactory org.apache.solr.core.MockDirectoryFactory
[junit4:junit4]   2> 59862 T93 oasc.SolrCore.<init> [collection1] Opening new SolrCore at /mnt/ssd/jenkins/workspace/Lucene-Solr-trunk-Linux/solr/build/solr-core/test-files/solr/collection1/, dataDir=/mnt/ssd/jenkins/workspace/Lucene-Solr-trunk-Linux/solr/build/solr-core/test/J1/./solrtest-TestJmxIntegration-1370354827867/
[junit4:junit4]   2> 59864 T93 oasc.JmxMonitoredMap.<init> No JMX servers found, not exposing Solr information with JMX.
[junit4:junit4]   2> 59865 T93 oasc.SolrCore.initDirectoryFactory org.apache.solr.core.MockDirectoryFactory
[junit4:junit4]   2> 59868 T93 oasc.CachingDirectoryFactory.get return new directory for /mnt/ssd/jenkins/workspace/Lucene-Solr-trunk-Linux/solr/build/solr-core/test/J1/./solrtest-TestJmxIntegration-1370354827867
[junit4:junit4]   2> 59869 T93 oasc.SolrCore.getNewIndexDir New index directory detected: old=null new=/mnt/ssd/jenkins/workspace/Lucene-Solr-trunk-Linux/solr/build/solr-core/test/J1/./solrtest-TestJmxIntegration-1370354827867/index/
[junit4:junit4]   2> 59870 T93 oasc.SolrCore.initIndex WARN [collection1] Solr index directory '/mnt/ssd/jenkins/workspace/Lucene-Solr-trunk-Linux/solr/build/solr-core/test/J1/./solrtest-TestJmxIntegration-1370354827867/index' doesn't exist. Creating new index...
[junit4:junit4]   2> 59873 T93 oasc.CachingDirectoryFactory.get return new directory for /mnt/ssd/jenkins/workspace/Lucene-Solr-trunk-Linux/solr/build/solr-core/test/J1/./solrtest-TestJmxIntegration-1370354827867/index
[junit4:junit4]   2> 59881 T93 oasc.SolrDeletionPolicy.onCommit SolrDeletionPolicy.onCommit: commits: num=1
[junit4:junit4]   2> 		commit{dir=RateLimitedDirectoryWrapper(MockDirWrapper(org.apache.lucene.store.RAMDirectory@4f68ba81 lockFactory=org.apache.lucene.store.NativeFSLockFactory@53b026d)),segFN=segments_1,generation=1}
[junit4:junit4]   2> 59881 T93 oasc.SolrDeletionPolicy.updateCommits newest commit generation = 1
[junit4:junit4]   2> 59883 T93 oasc.SolrCore.initWriters created xml: solr.XMLResponseWriter
[junit4:junit4]   2> 59887 T93 oasup.UpdateRequestProcessorChain.init inserting DistributedUpdateProcessorFactory into updateRequestProcessorChain "dedupe"
[junit4:junit4]   2> 59888 T93 oasup.UpdateRequestProcessorChain.init inserting DistributedUpdateProcessorFactory into updateRequestProcessorChain "dedupe-allfields"
[junit4:junit4]   2> 59889 T93 oasup.UpdateRequestProcessorChain.init inserting DistributedUpdateProcessorFactory into updateRequestProcessorChain "stored_sig"
[junit4:junit4]   2> 59890 T93 oasup.UpdateRequestProcessorChain.init inserting DistributedUpdateProcessorFactory into updateRequestProcessorChain "uniq-fields"
[junit4:junit4]   2> 59891 T93 oasup.UpdateRequestProcessorChain.init inserting DistributedUpdateProcessorFactory into updateRequestProcessorChain "distrib-dup-test-chain-implicit"
[junit4:junit4]   2> 59891 T93 oasc.RequestHandlers.initHandlersFromConfig adding lazy requestHandler: solr.ReplicationHandler
[junit4:junit4]   2> 59892 T93 oasc.RequestHandlers.initHandlersFromConfig created /replication: solr.ReplicationHandler
[junit4:junit4]   2> 59893 T93 oasc.RequestHandlers.initHandlersFromConfig created standard: solr.StandardRequestHandler
[junit4:junit4]   2> 59894 T93 oasc.RequestHandlers.initHandlersFromConfig created /get: solr.RealTimeGetHandler
[junit4:junit4]   2> 59894 T93 oasc.RequestHandlers.initHandlersFromConfig created dismax: solr.SearchHandler
[junit4:junit4]   2> 59895 T93 oasc.RequestHandlers.initHandlersFromConfig created mock: org.apache.solr.core.MockQuerySenderListenerReqHandler
[junit4:junit4]   2> 59896 T93 oasc.RequestHandlers.initHandlersFromConfig created /admin/: org.apache.solr.handler.admin.AdminHandlers
[junit4:junit4]   2> 59896 T93 oasc.RequestHandlers.initHandlersFromConfig created defaults: solr.StandardRequestHandler
[junit4:junit4]   2> 59897 T93 oasc.RequestHandlers.initHandlersFromConfig adding lazy requestHandler: solr.StandardRequestHandler
[junit4:junit4]   2> 59898 T93 oasc.RequestHandlers.initHandlersFromConfig created lazy: solr.StandardRequestHandler
[junit4:junit4]   2> 59898 T93 oasc.RequestHandlers.initHandlersFromConfig created /update: solr.UpdateRequestHandler
[junit4:junit4]   2> 59899 T93 oasc.RequestHandlers.initHandlersFromConfig created /terms: org.apache.solr.handler.component.SearchHandler
[junit4:junit4]   2> 59900 T93 oasc.RequestHandlers.initHandlersFromConfig created spellCheckCompRH: org.apache.solr.handler.component.SearchHandler
[junit4:junit4]   2> 59901 T93 oasc.RequestHandlers.initHandlersFromConfig created spellCheckCompRH_Direct: org.apache.solr.handler.component.SearchHandler
[junit4:junit4]   2> 59901 T93 oasc.RequestHandlers.initHandlersFromConfig created spellCheckWithWordbreak: org.apache.solr.handler.component.SearchHandler
[junit4:junit4]   2> 59902 T93 oasc.RequestHandlers.initHandlersFromConfig created spellCheckWithWordbreak_Direct: org.apache.solr.handler.component.SearchHandler
[junit4:junit4]   2> 59903 T93 oasc.RequestHandlers.initHandlersFromConfig created spellCheckCompRH1: org.apache.solr.handler.component.SearchHandler
[junit4:junit4]   2> 59904 T93 oasc.RequestHandlers.initHandlersFromConfig created mltrh: org.apache.solr.handler.component.SearchHandler
[junit4:junit4]   2> 59905 T93 oasc.RequestHandlers.initHandlersFromConfig created tvrh: org.apache.solr.handler.component.SearchHandler
[junit4:junit4]   2> 59906 T93 oasc.RequestHandlers.initHandlersFromConfig created /mlt: solr.MoreLikeThisHandler
[junit4:junit4]   2> 59906 T93 oasc.RequestHandlers.initHandlersFromConfig created /debug/dump: solr.DumpRequestHandler
[junit4:junit4]   2> 59910 T93 oashl.XMLLoader.init xsltCacheLifetimeSeconds=60
[junit4:junit4]   2> 59914 T93 oasc.SolrCore.initDeprecatedSupport WARN solrconfig.xml uses deprecated <admin/gettableFiles>, Please update your config to use the ShowFileRequestHandler.
[junit4:junit4]   2> 59925 T93 oasc.SolrCore.initDeprecatedSupport WARN adding ShowFileRequestHandler with hidden files: [SOLRCONFIG-MANAGED-SCHEMA.XML, BAD-SCHEMA-NOT-INDEXED-BUT-TF.XML, SCHEMA-REQUIRED-FIELDS.XML, BAD-SOLRCONFIG-MANAGED-SCHEMA-NAMED-SCHEMA.XML.XML, SOLRCONFIG-MASTER1-KEEPONEBACKUP.XML, SOLRCONFIG-PROPINJECT.XML, BAD-SCHEMA-NONTEXT-ANALYZER.XML, SCHEMA-BEHAVIOR.XML, SOLRCONFIG-PROPINJECT-INDEXDEFAULT.XML, STOP-2.TXT, SCHEMA11.XML, BAD-SCHEMA-UNIQUEKEY-USES-DEFAULT.XML, SCHEMA15.XML, BAD-SOLRCONFIG-UNEXPECTED-SCHEMA-ATTRIBUTE.XML, SOLRCONFIG-NATIVELOCK.XML, SCHEMA-SIM.XML, CONDITIONAL.UPDATEPROCESSOR.JS, SCHEMA-DOCVALUES.XML, SCHEMA-ID-AND-VERSION-FIELDS-ONLY.XML, BAD-SOLRCONFIG-MISSING-SCRIPTFILE.XML, SOLRCONFIG-SCRIPT-UPDATEPROCESSOR.XML, SOLRCONFIG-REPEATER.XML, BAD-SCHEMA-DOCVALUES-NOT-REQUIRED-NO-DEFAULT.XML, SOLRCONFIG-SPELLCHECKER.XML, SOLRCONFIG-NOCACHE.XML, SCHEMA-CHARFILTERS.XML, SOLRCONFIG-SOLCOREPROPERTIES.XML, SCHEMA-EFF.XML, SOLRCONFIG_CODEC.XML, SOLRCONFIG-MUTABLE-MANAGED-SCHEMA.XML, BAD-SCHEMA-EXTERNAL-FILEFIELD.XML, HYPHENATION.DTD, TRIVIAL.UPDATEPROCESSOR1.JS, SOLRCONFIG-MERGEPOLICY.XML, SOLRCONFIG-PHRASESUGGEST.XML, SOLRCONFIG-SLAVE1.XML, SOLRCONFIG-BASIC.XML, SCHEMA-LMJELINEKMERCER.XML, BAD-MP-SOLRCONFIG.XML, JASUGGEST.TXT, BAD-SCHEMA-DUP-FIELD.XML, BAD-SCHEMA-UNIQUEKEY-MULTIVALUED.XML, SOLRCONFIG-MASTER.XML, SOLRCONFIG-HIGHLIGHT.XML, SCHEMA-TFIDF.XML, SCHEMA-REPLICATION1.XML, STOPWITHBOM.TXT, SOLRCONFIG-ELEVATE.XML, SYNONYMS.TXT, SOLRCONFIG-QUERYSENDER.XML, SOLRCONFIG-COMPONENTS-NAME.XML, SOLRCONFIG-SNIPPET-PROCESSOR.XML, WDFTYPES.TXT, BAD-SCHEMA-CURRENCY-FT-OER-NORATES.XML, SOLRCONFIG-DELPOLICY1.XML, BAD_SOLRCONFIG.XML, BAD-SCHEMA-UNSUPPORTED-DOCVALUES.XML, HUNSPELL-TEST.DIC, SCHEMA-NUMERIC.XML, SCHEMA-LUCENEMATCHVERSION.XML, KEEP-2.TXT, SCHEMA-STOP-KEEP.XML, SCHEMA-IB.XML, STOP-SNOWBALL.TXT, SCHEMA-ONE-FIELD-NO-DYNAMIC-FIELD.XML, BAD-SCHEMA-MULTIPLE-ASTERISK-COPYFIELD-DEST-SHOULD-FAIL-TEST.XML, SCHEMA-DOCVALUESMULTI.XML, SOLRCONFIG-INDEXCONFIG.XML, SOLRCONFIG-SLAVE.XML, SCHEMA-CLASS-NAME-SHORTENING-ON-SERIALIZATION.XML, BAD-SCHEMA-NOT-INDEXED-BUT-NORMS.XML, STOPWORDSWRONGENCODING.TXT, BAD-SCHEMA-MISPLACED-ASTERISK-COPYFIELD-SOURCE-SHOULD-FAIL-TEST.XML, THROW.ERROR.ON.ADD.UPDATEPROCESSOR.JS, STOPTYPES-1.TXT, SOLRCONFIG-SPELLCHECKCOMPONENT.XML, REGEX-BOOST-PROCESSOR-TEST.TXT, SOLRCONFIG-MINIMAL.XML, SCHEMA-DOCVALUESFACETING.XML, SOLRCONFIG-TLOG.XML, COMPOUNDDICTIONARY.TXT, SOLRCONFIG-POSTINGSHIGHLIGHT.XML, DA_COMPOUNDDICTIONARY.TXT, SOLRCONFIG-TERMINDEX.XML, BAD-SOLRCONFIG-INVALID-SCRIPTFILE.XML, BAD-SCHEMA-NON-GLOB-COPYFIELD-SOURCE-MATCHING-NOTHING-SHOULD-FAIL-TEST.XML, SCHEMASURROUND.XML, OPEN-EXCHANGE-RATES.JSON, BAD-SCHEMA-DUP-FIELDTYPE.XML, PHRASESUGGEST.TXT, BAD-SCHEMA-CURRENCY-FT-MULTIVALUED.XML, SOLRCONFIG-MASTER2.XML, OLD_SYNONYMS.TXT, BAD-SCHEMA-UNIQUEKEY-IS-COPYFIELD-DEST.XML, SCHEMA-NOT-REQUIRED-UNIQUE-KEY.XML, BAD-SCHEMA-CODEC-GLOBAL-VS-FT-MISMATCH.XML, SCHEMA-LMDIRICHLET.XML, BAD-SCHEMA-NOT-INDEXED-BUT-POS.XML, SCHEMA-REVERSED.XML, BAD-SCHEMA-CURRENCY-MULTIVALUED.XML, SCHEMA-FOLDING.XML, SOLRCONFIG-CACHING.XML, MAPPING-ISOLATIN1ACCENT.TXT, BAD-CURRENCY.XML, ADDFIELDS.UPDATEPROCESSOR.JS, SCHEMA-BM25.XML, SOLRCONFIG-ENABLEPLUGIN.XML, STOP-1.TXT, BAD-SCHEMA-SWEETSPOT-BOTH-TF.XML, SCHEMA-REST.XML, MISSING.FUNCTIONS.UPDATEPROCESSOR.JS, SCHEMA12.XML, SOLRCONFIG-TRANSFORMERS.XML, SCHEMA-COPYFIELD-TEST.XML, BAD-SCHEMA-DUP-DYNAMICFIELD.XML, BAD-SCHEMA-SWEETSPOT-PARTIAL-BASELINE.XML, CURRENCY.XML, DA_UTF8.XML, FUZZYSUGGEST.TXT, SCHEMA-POSTINGSHIGHLIGHT.XML, MISSLEADING.EXTENSION.UPDATEPROCESSOR.JS.TXT, SOLRCONFIG-SOLR-749.XML, STOPWORDS.TXT, BAD-SCHEMA-BOGUS-ANALYSIS-PARAMETERS.XML, HUNSPELL-TEST.AFF, SOLRCONFIG-TLOG-MANAGED-SCHEMA.XML, SOLRCONFIG_PERF.XML, SCHEMA-SWEETSPOT.XML, SOLRCONFIG-SIMPLELOCK.XML, BAD-SCHEMA-MISPLACED-ASTERISK-COPYFIELD-DEST-SHOULD-FAIL-TEST.XML, SCHEMA-TINY.XML, BAD-SCHEMA-SWEETSPOT-PARTIAL-NORMS.XML, FRENCHARTICLES.TXT, SOLRCONFIG-LAZYWRITER.XML, SOLRCONFIG-RESPONSE-LOG-COMPONENT.XML, SCHEMA-REPLICATION2.XML, SCHEMA-SNIPPET-TYPE.XML, SCHEMA-SPATIAL.XML, BAD-SCHEMA-SWEETSPOT-PARTIAL-HYPERBOLIC.XML, SCHEMA-SPELLCHECKER.XML, SOLRCONFIG-XINCLUDE.XML, XSLT, SOLRCONFIG-WARMER.XML, SOLRCONFIG-DELPOLICY2.XML, KEEP-1.TXT, TRIVIAL.UPDATEPROCESSOR0.JS, BAD-SCHEMA-CURRENCY-DYNAMIC-MULTIVALUED.XML, SCHEMA-TRIE.XML, SOLRCONFIG-TLOG-MUTABLE-MANAGED-SCHEMA.XML, SCHEMA-BINARYFIELD.XML, SCHEMA-REST-LUCENE-MATCH-VERSION.XML, BAD-SCHEMA-OMIT-TF-BUT-NOT-POS.XML, BAD-SCHEMA-CURRENCY-FT-BOGUS-CODE-IN-XML.XML, SCHEMA-MINIMAL.XML, STOPTYPES-2.TXT, SCHEMA_CODEC.XML, STEMDICT.TXT, SCHEMA-SYNONYM-TOKENIZER.XML, ELEVATE.XML, SCHEMA-COLLATE.XML, PROTWORDS.TXT, SCHEMA-XINCLUDE.XML, SCHEMA-SNIPPET-FIELD.XML, SOLRCONFIG-REQHANDLER.INCL, SCHEMA-PHRASESUGGEST.XML, SCHEMA-DFR.XML, BAD-SCHEMA-ANALYZER-CLASS-AND-NESTED.XML, SOLRCONFIG-MASTER1.XML, SOLRCONFIG-FUNCTIONQUERY.XML, BAD-SOLRCONFIG-SCHEMA-MUTABLE-BUT-NOT-MANAGED.XML, SOLRCONFIG-MASTER3.XML, SOLRCONFIG-UPDATE-PROCESSOR-CHAINS.XML, SOLRCONFIG-ALTDIRECTORY.XML, BAD-SCHEMA-SIM-GLOBAL-VS-FT-MISMATCH.XML, SOLRCONFIG-QUERYSENDER-NOQUERY.XML, BAD-SCHEMA-MULTIPLE-ASTERISK-COPYFIELD-SOURCE-SHOULD-FAIL-TEST.XML, BAD-SOLRCONFIG-BOGUS-SCRIPTENGINE-NAME.XML, BAD-SCHEMA-CURRENCY-FT-BOGUS-DEFAULT-CODE.XML, BAD-SCHEMA-BOGUS-FIELD-PARAMETERS.XML]
[junit4:junit4]   2> 59928 T93 oass.SolrIndexSearcher.<init> Opening Searcher@702030ad main
[junit4:junit4]   2> 59929 T93 oasu.UpdateHandler.clearLog Clearing tlog files, tlogDir=/mnt/ssd/jenkins/workspace/Lucene-Solr-trunk-Linux/solr/build/solr-core/test/J1/./solrtest-TestJmxIntegration-1370354827867/tlog
[junit4:junit4]   2> 59930 T93 oasu.CommitTracker.<init> Hard AutoCommit: disabled
[junit4:junit4]   2> 59931 T93 oasu.CommitTracker.<init> Soft AutoCommit: disabled
[junit4:junit4]   2> 59931 T93 oashc.SpellCheckComponent.inform Initializing spell checkers
[junit4:junit4]   2> 59937 T93 oass.DirectSolrSpellChecker.init init: {name=direct,classname=DirectSolrSpellChecker,field=lowerfilt,minQueryLength=3}
[junit4:junit4]   2> 59961 T93 oasc.CoreContainer.registerCore registering core: collection1
[junit4:junit4]   2> 59963 T94 oasc.SolrCore.registerSearcher [collection1] Registered new searcher Searcher@702030ad main{StandardDirectoryReader(segments_1:1)}
[junit4:junit4]   2> 59964 T93 oas.SolrTestCaseJ4.initCore ####initCore end
[junit4:junit4]   2> 60151 T93 oas.SolrTestCaseJ4.setUp ###Starting testJmxUpdate
[junit4:junit4]   2> 60218 T93 oas.SolrTestCaseJ4.tearDown ###Ending testJmxUpdate
[junit4:junit4] IGNOR/A 0.27s J1 | TestJmxIntegration.testJmxUpdate
[junit4:junit4]    > Assumption #1: got: <false>, expected: is <true>
[junit4:junit4]   2> 60239 T93 oas.SolrTestCaseJ4.setUp ###Starting testJmxRegistration
[junit4:junit4]   2> 60240 T93 oasc.TestJmxIntegration.testJmxRegistration Servers in testJmxRegistration: [com.sun.jmx.mbeanserver.JmxMBeanServer@d3c50c95]
[junit4:junit4]   2> 60246 T93 oas.SolrTestCaseJ4.tearDown ###Ending testJmxRegistration
[junit4:junit4]   2> NOTE: reproduce with: ant test  -Dtestcase=TestJmxIntegration -Dtests.method=testJmxRegistration -Dtests.seed=34B10D5242133434 -Dtests.multiplier=3 -Dtests.slow=true -Dtests.locale=nl_NL_PREEURO -Dtests.timezone=Asia/Chongqing -Dtests.file.encoding=US-ASCII
[junit4:junit4] FAILURE 0.02s J1 | TestJmxIntegration.testJmxRegistration <<<
[junit4:junit4]    > Throwable #1: java.lang.AssertionError: No SolrDynamicMBeans found
[junit4:junit4]    > 	at __randomizedtesting.SeedInfo.seed([34B10D5242133434:BA6069682F526C51]:0)
[junit4:junit4]    > 	at org.apache.solr.core.TestJmxIntegration.testJmxRegistration(TestJmxIntegration.java:94)
[junit4:junit4]    > 	at java.lang.Thread.run(Thread.java:780)
[junit4:junit4]   2> 60258 T93 oas.SolrTestCaseJ4.deleteCore ###deleteCore
[junit4:junit4]   2> 60258 T93 oasc.CoreContainer.shutdown Shutting down CoreContainer instance=293455692
[junit4:junit4]   2> 60259 T93 oasc.SolrCore.close [collection1]  CLOSING SolrCore org.apache.solr.core.SolrCore@fcf5b96e
[junit4:junit4]   2> 60259 T93 oasu.DirectUpdateHandler2.close closing DirectUpdateHandler2{commits=0,autocommits=0,soft autocommits=0,optimizes=0,rollbacks=0,expungeDeletes=0,docsPending=0,adds=0,deletesById=0,deletesByQuery=0,errors=0,cumulative_adds=0,cumulative_deletesById=0,cumulative_deletesByQuery=0,cumulative_errors=0}
[junit4:junit4]   2> 60260 T93 oasu.SolrCoreState.decrefSolrCoreState Closing SolrCoreState
[junit4:junit4]   2> 60261 T93 oasu.DefaultSolrCoreState.closeIndexWriter SolrCoreState ref count has reached 0 - closing IndexWriter
[junit4:junit4]   2> 60261 T93 oasu.DefaultSolrCoreState.closeIndexWriter closing IndexWriter with IndexWriterCloser
[junit4:junit4]   2> 60264 T93 oasc.SolrCore.closeSearcher [collection1] Closing main searcher on request.
[junit4:junit4]   2> 60265 T93 oasc.CachingDirectoryFactory.close Closing MockDirectoryFactory - 2 directories currently being tracked
[junit4:junit4]   2> 60265 T93 oasc.CachingDirectoryFactory.closeCacheValue looking to close /mnt/ssd/jenkins/workspace/Lucene-Solr-trunk-Linux/solr/build/solr-core/test/J1/./solrtest-TestJmxIntegration-1370354827867/index [CachedDir<<refCount=0;path=/mnt/ssd/jenkins/workspace/Lucene-Solr-trunk-Linux/solr/build/solr-core/test/J1/./solrtest-TestJmxIntegration-1370354827867/index;done=false>>]
[junit4:junit4]   2> 60266 T93 oasc.CachingDirectoryFactory.close Closing directory: /mnt/ssd/jenkins/workspace/Lucene-Solr-trunk-Linux/solr/build/solr-core/test/J1/./solrtest-TestJmxIntegration-1370354827867/index
[junit4:junit4]   2> 60266 T93 oasc.CachingDirectoryFactory.closeCacheValue looking to close /mnt/ssd/jenkins/workspace/Lucene-Solr-trunk-Linux/solr/build/solr-core/test/J1/./solrtest-TestJmxIntegration-1370354827867 [CachedDir<<refCount=0;path=/mnt/ssd/jenkins/workspace/Lucene-Solr-trunk-Linux/solr/build/solr-core/test/J1/./solrtest-TestJmxIntegration-1370354827867;done=false>>]
[junit4:junit4]   2> 60267 T93 oasc.CachingDirectoryFactory.close Closing directory: /mnt/ssd/jenkins/workspace/Lucene-Solr-trunk-Linux/solr/build/solr-core/test/J1/./solrtest-TestJmxIntegration-1370354827867
[junit4:junit4]   2> NOTE: test params are: codec=Lucene42: {}, docValues:{}, sim=RandomSimilarityProvider(queryNorm=false,coord=no): {}, locale=nl_NL_PREEURO, timezone=Asia/Chongqing
[junit4:junit4]   2> NOTE: Linux 3.2.0-45-generic amd64/IBM Corporation 1.7.0 (64-bit)/cpus=8,threads=2,free=26998208,total=100401152
[junit4:junit4]   2> NOTE: All tests run in this JVM: [PingRequestHandlerTest, FileUtilsTest, ClusterStateTest, TestSystemIdResolver, XsltUpdateRequestHandlerTest, TestSchemaVersionResource, IndexBasedSpellCheckerTest, FieldAnalysisRequestHandlerTest, DistanceFunctionTest, TestRecovery, SolrCmdDistributorTest, TestJmxIntegration]
[junit4:junit4] Completed on J1 in 1.11s, 3 tests, 1 failure, 2 skipped <<< FAILURES!

[...truncated 828 lines...]
BUILD FAILED
/mnt/ssd/jenkins/workspace/Lucene-Solr-trunk-Linux/build.xml:380: The following error occurred while executing this line:
/mnt/ssd/jenkins/workspace/Lucene-Solr-trunk-Linux/build.xml:373: The following error occurred while executing this line:
/mnt/ssd/jenkins/workspace/Lucene-Solr-trunk-Linux/build.xml:39: The following error occurred while executing this line:
/mnt/ssd/jenkins/workspace/Lucene-Solr-trunk-Linux/solr/build.xml:181: The following error occurred while executing this line:
/mnt/ssd/jenkins/workspace/Lucene-Solr-trunk-Linux/solr/common-build.xml:437: The following error occurred while executing this line:
/mnt/ssd/jenkins/workspace/Lucene-Solr-trunk-Linux/lucene/common-build.xml:1240: The following error occurred while executing this line:
/mnt/ssd/jenkins/workspace/Lucene-Solr-trunk-Linux/lucene/common-build.xml:884: There were test failures: 296 suites, 1235 tests, 1 failure, 37 ignored (7 assumptions)

Total time: 31 minutes 19 seconds
Build step 'Invoke Ant' marked build as failure
Description set: Java: 64bit/ibm-j9-jdk7 -Xjit:exclude={org/apache/lucene/util/fst/FST.pack(IIF)Lorg/apache/lucene/util/fst/FST;}
Archiving artifacts
Recording test results
Email was triggered for: Failure
Sending email for trigger: Failure