You are viewing a plain text version of this content. The canonical link for it is here.
Posted to builds@solr.apache.org by Policeman Jenkins Server <je...@thetaphi.de> on 2025/07/17 00:51:35 UTC
[JENKINS-EA] Solr-main-Linux (64bit/hotspot/jdk-26-ea+2) - Build # 27103 - Still Failing!
Build: https://jenkins.thetaphi.de/job/Solr-main-Linux/27103/
Java: 64bit/hotspot/jdk-26-ea+2 -XX:-UseCompressedOops -XX:+UseG1GC
All tests passed
[JENKINS-EA] Solr-main-Linux (64bit/hotspot/jdk-25-ea+27) - Build # 27147 - Still Failing!
Posted by Policeman Jenkins Server <je...@thetaphi.de>.
Build: https://jenkins.thetaphi.de/job/Solr-main-Linux/27147/
Java: 64bit/hotspot/jdk-25-ea+27 -XX:+UseCompressedOops -XX:+UseParallelGC
All tests passed
[JENKINS] Solr-main-Linux (64bit/hotspot/jdk-22.0.2) - Build # 27146 - Still Failing!
Posted by Policeman Jenkins Server <je...@thetaphi.de>.
Build: https://jenkins.thetaphi.de/job/Solr-main-Linux/27146/
Java: 64bit/hotspot/jdk-22.0.2 -XX:+UseCompressedOops -XX:+UseParallelGC
All tests passed
[JENKINS-EA] Solr-main-Linux (64bit/hotspot/jdk-25-ea+27) - Build # 27145 - Still Failing!
Posted by Policeman Jenkins Server <je...@thetaphi.de>.
Build: https://jenkins.thetaphi.de/job/Solr-main-Linux/27145/
Java: 64bit/hotspot/jdk-25-ea+27 -XX:+UseCompressedOops -XX:+UseParallelGC
All tests passed
[JENKINS-EA] Solr-main-Linux (64bit/hotspot/jdk-26-ea+2) - Build # 27144 - Still Failing!
Posted by Policeman Jenkins Server <je...@thetaphi.de>.
Build: https://jenkins.thetaphi.de/job/Solr-main-Linux/27144/
Java: 64bit/hotspot/jdk-26-ea+2 -XX:+UseCompressedOops -XX:+UseSerialGC
All tests passed
[JENKINS] Solr-main-Linux (64bit/hotspot/jdk-22.0.2) - Build # 27143 - Still Failing!
Posted by Policeman Jenkins Server <je...@thetaphi.de>.
Build: https://jenkins.thetaphi.de/job/Solr-main-Linux/27143/
Java: 64bit/hotspot/jdk-22.0.2 -XX:-UseCompressedOops -XX:+UseG1GC
All tests passed
[JENKINS-EA] Solr-main-Linux (64bit/hotspot/jdk-26-ea+2) - Build # 27142 - Still Failing!
Posted by Policeman Jenkins Server <je...@thetaphi.de>.
Build: https://jenkins.thetaphi.de/job/Solr-main-Linux/27142/
Java: 64bit/hotspot/jdk-26-ea+2 -XX:+UseCompressedOops -XX:+UseG1GC
All tests passed
[JENKINS-EA] Solr-main-Linux (64bit/hotspot/jdk-25-ea+27) - Build # 27141 - Still Failing!
Posted by Policeman Jenkins Server <je...@thetaphi.de>.
Build: https://jenkins.thetaphi.de/job/Solr-main-Linux/27141/
Java: 64bit/hotspot/jdk-25-ea+27 -XX:-UseCompressedOops -XX:+UseG1GC
All tests passed
[JENKINS] Solr-main-Linux (64bit/hotspot/jdk-24) - Build # 27140 - Still Failing!
Posted by Policeman Jenkins Server <je...@thetaphi.de>.
Build: https://jenkins.thetaphi.de/job/Solr-main-Linux/27140/
Java: 64bit/hotspot/jdk-24 -XX:-UseCompressedOops -XX:+UseParallelGC
All tests passed
[JENKINS-EA] Solr-main-Linux (64bit/hotspot/jdk-26-ea+2) - Build # 27139 - Still Failing!
Posted by Policeman Jenkins Server <je...@thetaphi.de>.
Build: https://jenkins.thetaphi.de/job/Solr-main-Linux/27139/
Java: 64bit/hotspot/jdk-26-ea+2 -XX:-UseCompressedOops -XX:+UseSerialGC
All tests passed
[JENKINS] Solr-main-Linux (64bit/hotspot/jdk-22.0.2) - Build # 27138 - Still Failing!
Posted by Policeman Jenkins Server <je...@thetaphi.de>.
Build: https://jenkins.thetaphi.de/job/Solr-main-Linux/27138/
Java: 64bit/hotspot/jdk-22.0.2 -XX:+UseCompressedOops -XX:+UseSerialGC
All tests passed
[JENKINS] Solr-main-Linux (64bit/hotspot/jdk-24) - Build # 27137 - Still Failing!
Posted by Policeman Jenkins Server <je...@thetaphi.de>.
Build: https://jenkins.thetaphi.de/job/Solr-main-Linux/27137/
Java: 64bit/hotspot/jdk-24 -XX:-UseCompressedOops -XX:+UseG1GC
All tests passed
[JENKINS] Solr-main-Linux (64bit/hotspot/jdk-22.0.2) - Build # 27136 - Still Failing!
Posted by Policeman Jenkins Server <je...@thetaphi.de>.
Build: https://jenkins.thetaphi.de/job/Solr-main-Linux/27136/
Java: 64bit/hotspot/jdk-22.0.2 -XX:-UseCompressedOops -XX:+UseG1GC
All tests passed
[JENKINS] Solr-main-Linux (64bit/hotspot/jdk-23.0.2) - Build # 27135 - Still Failing!
Posted by Policeman Jenkins Server <je...@thetaphi.de>.
Build: https://jenkins.thetaphi.de/job/Solr-main-Linux/27135/
Java: 64bit/hotspot/jdk-23.0.2 -XX:-UseCompressedOops -XX:+UseParallelGC
All tests passed
[JENKINS] Solr-main-Linux (64bit/hotspot/jdk-24) - Build # 27134 - Still Failing!
Posted by Policeman Jenkins Server <je...@thetaphi.de>.
Build: https://jenkins.thetaphi.de/job/Solr-main-Linux/27134/
Java: 64bit/hotspot/jdk-24 -XX:+UseCompressedOops -XX:+UseParallelGC
All tests passed
[JENKINS] Solr-main-Linux (64bit/hotspot/jdk-21.0.6) - Build # 27133 - Still Failing!
Posted by Policeman Jenkins Server <je...@thetaphi.de>.
Build: https://jenkins.thetaphi.de/job/Solr-main-Linux/27133/
Java: 64bit/hotspot/jdk-21.0.6 -XX:+UseCompressedOops -XX:+UseG1GC
All tests passed
[JENKINS] Solr-main-Linux (64bit/hotspot/jdk-23.0.2) - Build # 27132 - Still Failing!
Posted by Policeman Jenkins Server <je...@thetaphi.de>.
Build: https://jenkins.thetaphi.de/job/Solr-main-Linux/27132/
Java: 64bit/hotspot/jdk-23.0.2 -XX:+UseCompressedOops -XX:+UseSerialGC
All tests passed
[JENKINS] Solr-main-Linux (64bit/hotspot/jdk-21.0.6) - Build # 27131 - Still Failing!
Posted by Policeman Jenkins Server <je...@thetaphi.de>.
Build: https://jenkins.thetaphi.de/job/Solr-main-Linux/27131/
Java: 64bit/hotspot/jdk-21.0.6 -XX:-UseCompressedOops -XX:+UseSerialGC
All tests passed
[JENKINS] Solr-main-Linux (64bit/hotspot/jdk-22.0.2) - Build # 27130 - Still Failing!
Posted by Policeman Jenkins Server <je...@thetaphi.de>.
Build: https://jenkins.thetaphi.de/job/Solr-main-Linux/27130/
Java: 64bit/hotspot/jdk-22.0.2 -XX:+UseCompressedOops -XX:+UseSerialGC
All tests passed
[JENKINS] Solr-main-Linux (64bit/hotspot/jdk-22.0.2) - Build # 27129 - Still Failing!
Posted by Policeman Jenkins Server <je...@thetaphi.de>.
Build: https://jenkins.thetaphi.de/job/Solr-main-Linux/27129/
Java: 64bit/hotspot/jdk-22.0.2 -XX:-UseCompressedOops -XX:+UseG1GC
All tests passed
[JENKINS-EA] Solr-main-Linux (64bit/hotspot/jdk-26-ea+2) - Build # 27128 - Still Failing!
Posted by Policeman Jenkins Server <je...@thetaphi.de>.
Build: https://jenkins.thetaphi.de/job/Solr-main-Linux/27128/
Java: 64bit/hotspot/jdk-26-ea+2 -XX:-UseCompressedOops -XX:+UseSerialGC
All tests passed
[JENKINS-EA] Solr-main-Linux (64bit/hotspot/jdk-25-ea+27) - Build # 27127 - Still Failing!
Posted by Policeman Jenkins Server <je...@thetaphi.de>.
Build: https://jenkins.thetaphi.de/job/Solr-main-Linux/27127/
Java: 64bit/hotspot/jdk-25-ea+27 -XX:+UseCompressedOops -XX:+UseParallelGC
All tests passed
[JENKINS-EA] Solr-main-Linux (64bit/hotspot/jdk-25-ea+27) - Build # 27126 - Still Failing!
Posted by Policeman Jenkins Server <je...@thetaphi.de>.
Build: https://jenkins.thetaphi.de/job/Solr-main-Linux/27126/
Java: 64bit/hotspot/jdk-25-ea+27 -XX:+UseCompressedOops -XX:+UseSerialGC
All tests passed
[JENKINS] Solr-main-Linux (64bit/hotspot/jdk-23.0.2) - Build # 27125 - Still Failing!
Posted by Policeman Jenkins Server <je...@thetaphi.de>.
Build: https://jenkins.thetaphi.de/job/Solr-main-Linux/27125/
Java: 64bit/hotspot/jdk-23.0.2 -XX:-UseCompressedOops -XX:+UseG1GC
All tests passed
[JENKINS] Solr-main-Linux (64bit/hotspot/jdk-24) - Build # 27124 - Still Failing!
Posted by Policeman Jenkins Server <je...@thetaphi.de>.
Build: https://jenkins.thetaphi.de/job/Solr-main-Linux/27124/
Java: 64bit/hotspot/jdk-24 -XX:-UseCompressedOops -XX:+UseG1GC
All tests passed
[JENKINS] Solr-main-Linux (64bit/hotspot/jdk-21.0.6) - Build # 27123 - Still Failing!
Posted by Policeman Jenkins Server <je...@thetaphi.de>.
Build: https://jenkins.thetaphi.de/job/Solr-main-Linux/27123/
Java: 64bit/hotspot/jdk-21.0.6 -XX:+UseCompressedOops -XX:+UseSerialGC
All tests passed
[JENKINS-EA] Solr-main-Linux (64bit/hotspot/jdk-25-ea+27) - Build # 27122 - Still Failing!
Posted by Policeman Jenkins Server <je...@thetaphi.de>.
Build: https://jenkins.thetaphi.de/job/Solr-main-Linux/27122/
Java: 64bit/hotspot/jdk-25-ea+27 -XX:+UseCompressedOops -XX:+UseG1GC
All tests passed
[JENKINS] Solr-main-Linux (64bit/hotspot/jdk-21.0.6) - Build # 27121 - Still Failing!
Posted by Policeman Jenkins Server <je...@thetaphi.de>.
Build: https://jenkins.thetaphi.de/job/Solr-main-Linux/27121/
Java: 64bit/hotspot/jdk-21.0.6 -XX:+UseCompressedOops -XX:+UseParallelGC
All tests passed
[JENKINS-EA] Solr-main-Linux (64bit/hotspot/jdk-26-ea+2) - Build # 27120 - Still Failing!
Posted by Policeman Jenkins Server <je...@thetaphi.de>.
Build: https://jenkins.thetaphi.de/job/Solr-main-Linux/27120/
Java: 64bit/hotspot/jdk-26-ea+2 -XX:-UseCompressedOops -XX:+UseSerialGC
All tests passed
[JENKINS-EA] Solr-main-Linux (64bit/hotspot/jdk-25-ea+27) - Build # 27119 - Still Failing!
Posted by Policeman Jenkins Server <je...@thetaphi.de>.
Build: https://jenkins.thetaphi.de/job/Solr-main-Linux/27119/
Java: 64bit/hotspot/jdk-25-ea+27 -XX:-UseCompressedOops -XX:+UseSerialGC
All tests passed
[JENKINS] Solr-main-Linux (64bit/hotspot/jdk-21.0.6) - Build # 27118 - Still Failing!
Posted by Policeman Jenkins Server <je...@thetaphi.de>.
Build: https://jenkins.thetaphi.de/job/Solr-main-Linux/27118/
Java: 64bit/hotspot/jdk-21.0.6 -XX:+UseCompressedOops -XX:+UseG1GC
All tests passed
[JENKINS] Solr-main-Linux (64bit/hotspot/jdk-22.0.2) - Build # 27117 - Still Failing!
Posted by Policeman Jenkins Server <je...@thetaphi.de>.
Build: https://jenkins.thetaphi.de/job/Solr-main-Linux/27117/
Java: 64bit/hotspot/jdk-22.0.2 -XX:+UseCompressedOops -XX:+UseG1GC
1 tests failed.
FAILED: org.apache.solr.s3.S3IncrementalBackupTest.testSkipConfigset
Error Message:
org.apache.solr.common.SolrException: Could not find a healthy node to handle the request.
Stack Trace:
org.apache.solr.common.SolrException: Could not find a healthy node to handle the request.
at __randomizedtesting.SeedInfo.seed([1502D7846CE13DA0:1EFB488DF4A36BB7]:0)
at app//org.apache.solr.client.solrj.impl.CloudSolrClient.sendRequest(CloudSolrClient.java:1144)
at app//org.apache.solr.client.solrj.impl.CloudSolrClient.requestWithRetryOnStaleState(CloudSolrClient.java:844)
at app//org.apache.solr.client.solrj.impl.CloudSolrClient.requestWithRetryOnStaleState(CloudSolrClient.java:980)
at app//org.apache.solr.client.solrj.impl.CloudSolrClient.requestWithRetryOnStaleState(CloudSolrClient.java:980)
at app//org.apache.solr.client.solrj.impl.CloudSolrClient.requestWithRetryOnStaleState(CloudSolrClient.java:980)
at app//org.apache.solr.client.solrj.impl.CloudSolrClient.requestWithRetryOnStaleState(CloudSolrClient.java:980)
at app//org.apache.solr.client.solrj.impl.CloudSolrClient.requestWithRetryOnStaleState(CloudSolrClient.java:980)
at app//org.apache.solr.client.solrj.impl.CloudSolrClient.request(CloudSolrClient.java:775)
at app//org.apache.solr.client.solrj.SolrRequest.process(SolrRequest.java:285)
at app//org.apache.solr.client.solrj.SolrClient.query(SolrClient.java:926)
at app//org.apache.solr.cloud.api.collections.AbstractIncrementalBackupTest.testSkipConfigset(AbstractIncrementalBackupTest.java:418)
at java.base@22.0.2/jdk.internal.reflect.DirectMethodHandleAccessor.invoke(DirectMethodHandleAccessor.java:103)
at java.base@22.0.2/java.lang.reflect.Method.invoke(Method.java:580)
at app//com.carrotsearch.randomizedtesting.RandomizedRunner.invoke(RandomizedRunner.java:1758)
at app//com.carrotsearch.randomizedtesting.RandomizedRunner$8.evaluate(RandomizedRunner.java:946)
at app//com.carrotsearch.randomizedtesting.RandomizedRunner$9.evaluate(RandomizedRunner.java:982)
at app//com.carrotsearch.randomizedtesting.RandomizedRunner$10.evaluate(RandomizedRunner.java:996)
at app//com.carrotsearch.randomizedtesting.rules.SystemPropertiesRestoreRule$1.evaluate(SystemPropertiesRestoreRule.java:80)
at app//org.junit.rules.RunRules.evaluate(RunRules.java:20)
at app//org.apache.lucene.tests.util.TestRuleSetupTeardownChained$1.evaluate(TestRuleSetupTeardownChained.java:48)
at app//org.apache.lucene.tests.util.AbstractBeforeAfterRule$1.evaluate(AbstractBeforeAfterRule.java:43)
at app//org.apache.lucene.tests.util.TestRuleThreadAndTestName$1.evaluate(TestRuleThreadAndTestName.java:45)
at app//org.apache.lucene.tests.util.TestRuleIgnoreAfterMaxFailures$1.evaluate(TestRuleIgnoreAfterMaxFailures.java:60)
at app//org.apache.lucene.tests.util.TestRuleMarkFailure$1.evaluate(TestRuleMarkFailure.java:44)
at app//org.junit.rules.RunRules.evaluate(RunRules.java:20)
at app//com.carrotsearch.randomizedtesting.rules.StatementAdapter.evaluate(StatementAdapter.java:36)
at app//com.carrotsearch.randomizedtesting.ThreadLeakControl$StatementRunner.run(ThreadLeakControl.java:390)
at app//com.carrotsearch.randomizedtesting.ThreadLeakControl.forkTimeoutingTask(ThreadLeakControl.java:843)
at app//com.carrotsearch.randomizedtesting.ThreadLeakControl$3.evaluate(ThreadLeakControl.java:490)
at app//com.carrotsearch.randomizedtesting.RandomizedRunner.runSingleTest(RandomizedRunner.java:955)
at app//com.carrotsearch.randomizedtesting.RandomizedRunner$5.evaluate(RandomizedRunner.java:840)
at app//com.carrotsearch.randomizedtesting.RandomizedRunner$6.evaluate(RandomizedRunner.java:891)
at app//com.carrotsearch.randomizedtesting.RandomizedRunner$7.evaluate(RandomizedRunner.java:902)
at app//com.adobe.testing.s3mock.junit4.S3MockRule$1.evaluate(S3MockRule.java:70)
at app//com.carrotsearch.randomizedtesting.rules.StatementAdapter.evaluate(StatementAdapter.java:36)
at app//com.carrotsearch.randomizedtesting.rules.StatementAdapter.evaluate(StatementAdapter.java:36)
at app//org.apache.lucene.tests.util.AbstractBeforeAfterRule$1.evaluate(AbstractBeforeAfterRule.java:43)
at app//com.carrotsearch.randomizedtesting.rules.SystemPropertiesRestoreRule$1.evaluate(SystemPropertiesRestoreRule.java:80)
at app//org.junit.rules.RunRules.evaluate(RunRules.java:20)
at app//org.apache.lucene.tests.util.AbstractBeforeAfterRule$1.evaluate(AbstractBeforeAfterRule.java:43)
at app//com.carrotsearch.randomizedtesting.rules.StatementAdapter.evaluate(StatementAdapter.java:36)
at app//org.apache.lucene.tests.util.TestRuleStoreClassName$1.evaluate(TestRuleStoreClassName.java:38)
at app//com.carrotsearch.randomizedtesting.rules.NoShadowingOrOverridesOnMethodsRule$1.evaluate(NoShadowingOrOverridesOnMethodsRule.java:40)
at app//com.carrotsearch.randomizedtesting.rules.NoShadowingOrOverridesOnMethodsRule$1.evaluate(NoShadowingOrOverridesOnMethodsRule.java:40)
at app//com.carrotsearch.randomizedtesting.rules.StatementAdapter.evaluate(StatementAdapter.java:36)
at app//com.carrotsearch.randomizedtesting.rules.StatementAdapter.evaluate(StatementAdapter.java:36)
at app//org.apache.lucene.tests.util.TestRuleAssertionsRequired$1.evaluate(TestRuleAssertionsRequired.java:53)
at app//org.apache.lucene.tests.util.AbstractBeforeAfterRule$1.evaluate(AbstractBeforeAfterRule.java:43)
at app//org.apache.lucene.tests.util.TestRuleMarkFailure$1.evaluate(TestRuleMarkFailure.java:44)
at app//org.apache.lucene.tests.util.TestRuleIgnoreAfterMaxFailures$1.evaluate(TestRuleIgnoreAfterMaxFailures.java:60)
at app//org.apache.lucene.tests.util.TestRuleIgnoreTestSuites$1.evaluate(TestRuleIgnoreTestSuites.java:47)
at app//org.junit.rules.RunRules.evaluate(RunRules.java:20)
at app//com.carrotsearch.randomizedtesting.rules.StatementAdapter.evaluate(StatementAdapter.java:36)
at app//com.carrotsearch.randomizedtesting.ThreadLeakControl$StatementRunner.run(ThreadLeakControl.java:390)
at app//com.carrotsearch.randomizedtesting.ThreadLeakControl.lambda$forkTimeoutingTask$0(ThreadLeakControl.java:850)
at java.base@22.0.2/java.lang.Thread.run(Thread.java:1570)
[JENKINS] Solr-main-Linux (64bit/hotspot/jdk-21.0.6) - Build # 27116 - Still Failing!
Posted by Policeman Jenkins Server <je...@thetaphi.de>.
Build: https://jenkins.thetaphi.de/job/Solr-main-Linux/27116/
Java: 64bit/hotspot/jdk-21.0.6 -XX:-UseCompressedOops -XX:+UseParallelGC
All tests passed
[JENKINS-EA] Solr-main-Linux (64bit/hotspot/jdk-26-ea+2) - Build # 27115 - Still Failing!
Posted by Policeman Jenkins Server <je...@thetaphi.de>.
Build: https://jenkins.thetaphi.de/job/Solr-main-Linux/27115/
Java: 64bit/hotspot/jdk-26-ea+2 -XX:+UseCompressedOops -XX:+UseSerialGC
All tests passed
[JENKINS-EA] Solr-main-Linux (64bit/hotspot/jdk-25-ea+27) - Build # 27114 - Still Failing!
Posted by Policeman Jenkins Server <je...@thetaphi.de>.
Build: https://jenkins.thetaphi.de/job/Solr-main-Linux/27114/
Java: 64bit/hotspot/jdk-25-ea+27 -XX:-UseCompressedOops -XX:+UseG1GC
All tests passed
[JENKINS] Solr-main-Linux (64bit/hotspot/jdk-21.0.6) - Build # 27113 - Still Failing!
Posted by Policeman Jenkins Server <je...@thetaphi.de>.
Build: https://jenkins.thetaphi.de/job/Solr-main-Linux/27113/
Java: 64bit/hotspot/jdk-21.0.6 -XX:+UseCompressedOops -XX:+UseG1GC
All tests passed
[JENKINS] Solr-main-Linux (64bit/hotspot/jdk-22.0.2) - Build # 27112 - Still Failing!
Posted by Policeman Jenkins Server <je...@thetaphi.de>.
Build: https://jenkins.thetaphi.de/job/Solr-main-Linux/27112/
Java: 64bit/hotspot/jdk-22.0.2 -XX:+UseCompressedOops -XX:+UseSerialGC
All tests passed
[JENKINS] Solr-main-Linux (64bit/hotspot/jdk-21.0.6) - Build # 27111 - Still Failing!
Posted by Policeman Jenkins Server <je...@thetaphi.de>.
Build: https://jenkins.thetaphi.de/job/Solr-main-Linux/27111/
Java: 64bit/hotspot/jdk-21.0.6 -XX:+UseCompressedOops -XX:+UseParallelGC
All tests passed
[JENKINS-EA] Solr-main-Linux (64bit/hotspot/jdk-25-ea+27) - Build # 27110 - Still Failing!
Posted by Policeman Jenkins Server <je...@thetaphi.de>.
Build: https://jenkins.thetaphi.de/job/Solr-main-Linux/27110/
Java: 64bit/hotspot/jdk-25-ea+27 -XX:-UseCompressedOops -XX:+UseG1GC
All tests passed
[JENKINS-EA] Solr-main-Linux (64bit/hotspot/jdk-25-ea+27) - Build # 27109 - Still Failing!
Posted by Policeman Jenkins Server <je...@thetaphi.de>.
Build: https://jenkins.thetaphi.de/job/Solr-main-Linux/27109/
Java: 64bit/hotspot/jdk-25-ea+27 -XX:+UseCompressedOops -XX:+UseParallelGC
All tests passed
[JENKINS-EA] Solr-main-Linux (64bit/hotspot/jdk-25-ea+27) - Build # 27108 - Still Failing!
Posted by Policeman Jenkins Server <je...@thetaphi.de>.
Build: https://jenkins.thetaphi.de/job/Solr-main-Linux/27108/
Java: 64bit/hotspot/jdk-25-ea+27 -XX:+UseCompressedOops -XX:+UseSerialGC
All tests passed
[JENKINS-EA] Solr-main-Linux (64bit/hotspot/jdk-26-ea+2) - Build # 27107 - Still Failing!
Posted by Policeman Jenkins Server <je...@thetaphi.de>.
Build: https://jenkins.thetaphi.de/job/Solr-main-Linux/27107/
Java: 64bit/hotspot/jdk-26-ea+2 -XX:+UseCompressedOops -XX:+UseParallelGC
All tests passed
[JENKINS] Solr-main-Linux (64bit/hotspot/jdk-24) - Build # 27106 - Still Failing!
Posted by Policeman Jenkins Server <je...@thetaphi.de>.
Build: https://jenkins.thetaphi.de/job/Solr-main-Linux/27106/
Java: 64bit/hotspot/jdk-24 -XX:+UseCompressedOops -XX:+UseG1GC
All tests passed
[JENKINS] Solr-main-Linux (64bit/hotspot/jdk-22.0.2) - Build # 27105 - Still Failing!
Posted by Policeman Jenkins Server <je...@thetaphi.de>.
Build: https://jenkins.thetaphi.de/job/Solr-main-Linux/27105/
Java: 64bit/hotspot/jdk-22.0.2 -XX:+UseCompressedOops -XX:+UseG1GC
All tests passed
[JENKINS] Solr-main-Linux (64bit/hotspot/jdk-21.0.6) - Build # 27104 - Still Failing!
Posted by Policeman Jenkins Server <je...@thetaphi.de>.
Build: https://jenkins.thetaphi.de/job/Solr-main-Linux/27104/
Java: 64bit/hotspot/jdk-21.0.6 -XX:-UseCompressedOops -XX:+UseParallelGC
1 tests failed.
FAILED: org.apache.solr.gcs.GCSIncrementalBackupTest.testSkipConfigset
Error Message:
org.apache.solr.common.SolrException: Could not find a healthy node to handle the request.
Stack Trace:
org.apache.solr.common.SolrException: Could not find a healthy node to handle the request.
at __randomizedtesting.SeedInfo.seed([63EC8F821D98C354:6815108B85DA9543]:0)
at app//org.apache.solr.client.solrj.impl.CloudSolrClient.sendRequest(CloudSolrClient.java:1144)
at app//org.apache.solr.client.solrj.impl.CloudSolrClient.requestWithRetryOnStaleState(CloudSolrClient.java:844)
at app//org.apache.solr.client.solrj.impl.CloudSolrClient.requestWithRetryOnStaleState(CloudSolrClient.java:980)
at app//org.apache.solr.client.solrj.impl.CloudSolrClient.requestWithRetryOnStaleState(CloudSolrClient.java:980)
at app//org.apache.solr.client.solrj.impl.CloudSolrClient.requestWithRetryOnStaleState(CloudSolrClient.java:980)
at app//org.apache.solr.client.solrj.impl.CloudSolrClient.requestWithRetryOnStaleState(CloudSolrClient.java:980)
at app//org.apache.solr.client.solrj.impl.CloudSolrClient.requestWithRetryOnStaleState(CloudSolrClient.java:980)
at app//org.apache.solr.client.solrj.impl.CloudSolrClient.request(CloudSolrClient.java:775)
at app//org.apache.solr.client.solrj.SolrRequest.process(SolrRequest.java:285)
at app//org.apache.solr.client.solrj.SolrClient.query(SolrClient.java:926)
at app//org.apache.solr.cloud.api.collections.AbstractIncrementalBackupTest.testSkipConfigset(AbstractIncrementalBackupTest.java:418)
at java.base@21.0.6/jdk.internal.reflect.DirectMethodHandleAccessor.invoke(DirectMethodHandleAccessor.java:103)
at java.base@21.0.6/java.lang.reflect.Method.invoke(Method.java:580)
at app//com.carrotsearch.randomizedtesting.RandomizedRunner.invoke(RandomizedRunner.java:1758)
at app//com.carrotsearch.randomizedtesting.RandomizedRunner$8.evaluate(RandomizedRunner.java:946)
at app//com.carrotsearch.randomizedtesting.RandomizedRunner$9.evaluate(RandomizedRunner.java:982)
at app//com.carrotsearch.randomizedtesting.RandomizedRunner$10.evaluate(RandomizedRunner.java:996)
at app//com.carrotsearch.randomizedtesting.rules.SystemPropertiesRestoreRule$1.evaluate(SystemPropertiesRestoreRule.java:80)
at app//org.junit.rules.RunRules.evaluate(RunRules.java:20)
at app//org.apache.lucene.tests.util.TestRuleSetupTeardownChained$1.evaluate(TestRuleSetupTeardownChained.java:48)
at app//org.apache.lucene.tests.util.AbstractBeforeAfterRule$1.evaluate(AbstractBeforeAfterRule.java:43)
at app//org.apache.lucene.tests.util.TestRuleThreadAndTestName$1.evaluate(TestRuleThreadAndTestName.java:45)
at app//org.apache.lucene.tests.util.TestRuleIgnoreAfterMaxFailures$1.evaluate(TestRuleIgnoreAfterMaxFailures.java:60)
at app//org.apache.lucene.tests.util.TestRuleMarkFailure$1.evaluate(TestRuleMarkFailure.java:44)
at app//org.junit.rules.RunRules.evaluate(RunRules.java:20)
at app//com.carrotsearch.randomizedtesting.rules.StatementAdapter.evaluate(StatementAdapter.java:36)
at app//com.carrotsearch.randomizedtesting.ThreadLeakControl$StatementRunner.run(ThreadLeakControl.java:390)
at app//com.carrotsearch.randomizedtesting.ThreadLeakControl.forkTimeoutingTask(ThreadLeakControl.java:843)
at app//com.carrotsearch.randomizedtesting.ThreadLeakControl$3.evaluate(ThreadLeakControl.java:490)
at app//com.carrotsearch.randomizedtesting.RandomizedRunner.runSingleTest(RandomizedRunner.java:955)
at app//com.carrotsearch.randomizedtesting.RandomizedRunner$5.evaluate(RandomizedRunner.java:840)
at app//com.carrotsearch.randomizedtesting.RandomizedRunner$6.evaluate(RandomizedRunner.java:891)
at app//com.carrotsearch.randomizedtesting.RandomizedRunner$7.evaluate(RandomizedRunner.java:902)
at app//com.carrotsearch.randomizedtesting.rules.StatementAdapter.evaluate(StatementAdapter.java:36)
at app//com.carrotsearch.randomizedtesting.rules.StatementAdapter.evaluate(StatementAdapter.java:36)
at app//org.apache.lucene.tests.util.AbstractBeforeAfterRule$1.evaluate(AbstractBeforeAfterRule.java:43)
at app//com.carrotsearch.randomizedtesting.rules.SystemPropertiesRestoreRule$1.evaluate(SystemPropertiesRestoreRule.java:80)
at app//org.junit.rules.RunRules.evaluate(RunRules.java:20)
at app//org.apache.lucene.tests.util.AbstractBeforeAfterRule$1.evaluate(AbstractBeforeAfterRule.java:43)
at app//com.carrotsearch.randomizedtesting.rules.StatementAdapter.evaluate(StatementAdapter.java:36)
at app//org.apache.lucene.tests.util.TestRuleStoreClassName$1.evaluate(TestRuleStoreClassName.java:38)
at app//com.carrotsearch.randomizedtesting.rules.NoShadowingOrOverridesOnMethodsRule$1.evaluate(NoShadowingOrOverridesOnMethodsRule.java:40)
at app//com.carrotsearch.randomizedtesting.rules.NoShadowingOrOverridesOnMethodsRule$1.evaluate(NoShadowingOrOverridesOnMethodsRule.java:40)
at app//com.carrotsearch.randomizedtesting.rules.StatementAdapter.evaluate(StatementAdapter.java:36)
at app//com.carrotsearch.randomizedtesting.rules.StatementAdapter.evaluate(StatementAdapter.java:36)
at app//org.apache.lucene.tests.util.TestRuleAssertionsRequired$1.evaluate(TestRuleAssertionsRequired.java:53)
at app//org.apache.lucene.tests.util.AbstractBeforeAfterRule$1.evaluate(AbstractBeforeAfterRule.java:43)
at app//org.apache.lucene.tests.util.TestRuleMarkFailure$1.evaluate(TestRuleMarkFailure.java:44)
at app//org.apache.lucene.tests.util.TestRuleIgnoreAfterMaxFailures$1.evaluate(TestRuleIgnoreAfterMaxFailures.java:60)
at app//org.apache.lucene.tests.util.TestRuleIgnoreTestSuites$1.evaluate(TestRuleIgnoreTestSuites.java:47)
at app//org.junit.rules.RunRules.evaluate(RunRules.java:20)
at app//com.carrotsearch.randomizedtesting.rules.StatementAdapter.evaluate(StatementAdapter.java:36)
at app//com.carrotsearch.randomizedtesting.ThreadLeakControl$StatementRunner.run(ThreadLeakControl.java:390)
at app//com.carrotsearch.randomizedtesting.ThreadLeakControl.lambda$forkTimeoutingTask$0(ThreadLeakControl.java:850)
at java.base@21.0.6/java.lang.Thread.run(Thread.java:1583)