You are viewing a plain text version of this content. The canonical link for it is here.
Posted to notifications@maven.apache.org by Apache Jenkins Server <je...@builds.apache.org> on 2018/12/29 16:25:51 UTC

Build failed in Jenkins: Maven TLP » maven-deploy-plugin » MDEPLOY-244 #5

See https://builds.apache.org/job/maven-box/job/maven-deploy-plugin/job/MDEPLOY-244/5/

Changes:

* Removed exclusion for problematic node cause the node is back online.
* reduce the history archiving
* reduce the history archiving
* increase a bit archiving
* increase a bit archiving
* Activate sonarqube on first project
* Disable sonar:sonar for now
* use publisherStrategy: 'EXPLICIT' to avoid non used publishers
* [INFRA-17514] Fix file separator + add other locations for workspaces
* fix indent

All tests passed

Build log:
[...truncated 3.19 MB...]
[windows-jdk11-m3.5.x_build] [INFO] Downloaded from central: https://repo.maven.apache.org/maven2/org/apache/maven/doxia/doxia-site-renderer/1.7.4/doxia-site-renderer-1.7.4.jar (64 kB at 561 kB/s)
[windows-jdk11-m3.5.x_build] [INFO] Downloading from central: https://repo.maven.apache.org/maven2/org/apache/maven/doxia/doxia-module-xhtml/1.7/doxia-module-xhtml-1.7.jar
[windows-jdk11-m3.5.x_build] [INFO] Downloaded from central: https://repo.maven.apache.org/maven2/org/apache/maven/doxia/doxia-logging-api/1.7/doxia-logging-api-1.7.jar (12 kB at 90 kB/s)
[windows-jdk11-m3.5.x_build] [INFO] Downloading from central: https://repo.maven.apache.org/maven2/org/codehaus/groovy/groovy-all/2.4.8/groovy-all-2.4.8.jar
[windows-jdk11-m3.5.x_build] [INFO] Downloaded from central: https://repo.maven.apache.org/maven2/org/apache/maven/doxia/doxia-decoration-model/1.7.4/doxia-decoration-model-1.7.4.jar (61 kB at 459 kB/s)
[windows-jdk11-m3.5.x_build] [INFO] Downloaded from central: https://repo.maven.apache.org/maven2/org/apache/maven/doxia/doxia-skin-model/1.7.4/doxia-skin-model-1.7.4.jar (16 kB at 119 kB/s)
[windows-jdk11-m3.5.x_build] [INFO] Downloaded from central: https://repo.maven.apache.org/maven2/org/apache/maven/doxia/doxia-module-xhtml/1.7/doxia-module-xhtml-1.7.jar (17 kB at 121 kB/s)
[windows-jdk11-m3.5.x_build] [INFO] Downloaded from central: https://repo.maven.apache.org/maven2/org/apache/ant/ant/1.8.1/ant-1.8.1.jar (1.5 MB at 8.6 MB/s)
[windows-jdk11-m3.5.x_build] [INFO] Downloaded from central: https://repo.maven.apache.org/maven2/org/codehaus/groovy/groovy-all/2.4.8/groovy-all-2.4.8.jar (7.0 MB at 16 MB/s)
[windows-jdk11-m3.5.x_build] [INFO] Installing f:\jenkins\jenkins-slave\workspace\n-deploy-plugin_MDEPLOY-244-NRDIDFJPPT5CRCOGNX2HJENIU3S3JTEAK6BPB47LFTUVZQGA3VKQ@2\windows-jdk11-m3.5.x_build\pom.xml to f:\jenkins\jenkins-slave\workspace\n-deploy-plugin_MDEPLOY-244-NRDIDFJPPT5CRCOGNX2HJENIU3S3JTEAK6BPB47LFTUVZQGA3VKQ@2\windows-jdk11-m3.5.x_build\target\local-repo\org\apache\maven\plugins\maven-deploy-plugin\3.0.0-M2-SNAPSHOT\maven-deploy-plugin-3.0.0-M2-SNAPSHOT.pom
[windows-jdk11-m3.5.x_build] [INFO] Installing f:\jenkins\jenkins-slave\workspace\n-deploy-plugin_MDEPLOY-244-NRDIDFJPPT5CRCOGNX2HJENIU3S3JTEAK6BPB47LFTUVZQGA3VKQ@2\windows-jdk11-m3.5.x_build\target\maven-deploy-plugin-3.0.0-M2-SNAPSHOT.jar to f:\jenkins\jenkins-slave\workspace\n-deploy-plugin_MDEPLOY-244-NRDIDFJPPT5CRCOGNX2HJENIU3S3JTEAK6BPB47LFTUVZQGA3VKQ@2\windows-jdk11-m3.5.x_build\target\local-repo\org\apache\maven\plugins\maven-deploy-plugin\3.0.0-M2-SNAPSHOT\maven-deploy-plugin-3.0.0-M2-SNAPSHOT.jar
[windows-jdk11-m3.5.x_build] [INFO] 
[windows-jdk11-m3.5.x_build] [INFO] --- maven-invoker-plugin:3.1.0:integration-test (integration-test) @ maven-deploy-plugin ---
[windows-jdk11-m3.5.x_build] [INFO] Building: 3rd-party-jar-with-extras\pom.xml
[windows-jdk11-m3.5.x_build] [INFO] run pre-build script setup.bsh
[windows-jdk11-m3.5.x_build] [INFO] run post-build script verify.bsh
[windows-jdk11-m3.5.x_build] [INFO]           3rd-party-jar-with-extras\pom.xml ................ SUCCESS (4.1 s)
[windows-jdk11-m3.5.x_build] [INFO] Building: 3rd-party-jar-without-pom\pom.xml
[windows-jdk11-m3.5.x_build] [INFO] run pre-build script setup.bsh
[windows-jdk11-m3.5.x_build] [INFO] run post-build script verify.bsh
[windows-jdk11-m3.5.x_build] [INFO]           3rd-party-jar-without-pom\pom.xml ................ SUCCESS (3.8 s)
[windows-jdk11-m3.5.x_build] [INFO] Building: 3rd-party-pom-with-extras\pom.xml
[windows-jdk11-m3.5.x_build] [INFO] run post-build script verify.bsh
[windows-jdk11-m3.5.x_build] [INFO]           3rd-party-pom-with-extras\pom.xml ................ SUCCESS (4.0 s)
[windows-jdk11-m3.5.x_build] [INFO] Building: alt-deploy-repo-with-dist-mgmt\pom.xml
[windows-jdk11-m3.5.x_build] [INFO] run pre-build script setup.bsh
[windows-jdk11-m3.5.x_build] [INFO] run post-build script verify.bsh
[windows-jdk11-m3.5.x_build] [INFO]           alt-deploy-repo-with-dist-mgmt\pom.xml ........... SUCCESS (8.1 s)
[windows-jdk11-m3.5.x_build] [INFO] Building: alt-deploy-repo-with-dist-mgmt-snapshot\pom.xml
[windows-jdk11-m3.5.x_build] [INFO] run pre-build script setup.bsh
[windows-jdk11-m3.5.x_build] [INFO] run post-build script verify.bsh
[windows-jdk11-m3.5.x_build] [INFO]           alt-deploy-repo-with-dist-mgmt-snapshot\pom.xml .. SUCCESS (4.6 s)
[windows-jdk11-m3.5.x_build] [INFO] Building: alt-deploy-repo-without-dist-mgmt\pom.xml
[windows-jdk11-m3.5.x_build] [INFO] run pre-build script setup.bsh
[windows-jdk11-m3.5.x_build] [INFO] run post-build script verify.bsh
[windows-jdk11-m3.5.x_build] [INFO]           alt-deploy-repo-without-dist-mgmt\pom.xml ........ SUCCESS (4.4 s)
[windows-jdk11-m3.5.x_build] [INFO] Building: attach-jar-checksum-release\pom.xml
[windows-jdk11-m3.5.x_build] [INFO] run pre-build script setup.bsh
[windows-jdk11-m3.5.x_build] [INFO] run post-build script verify.groovy
[windows-jdk11-m3.5.x_build] WARNING: An illegal reflective access operation has occurred
[windows-jdk11-m3.5.x_build] WARNING: Illegal reflective access by org.codehaus.groovy.reflection.CachedClass (file:/f:/jenkins/jenkins-slave/workspace/n-deploy-plugin_MDEPLOY-244-NRDIDFJPPT5CRCOGNX2HJENIU3S3JTEAK6BPB47LFTUVZQGA3VKQ@2/.repository/org/codehaus/groovy/groovy-all/2.4.8/groovy-all-2.4.8.jar) to method java.lang.Object.finalize()
[windows-jdk11-m3.5.x_build] WARNING: Please consider reporting this to the maintainers of org.codehaus.groovy.reflection.CachedClass
[windows-jdk11-m3.5.x_build] WARNING: Use --illegal-access=warn to enable warnings of further illegal reflective access operations
[windows-jdk11-m3.5.x_build] WARNING: All illegal access operations will be denied in a future release
[windows-jdk11-m3.5.x_build] [INFO]           attach-jar-checksum-release\pom.xml .............. SUCCESS (8.6 s)
[windows-jdk11-m3.5.x_build] [INFO] Building: attach-jar-checksum-snapshot\pom.xml
[windows-jdk11-m3.5.x_build] [INFO] run pre-build script setup.bsh
[windows-jdk11-m3.5.x_build] [INFO] run post-build script verify.groovy
[windows-jdk11-m3.5.x_build] [INFO]           attach-jar-checksum-snapshot\pom.xml ............. SUCCESS (4.9 s)
[windows-jdk11-m3.5.x_build] [INFO] Building: attach-release-jar\pom.xml
[windows-jdk11-m3.5.x_build] [INFO] run pre-build script setup.bsh
[windows-jdk11-m3.5.x_build] [INFO] run post-build script verify.bsh
[windows-jdk11-m3.5.x_build] [INFO]           attach-release-jar\pom.xml ....................... SUCCESS (4.7 s)
[windows-jdk11-m3.5.x_build] [INFO] Building: deploy-at-end-fail\pom.xml
[windows-jdk11-m3.5.x_build] [INFO] run post-build script verify.groovy
[windows-jdk11-m3.5.x_build] [INFO]           deploy-at-end-fail\pom.xml ....................... SUCCESS (8.0 s)
[windows-jdk11-m3.5.x_build] [INFO] Building: deploy-at-end-pass\pom.xml
[windows-jdk11-m3.5.x_build] [INFO] run post-build script verify.groovy
[windows-jdk11-m3.5.x_build] [INFO]           deploy-at-end-pass\pom.xml ....................... SUCCESS (5.0 s)
[windows-jdk11-m3.5.x_build] [INFO] Building: deploy-attached-sources\pom.xml
[windows-jdk11-m3.5.x_build] [INFO] run pre-build script setup.bsh
[windows-jdk11-m3.5.x_build] [INFO] run post-build script verify.bsh
[windows-jdk11-m3.5.x_build] [INFO]           deploy-attached-sources\pom.xml .................. SUCCESS (19.9 s)
[windows-jdk11-m3.5.x_build] [INFO] Building: deploy-default-packaging\pom.xml
[windows-jdk11-m3.5.x_build] [INFO] run pre-build script setup.bsh
[windows-jdk11-m3.5.x_build] [INFO] run post-build script verify.bsh
[windows-jdk11-m3.5.x_build] [INFO]           deploy-default-packaging\pom.xml ................. SUCCESS (4.1 s)
[windows-jdk11-m3.5.x_build] [INFO] Building: external-release-jar\pom.xml
[windows-jdk11-m3.5.x_build] [INFO] run pre-build script setup.bsh
[windows-jdk11-m3.5.x_build] [INFO] run post-build script verify.bsh
[windows-jdk11-m3.5.x_build] [INFO]           external-release-jar\pom.xml ..................... SUCCESS (3.9 s)
[windows-jdk11-m3.5.x_build] [INFO] Building: gav-validation\pom.xml
[windows-jdk11-m3.5.x_build] [INFO] run pre-build script setup.bsh
[windows-jdk11-m3.5.x_build] [INFO] run post-build script verify.groovy
[windows-jdk11-m3.5.x_build] [INFO]           gav-validation\pom.xml ........................... SUCCESS (8.2 s)
[windows-jdk11-m3.5.x_build] [INFO] Building: MDEPLOY-169_deploy-at-end-multithread\pom.xml
[windows-jdk11-m3.5.x_build] [INFO] run post-build script verify.groovy
[windows-jdk11-m3.5.x_build] [INFO]           MDEPLOY-169_deploy-at-end-multithread\pom.xml .... SUCCESS (5.4 s)
[windows-jdk11-m3.5.x_build] [INFO] Building: MDEPLOY-170_deploy-at-end-configperproject\pom.xml
[windows-jdk11-m3.5.x_build] [INFO] run post-build script verify.groovy
[windows-jdk11-m3.5.x_build] [INFO]           MDEPLOY-170_deploy-at-end-configperproject\pom.xml SUCCESS (5.0 s)
[windows-jdk11-m3.5.x_build] [INFO] Building: MDEPLOY-178_deployfile-with-embedded-pom\pom.xml
[windows-jdk11-m3.5.x_build] [INFO] run post-build script verify.groovy
[windows-jdk11-m3.5.x_build] [INFO]           MDEPLOY-178_deployfile-with-embedded-pom\pom.xml . SUCCESS (6.0 s)
[windows-jdk11-m3.5.x_build] [INFO] Building: MDEPLOY-202_deployfile-with-multiple-executions\pom.xml
[windows-jdk11-m3.5.x_build] [INFO] run post-build script verify.groovy
[windows-jdk11-m3.5.x_build] [INFO]           MDEPLOY-202_deployfile-with-multiple-executions\pom.xml SUCCESS (5.5 s)
[windows-jdk11-m3.5.x_build] [INFO] Building: MDEPLOY-212\pom.xml
[windows-jdk11-m3.5.x_build] [INFO] run post-build script verify.bsh
[windows-jdk11-m3.5.x_build] [INFO]           MDEPLOY-212\pom.xml .............................. SUCCESS (10.9 s)
[windows-jdk11-m3.5.x_build] [INFO] Building: MDEPLOY-213\pom.xml
[windows-jdk11-m3.5.x_build] [INFO] run post-build script verify.bsh
[windows-jdk11-m3.5.x_build] [INFO]           MDEPLOY-213\pom.xml .............................. SUCCESS (13.1 s)
[windows-jdk11-m3.5.x_build] [INFO] Building: mdeploy-45-test\pom.xml
[windows-jdk11-m3.5.x_build] [INFO] run pre-build script setup.bsh
[windows-jdk11-m3.5.x_build] [INFO] run post-build script verify.bsh
[windows-jdk11-m3.5.x_build] [INFO]           mdeploy-45-test\pom.xml .......................... SUCCESS (5.9 s)
[windows-jdk11-m3.5.x_build] [INFO] Building: no-main-artifact-1\pom.xml
[windows-jdk11-m3.5.x_build] [INFO] run pre-build script setup.bsh
[windows-jdk11-m3.5.x_build] [INFO] run post-build script verify.groovy
[windows-jdk11-m3.5.x_build] [INFO]           no-main-artifact-1\pom.xml ....................... SUCCESS (6.7 s)
[windows-jdk11-m3.5.x_build] [INFO] Building: no-main-artifact-2\pom.xml
[windows-jdk11-m3.5.x_build] [INFO] run pre-build script setup.bsh
[windows-jdk11-m3.5.x_build] [INFO] run post-build script verify.groovy
[windows-jdk11-m3.5.x_build] [INFO]           no-main-artifact-2\pom.xml ....................... SUCCESS (4.7 s)
[windows-jdk11-m3.5.x_build] [INFO] Building: no-main-artifact-snapshot\pom.xml
[windows-jdk11-m3.5.x_build] [INFO] run pre-build script setup.bsh
[windows-jdk11-m3.5.x_build] [INFO] run post-build script verify.bsh
[windows-jdk11-m3.5.x_build] [INFO]           no-main-artifact-snapshot\pom.xml ................ SUCCESS (4.0 s)
[windows-jdk11-m3.5.x_build] [INFO] Building: offline\pom.xml
[windows-jdk11-m3.5.x_build] [INFO] run pre-build script setup.bsh
[windows-jdk11-m3.5.x_build] [INFO]           offline\pom.xml .................................. SUCCESS (8.9 s)
[windows-jdk11-m3.5.x_build] [INFO] Building: release-jar\pom.xml
[windows-jdk11-m3.5.x_build] [INFO] run pre-build script setup.bsh
[windows-jdk11-m3.5.x_build] [INFO] run post-build script verify.bsh
[windows-jdk11-m3.5.x_build] [INFO]           release-jar\pom.xml .............................. SUCCESS (4.3 s)
[windows-jdk11-m3.5.x_build] [INFO] Building: release-pom\pom.xml
[windows-jdk11-m3.5.x_build] [INFO] run pre-build script setup.bsh
[windows-jdk11-m3.5.x_build] [INFO] run post-build script verify.bsh
[windows-jdk11-m3.5.x_build] [INFO]           release-pom\pom.xml .............................. SUCCESS (4.5 s)
[windows-jdk11-m3.5.x_build] [INFO] Building: skip\pom.xml
[windows-jdk11-m3.5.x_build] [INFO] run pre-build script setup.bsh
[windows-jdk11-m3.5.x_build] [INFO]           skip\pom.xml ..................................... SUCCESS (3.7 s)
[windows-jdk11-m3.5.x_build] [INFO] Building: snapshot-jar\pom.xml
[windows-jdk11-m3.5.x_build] [INFO] run pre-build script setup.bsh
[windows-jdk11-m3.5.x_build] [INFO] run post-build script verify.bsh
[windows-jdk11-m3.5.x_build] [INFO]           snapshot-jar\pom.xml ............................. SUCCESS (6.2 s)
[windows-jdk11-m3.5.x_build] [INFO] Building: snapshot-pom\pom.xml
[windows-jdk11-m3.5.x_build] [INFO] run pre-build script setup.bsh
[windows-jdk11-m3.5.x_build] [INFO] run post-build script verify.bsh
[windows-jdk11-m3.5.x_build] [INFO]           snapshot-pom\pom.xml ............................. SUCCESS (4.1 s)
[windows-jdk11-m3.5.x_build] [INFO] 
[windows-jdk11-m3.5.x_build] [INFO] --- maven-checkstyle-plugin:3.0.0:check (checkstyle-check) @ maven-deploy-plugin ---
[windows-jdk11-m3.5.x_build] [INFO] Downloading from central: https://repo.maven.apache.org/maven2/org/apache/maven/shared/maven-shared-resources/2/maven-shared-resources-2.pom
[windows-jdk11-m3.5.x_build] [INFO] Downloaded from central: https://repo.maven.apache.org/maven2/org/apache/maven/shared/maven-shared-resources/2/maven-shared-resources-2.pom (3.0 kB at 99 kB/s)
[windows-jdk11-m3.5.x_build] [INFO] Downloading from central: https://repo.maven.apache.org/maven2/org/codehaus/plexus/plexus-utils/3.0.10/plexus-utils-3.0.10.pom
[windows-jdk11-m3.5.x_build] [INFO] Downloaded from central: https://repo.maven.apache.org/maven2/org/codehaus/plexus/plexus-utils/3.0.10/plexus-utils-3.0.10.pom (3.1 kB at 108 kB/s)
[windows-jdk11-m3.5.x_build] [INFO] Downloading from central: https://repo.maven.apache.org/maven2/org/codehaus/plexus/plexus/3.3/plexus-3.3.pom
[windows-jdk11-m3.5.x_build] [INFO] Downloaded from central: https://repo.maven.apache.org/maven2/org/codehaus/plexus/plexus/3.3/plexus-3.3.pom (20 kB at 663 kB/s)
[windows-jdk11-m3.5.x_build] [INFO] Downloading from central: https://repo.maven.apache.org/maven2/org/apache/maven/doxia/doxia-integration-tools/1.6/doxia-integration-tools-1.6.pom
[windows-jdk11-m3.5.x_build] [INFO] Downloaded from central: https://repo.maven.apache.org/maven2/org/apache/maven/doxia/doxia-integration-tools/1.6/doxia-integration-tools-1.6.pom (7.0 kB at 248 kB/s)
[windows-jdk11-m3.5.x_build] [INFO] Downloading from central: https://repo.maven.apache.org/maven2/org/apache/maven/doxia/doxia-tools/3/doxia-tools-3.pom
[windows-jdk11-m3.5.x_build] [INFO] Downloaded from central: https://repo.maven.apache.org/maven2/org/apache/maven/doxia/doxia-tools/3/doxia-tools-3.pom (9.9 kB at 342 kB/s)
[windows-jdk11-m3.5.x_build] [INFO] Downloading from central: https://repo.maven.apache.org/maven2/org/codehaus/plexus/plexus-resources/1.1.0/plexus-resources-1.1.0.pom
[windows-jdk11-m3.5.x_build] [INFO] Downloaded from central: https://repo.maven.apache.org/maven2/org/codehaus/plexus/plexus-resources/1.1.0/plexus-resources-1.1.0.pom (3.2 kB at 106 kB/s)
[windows-jdk11-m3.5.x_build] [INFO] Downloading from central: https://repo.maven.apache.org/maven2/com/puppycrawl/tools/checkstyle/6.18/checkstyle-6.18.pom
[windows-jdk11-m3.5.x_build] [INFO] Downloaded from central: https://repo.maven.apache.org/maven2/com/puppycrawl/tools/checkstyle/6.18/checkstyle-6.18.pom (71 kB at 2.0 MB/s)
[windows-jdk11-m3.5.x_build] [INFO] Downloading from central: https://repo.maven.apache.org/maven2/antlr/antlr/2.7.7/antlr-2.7.7.pom
[windows-jdk11-m3.5.x_build] [INFO] Downloaded from central: https://repo.maven.apache.org/maven2/antlr/antlr/2.7.7/antlr-2.7.7.pom (632 B at 23 kB/s)
[windows-jdk11-m3.5.x_build] [INFO] Downloading from central: https://repo.maven.apache.org/maven2/org/antlr/antlr4-runtime/4.5.3/antlr4-runtime-4.5.3.pom
[windows-jdk11-m3.5.x_build] [INFO] Downloaded from central: https://repo.maven.apache.org/maven2/org/antlr/antlr4-runtime/4.5.3/antlr4-runtime-4.5.3.pom (2.3 kB at 75 kB/s)
[windows-jdk11-m3.5.x_build] [INFO] Downloading from central: https://repo.maven.apache.org/maven2/org/antlr/antlr4-master/4.5.3/antlr4-master-4.5.3.pom
[windows-jdk11-m3.5.x_build] [INFO] Downloaded from central: https://repo.maven.apache.org/maven2/org/antlr/antlr4-master/4.5.3/antlr4-master-4.5.3.pom (3.7 kB at 127 kB/s)
[windows-jdk11-m3.5.x_build] [INFO] Downloading from central: https://repo.maven.apache.org/maven2/commons-beanutils/commons-beanutils/1.9.2/commons-beanutils-1.9.2.pom
[windows-jdk11-m3.5.x_build] [INFO] Downloaded from central: https://repo.maven.apache.org/maven2/commons-beanutils/commons-beanutils/1.9.2/commons-beanutils-1.9.2.pom (14 kB at 493 kB/s)
[windows-jdk11-m3.5.x_build] [INFO] Downloading from central: https://repo.maven.apache.org/maven2/org/apache/commons/commons-parent/33/commons-parent-33.pom
[windows-jdk11-m3.5.x_build] [INFO] Downloaded from central: https://repo.maven.apache.org/maven2/org/apache/commons/commons-parent/33/commons-parent-33.pom (53 kB at 1.8 MB/s)
[windows-jdk11-m3.5.x_build] [INFO] Downloading from central: https://repo.maven.apache.org/maven2/commons-cli/commons-cli/1.3.1/commons-cli-1.3.1.pom
[windows-jdk11-m3.5.x_build] [INFO] Downloaded from central: https://repo.maven.apache.org/maven2/commons-cli/commons-cli/1.3.1/commons-cli-1.3.1.pom (10 kB at 358 kB/s)
[windows-jdk11-m3.5.x_build] [INFO] Downloading from central: https://repo.maven.apache.org/maven2/com/google/guava/guava/19.0/guava-19.0.pom
[windows-jdk11-m3.5.x_build] [INFO] Downloaded from central: https://repo.maven.apache.org/maven2/com/google/guava/guava/19.0/guava-19.0.pom (6.8 kB at 243 kB/s)
[windows-jdk11-m3.5.x_build] [INFO] Downloading from central: https://repo.maven.apache.org/maven2/com/google/guava/guava-parent/19.0/guava-parent-19.0.pom
[windows-jdk11-m3.5.x_build] [INFO] Downloaded from central: https://repo.maven.apache.org/maven2/com/google/guava/guava-parent/19.0/guava-parent-19.0.pom (9.9 kB at 341 kB/s)
[windows-jdk11-m3.5.x_build] [INFO] Downloading from central: https://repo.maven.apache.org/maven2/org/sonatype/oss/oss-parent/7/oss-parent-7.pom
[windows-jdk11-m3.5.x_build] [INFO] Downloaded from central: https://repo.maven.apache.org/maven2/org/sonatype/oss/oss-parent/7/oss-parent-7.pom (4.8 kB at 112 kB/s)
[windows-jdk11-m3.5.x_build] [INFO] Downloading from central: https://repo.maven.apache.org/maven2/javax/xml/bind/jaxb-api/2.3.0/jaxb-api-2.3.0.pom
[windows-jdk11-m3.5.x_build] [INFO] Downloaded from central: https://repo.maven.apache.org/maven2/javax/xml/bind/jaxb-api/2.3.0/jaxb-api-2.3.0.pom (23 kB at 489 kB/s)
[windows-jdk11-m3.5.x_build] [INFO] Downloading from central: https://repo.maven.apache.org/maven2/javax/xml/bind/jaxb-api-parent/2.3.0/jaxb-api-parent-2.3.0.pom
[windows-jdk11-m3.5.x_build] [INFO] Downloaded from central: https://repo.maven.apache.org/maven2/javax/xml/bind/jaxb-api-parent/2.3.0/jaxb-api-parent-2.3.0.pom (5.6 kB at 176 kB/s)
[windows-jdk11-m3.5.x_build] [INFO] Downloading from central: https://repo.maven.apache.org/maven2/net/java/jvnet-parent/5/jvnet-parent-5.pom
[windows-jdk11-m3.5.x_build] [INFO] Downloaded from central: https://repo.maven.apache.org/maven2/net/java/jvnet-parent/5/jvnet-parent-5.pom (8.9 kB at 317 kB/s)
[windows-jdk11-m3.5.x_build] [INFO] Downloading from central: https://repo.maven.apache.org/maven2/org/apache/maven/shared/maven-shared-resources/2/maven-shared-resources-2.jar
[windows-jdk11-m3.5.x_build] [INFO] Downloading from central: https://repo.maven.apache.org/maven2/org/apache/maven/doxia/doxia-core/1.2/doxia-core-1.2.jar
[windows-jdk11-m3.5.x_build] [INFO] Downloading from central: https://repo.maven.apache.org/maven2/commons-digester/commons-digester/1.6/commons-digester-1.6.jar
[windows-jdk11-m3.5.x_build] [INFO] Downloading from central: https://repo.maven.apache.org/maven2/org/apache/maven/doxia/doxia-integration-tools/1.6/doxia-integration-tools-1.6.jar
[windows-jdk11-m3.5.x_build] [INFO] Downloading from central: https://repo.maven.apache.org/maven2/commons-logging/commons-logging/1.0.4/commons-logging-1.0.4.jar
[windows-jdk11-m3.5.x_build] [INFO] Downloaded from central: https://repo.maven.apache.org/maven2/org/apache/maven/doxia/doxia-integration-tools/1.6/doxia-integration-tools-1.6.jar (45 kB at 558 kB/s)
[windows-jdk11-m3.5.x_build] [INFO] Downloading from central: https://repo.maven.apache.org/maven2/commons-io/commons-io/1.4/commons-io-1.4.jar
[windows-jdk11-m3.5.x_build] [INFO] Downloaded from central: https://repo.maven.apache.org/maven2/org/apache/maven/shared/maven-shared-resources/2/maven-shared-resources-2.jar (13 kB at 157 kB/s)
[windows-jdk11-m3.5.x_build] [INFO] Downloading from central: https://repo.maven.apache.org/maven2/org/codehaus/plexus/plexus-resources/1.1.0/plexus-resources-1.1.0.jar
[windows-jdk11-m3.5.x_build] [INFO] Downloaded from central: https://repo.maven.apache.org/maven2/commons-logging/commons-logging/1.0.4/commons-logging-1.0.4.jar (38 kB at 413 kB/s)
[windows-jdk11-m3.5.x_build] [INFO] Downloading from central: https://repo.maven.apache.org/maven2/com/puppycrawl/tools/checkstyle/6.18/checkstyle-6.18.jar
[windows-jdk11-m3.5.x_build] [INFO] Downloaded from central: https://repo.maven.apache.org/maven2/commons-digester/commons-digester/1.6/commons-digester-1.6.jar (168 kB at 1.7 MB/s)
[windows-jdk11-m3.5.x_build] [INFO] Downloading from central: https://repo.maven.apache.org/maven2/antlr/antlr/2.7.7/antlr-2.7.7.jar
[windows-jdk11-m3.5.x_build] [INFO] Downloaded from central: https://repo.maven.apache.org/maven2/org/apache/maven/doxia/doxia-core/1.2/doxia-core-1.2.jar (154 kB at 1.5 MB/s)
[windows-jdk11-m3.5.x_build] [INFO] Downloading from central: https://repo.maven.apache.org/maven2/org/antlr/antlr4-runtime/4.5.3/antlr4-runtime-4.5.3.jar
[windows-jdk11-m3.5.x_build] [INFO] Downloaded from central: https://repo.maven.apache.org/maven2/org/codehaus/plexus/plexus-resources/1.1.0/plexus-resources-1.1.0.jar (23 kB at 200 kB/s)
[windows-jdk11-m3.5.x_build] [INFO] Downloading from central: https://repo.maven.apache.org/maven2/commons-beanutils/commons-beanutils/1.9.2/commons-beanutils-1.9.2.jar
[windows-jdk11-m3.5.x_build] [INFO] Downloaded from central: https://repo.maven.apache.org/maven2/commons-io/commons-io/1.4/commons-io-1.4.jar (109 kB at 932 kB/s)
[windows-jdk11-m3.5.x_build] [INFO] Downloading from central: https://repo.maven.apache.org/maven2/commons-cli/commons-cli/1.3.1/commons-cli-1.3.1.jar
[windows-jdk11-m3.5.x_build] [INFO] Downloaded from central: https://repo.maven.apache.org/maven2/org/antlr/antlr4-runtime/4.5.3/antlr4-runtime-4.5.3.jar (302 kB at 2.1 MB/s)
[windows-jdk11-m3.5.x_build] [INFO] Downloading from central: https://repo.maven.apache.org/maven2/com/google/guava/guava/19.0/guava-19.0.jar
[windows-jdk11-m3.5.x_build] [INFO] Downloaded from central: https://repo.maven.apache.org/maven2/com/puppycrawl/tools/checkstyle/6.18/checkstyle-6.18.jar (1.2 MB at 7.6 MB/s)
[windows-jdk11-m3.5.x_build] [INFO] Downloading from central: https://repo.maven.apache.org/maven2/commons-lang/commons-lang/2.1/commons-lang-2.1.jar
[windows-jdk11-m3.5.x_build] [INFO] Downloaded from central: https://repo.maven.apache.org/maven2/commons-beanutils/commons-beanutils/1.9.2/commons-beanutils-1.9.2.jar (234 kB at 1.3 MB/s)
[windows-jdk11-m3.5.x_build] [INFO] Downloading from central: https://repo.maven.apache.org/maven2/javax/xml/bind/jaxb-api/2.3.0/jaxb-api-2.3.0.jar
[windows-jdk11-m3.5.x_build] [INFO] Downloaded from central: https://repo.maven.apache.org/maven2/commons-cli/commons-cli/1.3.1/commons-cli-1.3.1.jar (53 kB at 296 kB/s)
[windows-jdk11-m3.5.x_build] [INFO] Downloaded from central: https://repo.maven.apache.org/maven2/antlr/antlr/2.7.7/antlr-2.7.7.jar (445 kB at 2.4 MB/s)
[windows-jdk11-m3.5.x_build] [INFO] Downloaded from central: https://repo.maven.apache.org/maven2/commons-lang/commons-lang/2.1/commons-lang-2.1.jar (208 kB at 1.1 MB/s)
[windows-jdk11-m3.5.x_build] [INFO] Downloaded from central: https://repo.maven.apache.org/maven2/javax/xml/bind/jaxb-api/2.3.0/jaxb-api-2.3.0.jar (126 kB at 601 kB/s)
[windows-jdk11-m3.5.x_build] [INFO] Downloaded from central: https://repo.maven.apache.org/maven2/com/google/guava/guava/19.0/guava-19.0.jar (2.3 MB at 11 MB/s)
[windows-jdk11-m3.5.x_build] [INFO] There is 1 error reported by Checkstyle 6.18 with config/maven_checks.xml ruleset.
[windows-jdk11-m3.5.x_build] [INFO] Ignored 1 error, 0 violation remaining.
[windows-jdk11-m3.5.x_build] [INFO] 
[windows-jdk11-m3.5.x_build] [INFO] --- maven-invoker-plugin:3.1.0:verify (integration-test) @ maven-deploy-plugin ---
[windows-jdk11-m3.5.x_build] [INFO] -------------------------------------------------
[windows-jdk11-m3.5.x_build] [INFO] Build Summary:
[windows-jdk11-m3.5.x_build] [INFO]   Passed: 31, Failed: 0, Errors: 0, Skipped: 0
[windows-jdk11-m3.5.x_build] [INFO] -------------------------------------------------
[windows-jdk11-m3.5.x_build] [INFO] ------------------------------------------------------------------------
[windows-jdk11-m3.5.x_build] [INFO] BUILD SUCCESS
[windows-jdk11-m3.5.x_build] [INFO] ------------------------------------------------------------------------
[windows-jdk11-m3.5.x_build] [INFO] Total time: 04:05 min
[windows-jdk11-m3.5.x_build] [INFO] Finished at: 2018-12-29T16:25:41Z
[windows-jdk11-m3.5.x_build] [INFO] Final Memory: 47M/157M
[windows-jdk11-m3.5.x_build] [INFO] ------------------------------------------------------------------------
[windows-jdk11-m3.5.x_build] [INFO] [jenkins-event-spy] Generated F:\jenkins\jenkins-slave\workspace\n-deploy-plugin_MDEPLOY-244-NRDIDFJPPT5CRCOGNX2HJENIU3S3JTEAK6BPB47LFTUVZQGA3VKQ@2@tmp\withMavenb20c3a5f\maven-spy-20181229-162135-4112028575903835355770.log
[Pipeline] [windows-jdk11-m3.5.x_build] }
[Pipeline] [windows-jdk11-m3.5.x_build] // dir
[Pipeline] [windows-jdk11-m3.5.x_build] }
[windows-jdk11-m3.5.x_build] [withMaven] artifactsPublisher - Archive artifact windows-jdk11-m3.5.x_build\pom.xml under org\apache\maven\plugins\maven-deploy-plugin\3.0.0-M2-SNAPSHOT\maven-deploy-plugin-3.0.0-M2-SNAPSHOT.pom
[windows-jdk11-m3.5.x_build] [withMaven] artifactsPublisher - Archive artifact windows-jdk11-m3.5.x_build\target\maven-deploy-plugin-3.0.0-M2-SNAPSHOT.jar under org\apache\maven\plugins\maven-deploy-plugin\3.0.0-M2-SNAPSHOT\maven-deploy-plugin-3.0.0-M2-SNAPSHOT.jar
[windows-jdk11-m3.5.x_build] [withMaven] junitPublisher - Archive test results for Maven artifact org.apache.maven.plugins:maven-deploy-plugin:3.0.0-M2-SNAPSHOT generated by maven-surefire-plugin:test (default-test): windows-jdk11-m3.5.x_build\target\surefire-reports\*.xml
[windows-jdk11-m3.5.x_build] Recording test results
[windows-jdk11-m3.5.x_build] [withMaven] openTasksPublisher - Scan Tasks for Maven artifact org.apache.maven.plugins:maven-deploy-plugin:3.0.0-M2-SNAPSHOT in source directory windows-jdk11-m3.5.x_build\src\main\java
[windows-jdk11-m3.5.x_build] [TASKS] Scanning folder 'f:\jenkins\jenkins-slave\workspace\n-deploy-plugin_MDEPLOY-244-NRDIDFJPPT5CRCOGNX2HJENIU3S3JTEAK6BPB47LFTUVZQGA3VKQ@2' for files matching the pattern 'windows-jdk11-m3.5.x_build\src\main\java\**\*' - excludes: null
[windows-jdk11-m3.5.x_build] [TASKS] Found 3 files to scan for tasks
[windows-jdk11-m3.5.x_build] [TASKS] Found 0 open tasks.
[windows-jdk11-m3.5.x_build] Skipping warnings blame since pipelines do not have an SCM link.%n
[windows-jdk11-m3.5.x_build] [TASKS] Computing warning deltas based on reference build #4
[windows-jdk11-m3.5.x_build] [withMaven] invokerPublisher - Archive invoker results for Maven artifact MavenArtifact{org.apache.maven.plugins:maven-deploy-plugin::3.0.0-M2-SNAPSHOT(version: 3.0.0-M2-SNAPSHOT, snapshot:false) } generated by PluginInvocation{org.apache.maven.plugins:maven-invoker-plugin:3.1.0@integration-test  integration-test}: windows-jdk11-m3.5.x_build\target\invoker-reports\*.xml
[Pipeline] [windows-jdk11-m3.5.x_build] // withMaven
[Pipeline] [windows-jdk11-m3.5.x_build] cleanWs
[windows-jdk11-m3.5.x_build] [WS-CLEANUP] Deleting project workspace...Cannot delete workspace :remote file operation failed: f:\jenkins\jenkins-slave\workspace\n-deploy-plugin_MDEPLOY-244-NRDIDFJPPT5CRCOGNX2HJENIU3S3JTEAK6BPB47LFTUVZQGA3VKQ@2 at hudson.remoting.Channel@41afa848:JNLP4-connect connection from 37.48.69.226/37.48.69.226:49574: java.nio.file.AccessDeniedException: f:\jenkins\jenkins-slave\workspace\n-deploy-plugin_MDEPLOY-244-NRDIDFJPPT5CRCOGNX2HJENIU3S3JTEAK6BPB47LFTUVZQGA3VKQ@2 -> f:\jenkins\jenkins-slave\workspace\n-deploy-plugin_MDEPLOY-244-NRDIDFJPPT5CRCOGNX2HJENIU3S3JTEAK6BPB47LFTUVZQGA3VKQ@2_ws-cleanup_1546100751443
[Pipeline] [windows-jdk11-m3.5.x_build] }
[Pipeline] [windows-jdk11-m3.5.x_build] // stage
[Pipeline] [windows-jdk11-m3.5.x_build] }
[Pipeline] [windows-jdk11-m3.5.x_build] // ws
[Pipeline] [windows-jdk11-m3.5.x_build] }
[Pipeline] [windows-jdk11-m3.5.x_build] // node
[Pipeline] [windows-jdk11-m3.5.x_build] }
[windows-jdk11-m3.5.x_build] Failed in branch windows-jdk11-m3.5.x_build
[Pipeline] // parallel
[Pipeline] stage
[Pipeline] { (Notifications)
[Pipeline] echo
Build result: FAILURE
[Pipeline] jiraIssueSelector
[Pipeline] emailext

Build succeeded in Jenkins: Maven TLP » maven-deploy-plugin » MDEPLOY-244 #7

Posted by Apache Jenkins Server <je...@builds.apache.org>.
See https://builds.apache.org/job/maven-box/job/maven-deploy-plugin/job/MDEPLOY-244/7/

Changes:

* Disable cleanWs() due to issues with file handles on Windows
* added a link to asf-gitpubsub-jenkins-plugin
* fixed markup (asciidoc, not markdown...)

All tests passed

Build failed in Jenkins: Maven TLP » maven-deploy-plugin » MDEPLOY-244 #6

Posted by Apache Jenkins Server <je...@builds.apache.org>.
See https://builds.apache.org/job/maven-box/job/maven-deploy-plugin/job/MDEPLOY-244/6/

Changes:

* use a special local repo to have a bit of caching
* add mavenLinkerPublisher

All tests passed

Build log:
[...truncated 3046 lines...]
[INFO] run post-build script verify.bsh
[INFO]           release-pom\pom.xml .............................. SUCCESS (7.4 s)
[INFO] Building: skip\pom.xml
[INFO] run pre-build script setup.bsh
[INFO] run post-build script verify.bsh
[INFO]           release-pom\pom.xml .............................. SUCCESS (5.3 s)
[INFO] Building: skip\pom.xml
[INFO] run pre-build script setup.bsh
[INFO]           offline\pom.xml .................................. SUCCESS (10.2 s)
[INFO] Building: release-jar\pom.xml
[INFO] run pre-build script setup.bsh
[INFO] run post-build script verify.bsh
[INFO]           release-jar\pom.xml .............................. SUCCESS (5.0 s)
[INFO] Building: release-pom\pom.xml
[INFO] run pre-build script setup.bsh
[INFO]           skip\pom.xml ..................................... SUCCESS (5.0 s)
[INFO] Building: snapshot-jar\pom.xml
[INFO] run pre-build script setup.bsh
[INFO]           skip\pom.xml ..................................... SUCCESS (6.7 s)
[INFO] Building: snapshot-jar\pom.xml
[INFO] run pre-build script setup.bsh
[INFO] run post-build script verify.bsh
[INFO]           release-pom\pom.xml .............................. SUCCESS (4.3 s)
[INFO] Building: skip\pom.xml
[INFO] run pre-build script setup.bsh
[INFO]           skip\pom.xml ..................................... SUCCESS (13.1 s)
[INFO] Building: snapshot-jar\pom.xml
[INFO] run pre-build script setup.bsh
[INFO] run post-build script verify.bsh
[INFO]           snapshot-jar\pom.xml ............................. SUCCESS (6.5 s)
[INFO] Building: snapshot-pom\pom.xml
[INFO] run pre-build script setup.bsh
[INFO]           skip\pom.xml ..................................... SUCCESS (4.8 s)
[INFO] Building: snapshot-jar\pom.xml
[INFO] run pre-build script setup.bsh
[INFO] run post-build script verify.bsh
[INFO]           snapshot-jar\pom.xml ............................. SUCCESS (8.2 s)
[INFO] Building: snapshot-pom\pom.xml
[INFO] run pre-build script setup.bsh
[INFO] run post-build script verify.bsh
[INFO]           snapshot-pom\pom.xml ............................. SUCCESS (5.1 s)
[INFO] 
[INFO] --- maven-checkstyle-plugin:3.0.0:check (checkstyle-check) @ maven-deploy-plugin ---
[INFO] run post-build script verify.bsh
[INFO]           snapshot-jar\pom.xml ............................. SUCCESS (5.3 s)
[INFO] Building: snapshot-pom\pom.xml
[INFO] run pre-build script setup.bsh
[INFO] There is 1 error reported by Checkstyle 6.18 with config/maven_checks.xml ruleset.
[INFO] Ignored 1 error, 0 violation remaining.
[INFO] 
[INFO] --- maven-invoker-plugin:3.1.0:verify (integration-test) @ maven-deploy-plugin ---
[INFO] -------------------------------------------------
[INFO] Build Summary:
[INFO]   Passed: 31, Failed: 0, Errors: 0, Skipped: 0
[INFO] -------------------------------------------------
[INFO] ------------------------------------------------------------------------
[INFO] BUILD SUCCESS
[INFO] ------------------------------------------------------------------------
[INFO] Total time: 04:28 min
[INFO] Finished at: 2019-01-02T22:47:05Z
[INFO] Final Memory: 50M/726M
[INFO] ------------------------------------------------------------------------
[INFO] [jenkins-event-spy] Generated F:\jenkins\jenkins-slave\workspace\_maven-deploy-plugin_MDEPLOY-244@2@tmp\withMavenf5d0b7fb\maven-spy-20190102-224236-8494586355412804558086.log
Picked up JAVA_TOOL_OPTIONS: -Dmaven.ext.class.path="f:\jenkins\jenkins-slave\workspace\_maven-deploy-plugin_MDEPLOY-244@2@tmp\withMavenf5d0b7fb\pipeline-maven-spy.jar" -Dorg.jenkinsci.plugins.pipeline.maven.reportsFolder="f:\jenkins\jenkins-slave\workspace\_maven-deploy-plugin_MDEPLOY-244@2@tmp\withMavenf5d0b7fb" 
[Pipeline] }
[Pipeline] // dir
[Pipeline] }
[withMaven] artifactsPublisher - Archive artifact windows-jdk8-m3.5.x_build\pom.xml under org\apache\maven\plugins\maven-deploy-plugin\3.0.0-M2-SNAPSHOT\maven-deploy-plugin-3.0.0-M2-SNAPSHOT.pom
[withMaven] artifactsPublisher - Archive artifact windows-jdk8-m3.5.x_build\target\maven-deploy-plugin-3.0.0-M2-SNAPSHOT.jar under org\apache\maven\plugins\maven-deploy-plugin\3.0.0-M2-SNAPSHOT\maven-deploy-plugin-3.0.0-M2-SNAPSHOT.jar
[withMaven] junitPublisher - Archive test results for Maven artifact org.apache.maven.plugins:maven-deploy-plugin:maven-plugin:3.0.0-M2-SNAPSHOT generated by maven-surefire-plugin:test (default-test): windows-jdk8-m3.5.x_build\target\surefire-reports\*.xml
Recording test results
[withMaven] openTasksPublisher - Scan Tasks for Maven artifact org.apache.maven.plugins:maven-deploy-plugin:maven-plugin:3.0.0-M2-SNAPSHOT in source directory windows-jdk8-m3.5.x_build\src\main\java
[TASKS] Scanning folder 'f:\jenkins\jenkins-slave\workspace\_maven-deploy-plugin_MDEPLOY-244@2' for files matching the pattern 'windows-jdk8-m3.5.x_build\src\main\java\**\*' - excludes: null
[TASKS] Found 3 files to scan for tasks
[TASKS] Found 0 open tasks.
Skipping warnings blame since pipelines do not have an SCM link.%n
[TASKS] Computing warning deltas based on reference build #4
[withMaven] invokerPublisher - Archive invoker results for Maven artifact MavenArtifact{org.apache.maven.plugins:maven-deploy-plugin:maven-plugin:3.0.0-M2-SNAPSHOT(version: 3.0.0-M2-SNAPSHOT, snapshot:false) } generated by PluginInvocation{org.apache.maven.plugins:maven-invoker-plugin:3.1.0@integration-test  integration-test}: windows-jdk8-m3.5.x_build\target\invoker-reports\*.xml
[INFO] run post-build script verify.bsh
[INFO]           snapshot-pom\pom.xml ............................. SUCCESS (8.2 s)
[INFO] 
[INFO] --- maven-checkstyle-plugin:3.0.0:check (checkstyle-check) @ maven-deploy-plugin ---
[INFO] run post-build script verify.bsh
[INFO]           snapshot-pom\pom.xml ............................. SUCCESS (4.5 s)
[INFO] 
[INFO] --- maven-checkstyle-plugin:3.0.0:check (checkstyle-check) @ maven-deploy-plugin ---
[INFO] There is 1 error reported by Checkstyle 6.18 with config/maven_checks.xml ruleset.
[INFO] Ignored 1 error, 0 violation remaining.
[INFO] 
[INFO] --- maven-invoker-plugin:3.1.0:verify (integration-test) @ maven-deploy-plugin ---
[INFO] -------------------------------------------------
[INFO] Build Summary:
[INFO]   Passed: 31, Failed: 0, Errors: 0, Skipped: 0
[INFO] -------------------------------------------------
[INFO] ------------------------------------------------------------------------
[INFO] BUILD SUCCESS
[INFO] ------------------------------------------------------------------------
[INFO] Total time: 04:03 min
[INFO] Finished at: 2019-01-02T22:47:11Z
[INFO] Final Memory: 43M/154M
[INFO] ------------------------------------------------------------------------
[INFO] [jenkins-event-spy] Generated F:\jenkins\jenkins-slave\workspace\_maven-deploy-plugin_MDEPLOY-244@3@2@tmp\withMaven9966d723\maven-spy-20190102-224306-8663192065469371967303.log
[Pipeline] }
[Pipeline] // dir
[Pipeline] }
[withMaven] artifactsPublisher - Archive artifact windows-jdk11-m3.5.x_build\pom.xml under org\apache\maven\plugins\maven-deploy-plugin\3.0.0-M2-SNAPSHOT\maven-deploy-plugin-3.0.0-M2-SNAPSHOT.pom
[withMaven] artifactsPublisher - Archive artifact windows-jdk11-m3.5.x_build\target\maven-deploy-plugin-3.0.0-M2-SNAPSHOT.jar under org\apache\maven\plugins\maven-deploy-plugin\3.0.0-M2-SNAPSHOT\maven-deploy-plugin-3.0.0-M2-SNAPSHOT.jar
[withMaven] junitPublisher - Archive test results for Maven artifact org.apache.maven.plugins:maven-deploy-plugin:maven-plugin:3.0.0-M2-SNAPSHOT generated by maven-surefire-plugin:test (default-test): windows-jdk11-m3.5.x_build\target\surefire-reports\*.xml
Recording test results
[withMaven] openTasksPublisher - Scan Tasks for Maven artifact org.apache.maven.plugins:maven-deploy-plugin:maven-plugin:3.0.0-M2-SNAPSHOT in source directory windows-jdk11-m3.5.x_build\src\main\java
[TASKS] Scanning folder 'f:\jenkins\jenkins-slave\workspace\_maven-deploy-plugin_MDEPLOY-244@3@2' for files matching the pattern 'windows-jdk11-m3.5.x_build\src\main\java\**\*' - excludes: null
[TASKS] Found 3 files to scan for tasks
[TASKS] Found 0 open tasks.
Skipping warnings blame since pipelines do not have an SCM link.%n
[TASKS] Computing warning deltas based on reference build #4
[withMaven] invokerPublisher - Archive invoker results for Maven artifact MavenArtifact{org.apache.maven.plugins:maven-deploy-plugin:maven-plugin:3.0.0-M2-SNAPSHOT(version: 3.0.0-M2-SNAPSHOT, snapshot:false) } generated by PluginInvocation{org.apache.maven.plugins:maven-invoker-plugin:3.1.0@integration-test  integration-test}: windows-jdk11-m3.5.x_build\target\invoker-reports\*.xml
[INFO] There is 1 error reported by Checkstyle 6.18 with config/maven_checks.xml ruleset.
[INFO] Ignored 1 error, 0 violation remaining.
[INFO] 
[INFO] --- maven-invoker-plugin:3.1.0:verify (integration-test) @ maven-deploy-plugin ---
[INFO] -------------------------------------------------
[INFO] Build Summary:
[INFO]   Passed: 31, Failed: 0, Errors: 0, Skipped: 0
[INFO] -------------------------------------------------
[INFO] ------------------------------------------------------------------------
[INFO] BUILD SUCCESS
[INFO] ------------------------------------------------------------------------
[INFO] Total time: 06:32 min
[INFO] Finished at: 2019-01-02T22:47:12Z
[INFO] Final Memory: 46M/641M
[INFO] ------------------------------------------------------------------------
[INFO] [jenkins-event-spy] Generated F:\jenkins\jenkins-slave\workspace\_maven-deploy-plugin_MDEPLOY-244@2@tmp\withMavenf5971c08\maven-spy-20190102-224039-117607226243341830323.log
Picked up JAVA_TOOL_OPTIONS: -Dmaven.ext.class.path="f:\jenkins\jenkins-slave\workspace\_maven-deploy-plugin_MDEPLOY-244@2@tmp\withMavenf5971c08\pipeline-maven-spy.jar" -Dorg.jenkinsci.plugins.pipeline.maven.reportsFolder="f:\jenkins\jenkins-slave\workspace\_maven-deploy-plugin_MDEPLOY-244@2@tmp\withMavenf5971c08" 
[Pipeline] }
[Pipeline] // dir
[Pipeline] }
[withMaven] Publishers: Generated Artifacts Publisher: 129 ms, Junit Publisher: 185 ms, Open Task Scanner Publisher: 61 ms, Invoker Publisher: 7133 ms, Pipeline Graph Publisher: 15 ms
[Pipeline] // withMaven
[withMaven] artifactsPublisher - Archive artifact windows-jdk7-m3.5.x_build\pom.xml under org\apache\maven\plugins\maven-deploy-plugin\3.0.0-M2-SNAPSHOT\maven-deploy-plugin-3.0.0-M2-SNAPSHOT.pom
[Pipeline] cleanWs
[withMaven] artifactsPublisher - Archive artifact windows-jdk7-m3.5.x_build\target\maven-deploy-plugin-3.0.0-M2-SNAPSHOT.jar under org\apache\maven\plugins\maven-deploy-plugin\3.0.0-M2-SNAPSHOT\maven-deploy-plugin-3.0.0-M2-SNAPSHOT.jar
[WS-CLEANUP] Deleting project workspace...
[WS-CLEANUP] Deferred wipeout is used...
[withMaven] junitPublisher - Archive test results for Maven artifact org.apache.maven.plugins:maven-deploy-plugin:maven-plugin:3.0.0-M2-SNAPSHOT generated by maven-surefire-plugin:test (default-test): windows-jdk7-m3.5.x_build\target\surefire-reports\*.xml
Recording test results
ERROR: Cannot delete workspace :f:\jenkins\jenkins-slave\workspace\_maven-deploy-plugin_MDEPLOY-244@2\windows-jdk8-m3.5.x_build\target\invoker-reports\BUILD-3rd-party-jar-with-extras.xml
[Pipeline] }
[Pipeline] // stage
[withMaven] openTasksPublisher - Scan Tasks for Maven artifact org.apache.maven.plugins:maven-deploy-plugin:maven-plugin:3.0.0-M2-SNAPSHOT in source directory windows-jdk7-m3.5.x_build\src\main\java
[Pipeline] }
[TASKS] Scanning folder 'f:\jenkins\jenkins-slave\workspace\_maven-deploy-plugin_MDEPLOY-244@2' for files matching the pattern 'windows-jdk7-m3.5.x_build\src\main\java\**\*' - excludes: null
[TASKS] Found 3 files to scan for tasks
[TASKS] Found 0 open tasks.
Skipping warnings blame since pipelines do not have an SCM link.%n
[Pipeline] // ws
[Pipeline] }
[TASKS] Computing warning deltas based on reference build #4
[Pipeline] // node
[withMaven] invokerPublisher - Archive invoker results for Maven artifact MavenArtifact{org.apache.maven.plugins:maven-deploy-plugin:maven-plugin:3.0.0-M2-SNAPSHOT(version: 3.0.0-M2-SNAPSHOT, snapshot:false) } generated by PluginInvocation{org.apache.maven.plugins:maven-invoker-plugin:3.1.0@integration-test  integration-test}: windows-jdk7-m3.5.x_build\target\invoker-reports\*.xml
[Pipeline] }
Failed in branch windows-jdk8-m3.5.x_build
[withMaven] Publishers: Generated Artifacts Publisher: 120 ms, Junit Publisher: 183 ms, Open Task Scanner Publisher: 50 ms, Invoker Publisher: 6623 ms
[Pipeline] // withMaven
[Pipeline] cleanWs
[WS-CLEANUP] Deleting project workspace...
[WS-CLEANUP] Deferred wipeout is used...
ERROR: Cannot delete workspace :f:\jenkins\jenkins-slave\workspace\_maven-deploy-plugin_MDEPLOY-244@3@2\windows-jdk11-m3.5.x_build\target\invoker-reports\BUILD-3rd-party-jar-with-extras.xml
[Pipeline] }
[Pipeline] // stage
[Pipeline] }
[Pipeline] // ws
[Pipeline] }
[Pipeline] // node
[Pipeline] }
Failed in branch windows-jdk11-m3.5.x_build
[withMaven] Publishers: Generated Artifacts Publisher: 150 ms, Junit Publisher: 324 ms, Open Task Scanner Publisher: 71 ms, Invoker Publisher: 8042 ms, Pipeline Graph Publisher: 1 ms
[Pipeline] // withMaven
[Pipeline] cleanWs
[WS-CLEANUP] Deleting project workspace...
[WS-CLEANUP] Deferred wipeout is used...
ERROR: Cannot delete workspace :f:\jenkins\jenkins-slave\workspace\_maven-deploy-plugin_MDEPLOY-244@2\windows-jdk7-m3.5.x_build\target\invoker-reports\BUILD-3rd-party-jar-with-extras.xml
[Pipeline] }
[Pipeline] // stage
[Pipeline] }
[Pipeline] // ws
[Pipeline] }
[Pipeline] // node
[Pipeline] }
Failed in branch windows-jdk7-m3.5.x_build
[INFO] run post-build script verify.bsh
[INFO]           snapshot-jar\pom.xml ............................. SUCCESS (25.4 s)
[INFO] Building: snapshot-pom\pom.xml
[INFO] run pre-build script setup.bsh
[INFO] run post-build script verify.bsh
[INFO]           snapshot-pom\pom.xml ............................. SUCCESS (13.4 s)
[INFO] 
[INFO] --- maven-checkstyle-plugin:3.0.0:check (checkstyle-check) @ maven-deploy-plugin ---
[INFO] There is 1 error reported by Checkstyle 6.18 with config/maven_checks.xml ruleset.
[INFO] Ignored 1 error, 0 violation remaining.
[INFO] 
[INFO] --- maven-invoker-plugin:3.1.0:verify (integration-test) @ maven-deploy-plugin ---
[INFO] -------------------------------------------------
[INFO] Build Summary:
[INFO]   Passed: 31, Failed: 0, Errors: 0, Skipped: 0
[INFO] -------------------------------------------------
[INFO] ------------------------------------------------------------------------
[INFO] BUILD SUCCESS
[INFO] ------------------------------------------------------------------------
[INFO] Total time: 07:33 min
[INFO] Finished at: 2019-01-02T22:47:42+00:00
[INFO] Final Memory: 44M/553M
[INFO] ------------------------------------------------------------------------
[INFO] [jenkins-event-spy] Generated F:\jenkins\jenkins-slave\workspace\_maven-deploy-plugin_MDEPLOY-244@2@tmp\withMavendd6a641f\maven-spy-20190102-224008-9696890371778813880926.log
Picked up JAVA_TOOL_OPTIONS: -Dmaven.ext.class.path="f:\jenkins\jenkins-slave\workspace\_maven-deploy-plugin_MDEPLOY-244@2@tmp\withMavendd6a641f\pipeline-maven-spy.jar" -Dorg.jenkinsci.plugins.pipeline.maven.reportsFolder="f:\jenkins\jenkins-slave\workspace\_maven-deploy-plugin_MDEPLOY-244@2@tmp\withMavendd6a641f" 
[Pipeline] }
[Pipeline] // dir
[Pipeline] }
[withMaven] artifactsPublisher - Archive artifact windows-jdk7-m3.3.x_build\pom.xml under org\apache\maven\plugins\maven-deploy-plugin\3.0.0-M2-SNAPSHOT\maven-deploy-plugin-3.0.0-M2-SNAPSHOT.pom
[withMaven] artifactsPublisher - Archive artifact windows-jdk7-m3.3.x_build\target\maven-deploy-plugin-3.0.0-M2-SNAPSHOT.jar under org\apache\maven\plugins\maven-deploy-plugin\3.0.0-M2-SNAPSHOT\maven-deploy-plugin-3.0.0-M2-SNAPSHOT.jar
[withMaven] junitPublisher - Archive test results for Maven artifact org.apache.maven.plugins:maven-deploy-plugin:maven-plugin:3.0.0-M2-SNAPSHOT generated by maven-surefire-plugin:test (default-test): windows-jdk7-m3.3.x_build\target\surefire-reports\*.xml
Recording test results
[withMaven] openTasksPublisher - Scan Tasks for Maven artifact org.apache.maven.plugins:maven-deploy-plugin:maven-plugin:3.0.0-M2-SNAPSHOT in source directory windows-jdk7-m3.3.x_build\src\main\java
[TASKS] Scanning folder 'f:\jenkins\jenkins-slave\workspace\_maven-deploy-plugin_MDEPLOY-244@2' for files matching the pattern 'windows-jdk7-m3.3.x_build\src\main\java\**\*' - excludes: null
[TASKS] Found 3 files to scan for tasks
[TASKS] Found 0 open tasks.
Skipping warnings blame since pipelines do not have an SCM link.%n
[TASKS] Computing warning deltas based on reference build #4
[withMaven] invokerPublisher - Archive invoker results for Maven artifact MavenArtifact{org.apache.maven.plugins:maven-deploy-plugin:maven-plugin:3.0.0-M2-SNAPSHOT(version: 3.0.0-M2-SNAPSHOT, snapshot:false) } generated by PluginInvocation{org.apache.maven.plugins:maven-invoker-plugin:3.1.0@integration-test  integration-test}: windows-jdk7-m3.3.x_build\target\invoker-reports\*.xml
[withMaven] Publishers: Generated Artifacts Publisher: 900 ms, Junit Publisher: 1748 ms, Open Task Scanner Publisher: 964 ms, Invoker Publisher: 40307 ms, Pipeline Graph Publisher: 1 ms
[Pipeline] // withMaven
[Pipeline] cleanWs
[WS-CLEANUP] Deleting project workspace...
[WS-CLEANUP] Deferred wipeout is used...
ERROR: Cannot delete workspace :f:\jenkins\jenkins-slave\workspace\_maven-deploy-plugin_MDEPLOY-244@2\windows-jdk7-m3.3.x_build\target\invoker-reports\BUILD-3rd-party-jar-with-extras.xml
[Pipeline] }
[Pipeline] // stage
[Pipeline] }
[Pipeline] // ws
[Pipeline] }
[Pipeline] // node
[Pipeline] }
Failed in branch windows-jdk7-m3.3.x_build
[Pipeline] // parallel
[Pipeline] stage
[Pipeline] { (Notifications)
[Pipeline] echo
Build result: FAILURE
[Pipeline] jiraIssueSelector
[Pipeline] emailext