You are viewing a plain text version of this content. The canonical link for it is here.
Posted to builds@solr.apache.org by Apache Jenkins Server <je...@builds.apache.org> on 2023/11/06 07:32:50 UTC
[JENKINS] Solr » Solr-check-9.4 - Build # 937 - Still Failing!
Build: https://ci-builds.apache.org/job/Solr/job/Solr-check-9.4/937/
All tests passed
Build Log:
[...truncated 1250 lines...]
# ERROR: IOException occurred when talking to server at: https://localhost:44435/solr/test/select
#
# org.apache.solr.client.solrj.SolrServerException: IOException occurred when talking to server at: https://localhost:44435/solr/test/select
# at org.apache.solr.client.solrj.impl.Http2SolrClient.request(Http2SolrClient.java:550)
# at org.apache.solr.client.solrj.SolrClient.request(SolrClient.java:1192)
# at org.apache.solr.cli.ApiTool.callGet(ApiTool.java:92)
# at org.apache.solr.cli.ApiTool.runImpl(ApiTool.java:64)
# at org.apache.solr.cli.ToolBase.runTool(ToolBase.java:52)
# at org.apache.solr.cli.SolrCLI.main(SolrCLI.java:153)
# Caused by: java.nio.channels.ClosedChannelException
# at org.eclipse.jetty.http2.HTTP2Session$StreamsState.onShutdown(HTTP2Session.java:1865)
# at org.eclipse.jetty.http2.HTTP2Session.onShutdown(HTTP2Session.java:1036)
# at org.eclipse.jetty.http2.HTTP2Connection$HTTP2Producer.produce(HTTP2Connection.java:385)
# at org.eclipse.jetty.util.thread.strategy.AdaptiveExecutionStrategy.produceTask(AdaptiveExecutionStrategy.java:455)
# at org.eclipse.jetty.util.thread.strategy.AdaptiveExecutionStrategy.tryProduce(AdaptiveExecutionStrategy.java:248)
# at org.eclipse.jetty.util.thread.strategy.AdaptiveExecutionStrategy.produce(AdaptiveExecutionStrategy.java:193)
# at org.eclipse.jetty.http2.HTTP2Connection.produce(HTTP2Connection.java:208)
# at org.eclipse.jetty.http2.client.HTTP2ClientConnectionFactory$HTTP2ClientConnection.succeeded(HTTP2ClientConnectionFactory.java:174)
# at org.eclipse.jetty.util.Callback$Nested.succeeded(Callback.java:392)
# at org.eclipse.jetty.util.CountingCallback.succeeded(CountingCallback.java:63)
# at org.eclipse.jetty.util.Callback$Nested.succeeded(Callback.java:392)
# at org.eclipse.jetty.http2.HTTP2Session$ControlEntry.succeeded(HTTP2Session.java:1377)
# at java.base/java.util.ArrayList.forEach(ArrayList.java:1541)
# at org.eclipse.jetty.http2.HTTP2Flusher.finish(HTTP2Flusher.java:323)
# at org.eclipse.jetty.http2.HTTP2Flusher.succeeded(HTTP2Flusher.java:315)
# at org.eclipse.jetty.io.WriteFlusher.write(WriteFlusher.java:291)
# at org.eclipse.jetty.io.WriteFlusher.write(WriteFlusher.java:254)
# at org.eclipse.jetty.io.AbstractEndPoint.write(AbstractEndPoint.java:386)
# at org.eclipse.jetty.http2.HTTP2Flusher.process(HTTP2Flusher.java:292)
# at org.eclipse.jetty.util.IteratingCallback.processing(IteratingCallback.java:243)
# at org.eclipse.jetty.util.IteratingCallback.iterate(IteratingCallback.java:224)
# at org.eclipse.jetty.http2.HTTP2Session.frame(HTTP2Session.java:821)
# at org.eclipse.jetty.http2.HTTP2Session.frames(HTTP2Session.java:793)
# at org.eclipse.jetty.http2.client.HTTP2ClientConnectionFactory$HTTP2ClientConnection.onOpen(HTTP2ClientConnectionFactory.java:161)
# at org.eclipse.jetty.io.AbstractEndPoint.upgrade(AbstractEndPoint.java:451)
# at org.eclipse.jetty.io.NegotiatingClientConnection.replaceConnection(NegotiatingClientConnection.java:117)
# at org.eclipse.jetty.io.NegotiatingClientConnection.onFillable(NegotiatingClientConnection.java:87)
# at org.eclipse.jetty.io.AbstractConnection$ReadCallback.succeeded(AbstractConnection.java:314)
# at org.eclipse.jetty.io.FillInterest.fillable(FillInterest.java:100)
# at org.eclipse.jetty.io.ssl.SslConnection$DecryptedEndPoint.onFillable(SslConnection.java:558)
# at org.eclipse.jetty.io.ssl.SslConnection.onFillable(SslConnection.java:379)
# at org.eclipse.jetty.io.ssl.SslConnection$2.succeeded(SslConnection.java:146)
# at org.eclipse.jetty.io.FillInterest.fillable(FillInterest.java:100)
# at org.eclipse.jetty.io.SelectableChannelEndPoint$1.run(SelectableChannelEndPoint.java:53)
# at org.apache.solr.common.util.ExecutorUtil$MDCAwareThreadPoolExecutor.lambda$execute$0(ExecutorUtil.java:294)
# at java.base/java.util.concurrent.ThreadPoolExecutor.runWorker(ThreadPoolExecutor.java:1128)
# at java.base/java.util.concurrent.ThreadPoolExecutor$Worker.run(ThreadPoolExecutor.java:628)
# at java.base/java.lang.Thread.run(Thread.java:829)
# --
#
# Please find the SOLR_HOME snapshot for failed test #5 at: /home/jenkins/jenkins-slave/workspace/Solr/Solr-check-9.4/solr/packaging/build/test-output/failure-snapshots/62-5
# Last output:
# INFO - 2023-11-06 07:30:41.226; org.apache.solr.util.configuration.SSLConfigurations; Setting javax.net.ssl.keyStorePassword
# INFO - 2023-11-06 07:30:41.231; org.apache.solr.util.configuration.SSLConfigurations; Setting javax.net.ssl.trustStorePassword
# WARN - 2023-11-06 07:30:42.154; org.apache.solr.common.cloud.SolrZkClient; Using default ZkCredentialsInjector. ZkCredentialsInjector is not secure, it creates an empty list of credentials which leads to 'OPEN_ACL_UNSAFE' ACLs to Zookeeper nodes
# WARN - 2023-11-06 07:30:42.195; org.apache.solr.common.cloud.SolrZkClient; Using default ZkACLProvider. DefaultZkACLProvider is not secure, it creates 'OPEN_ACL_UNSAFE' ACLs to Zookeeper nodes
ok 63 start solr with mTLS wanted in 50657ms
ok 64 SOLR-11740 check 'solr stop' connection in 14598ms
ok 65 stop command for single port in 17567ms
ok 66 status detects locally running solr in 7738ms
ok 67 status does not expose cli parameters to end user in 244ms
ok 68 listing out files in 2726ms
ok 69 copying files around in 6698ms
ok 70 upconfig in 3041ms
ok 71 zkcli.sh gets 'solrhome' from 'solr.home' system property in 1252ms
ok 72 zkcli.sh gets 'solrhome' from 'solrhome' command line option in 1242ms
ok 73 Cleanup in 1286ms
> Task :solr:packaging:integrationTests FAILED
FAILURE: Build failed with an exception.
* Where:
Build file '/home/jenkins/jenkins-slave/workspace/Solr/Solr-check-9.4/solr/packaging/build.gradle' line: 301
* What went wrong:
Execution failed for task ':solr:packaging:integrationTests'.
> Process 'command '/home/jenkins/jenkins-slave/workspace/Solr/Solr-check-9.4/.gradle/node/packaging/node_modules/bats/bin/bats'' finished with non-zero exit value 1
* Try:
> Run with --stacktrace option to get the stack trace.
> Run with --info or --debug option to get more log output.
* Get more help at https://help.gradle.org
Deprecated Gradle features were used in this build, making it incompatible with Gradle 8.0.
You can use '--warning-mode all' to show the individual deprecation warnings and determine if they come from your own scripts or plugins.
See https://docs.gradle.org/7.6/userguide/command_line_interface.html#sec:command_line_warnings
BUILD FAILED in 1h 2m 43s
672 actionable tasks: 672 executed
Publishing build scan...
https://ge.apache.org/s/j6frgqx5seth2
Build step 'Invoke Gradle script' changed build result to FAILURE
Build step 'Invoke Gradle script' marked build as failure
Archiving artifacts
Recording test results
[Checks API] No suitable checks publisher found.
Email was triggered for: Failure - Any
Sending email for trigger: Failure - Any
[JENKINS] Solr » Solr-check-9.4 - Build # 943 - Still Failing!
Posted by Apache Jenkins Server <je...@builds.apache.org>.
Build: https://ci-builds.apache.org/job/Solr/job/Solr-check-9.4/943/
1 tests failed.
FAILED: org.apache.solr.s3.S3IncrementalBackupTest.classMethod
Error Message:
java.lang.Exception: Suite timeout exceeded (>= 7200000 msec).
Stack Trace:
java.lang.Exception: Suite timeout exceeded (>= 7200000 msec).
at __randomizedtesting.SeedInfo.seed([FF351A2BAB1A30C1]:0)
Build Log:
[...truncated 1925 lines...]
# ERROR: IOException occurred when talking to server at: https://localhost:39881/solr/test/select
#
# org.apache.solr.client.solrj.SolrServerException: IOException occurred when talking to server at: https://localhost:39881/solr/test/select
# at org.apache.solr.client.solrj.impl.Http2SolrClient.request(Http2SolrClient.java:550)
# at org.apache.solr.client.solrj.SolrClient.request(SolrClient.java:1192)
# at org.apache.solr.cli.ApiTool.callGet(ApiTool.java:92)
# at org.apache.solr.cli.ApiTool.runImpl(ApiTool.java:64)
# at org.apache.solr.cli.ToolBase.runTool(ToolBase.java:52)
# at org.apache.solr.cli.SolrCLI.main(SolrCLI.java:153)
# Caused by: java.nio.channels.ClosedChannelException
# at org.eclipse.jetty.http2.HTTP2Session$StreamsState.onShutdown(HTTP2Session.java:1865)
# at org.eclipse.jetty.http2.HTTP2Session.onShutdown(HTTP2Session.java:1036)
# at org.eclipse.jetty.http2.HTTP2Connection$HTTP2Producer.produce(HTTP2Connection.java:385)
# at org.eclipse.jetty.util.thread.strategy.AdaptiveExecutionStrategy.produceTask(AdaptiveExecutionStrategy.java:455)
# at org.eclipse.jetty.util.thread.strategy.AdaptiveExecutionStrategy.tryProduce(AdaptiveExecutionStrategy.java:248)
# at org.eclipse.jetty.util.thread.strategy.AdaptiveExecutionStrategy.produce(AdaptiveExecutionStrategy.java:193)
# at org.eclipse.jetty.http2.HTTP2Connection.produce(HTTP2Connection.java:208)
# at org.eclipse.jetty.http2.client.HTTP2ClientConnectionFactory$HTTP2ClientConnection.succeeded(HTTP2ClientConnectionFactory.java:174)
# at org.eclipse.jetty.util.Callback$Nested.succeeded(Callback.java:392)
# at org.eclipse.jetty.util.CountingCallback.succeeded(CountingCallback.java:63)
# at org.eclipse.jetty.util.Callback$Nested.succeeded(Callback.java:392)
# at org.eclipse.jetty.http2.HTTP2Session$ControlEntry.succeeded(HTTP2Session.java:1377)
# at java.base/java.util.ArrayList.forEach(ArrayList.java:1541)
# at org.eclipse.jetty.http2.HTTP2Flusher.finish(HTTP2Flusher.java:323)
# at org.eclipse.jetty.http2.HTTP2Flusher.succeeded(HTTP2Flusher.java:315)
# at org.eclipse.jetty.io.WriteFlusher.write(WriteFlusher.java:291)
# at org.eclipse.jetty.io.WriteFlusher.write(WriteFlusher.java:254)
# at org.eclipse.jetty.io.AbstractEndPoint.write(AbstractEndPoint.java:386)
# at org.eclipse.jetty.http2.HTTP2Flusher.process(HTTP2Flusher.java:292)
# at org.eclipse.jetty.util.IteratingCallback.processing(IteratingCallback.java:243)
# at org.eclipse.jetty.util.IteratingCallback.iterate(IteratingCallback.java:224)
# at org.eclipse.jetty.http2.HTTP2Session.frame(HTTP2Session.java:821)
# at org.eclipse.jetty.http2.HTTP2Session.frames(HTTP2Session.java:793)
# at org.eclipse.jetty.http2.client.HTTP2ClientConnectionFactory$HTTP2ClientConnection.onOpen(HTTP2ClientConnectionFactory.java:161)
# at org.eclipse.jetty.io.AbstractEndPoint.upgrade(AbstractEndPoint.java:451)
# at org.eclipse.jetty.io.NegotiatingClientConnection.replaceConnection(NegotiatingClientConnection.java:117)
# at org.eclipse.jetty.io.NegotiatingClientConnection.onFillable(NegotiatingClientConnection.java:87)
# at org.eclipse.jetty.io.AbstractConnection$ReadCallback.succeeded(AbstractConnection.java:314)
# at org.eclipse.jetty.io.FillInterest.fillable(FillInterest.java:100)
# at org.eclipse.jetty.io.ssl.SslConnection$DecryptedEndPoint.onFillable(SslConnection.java:558)
# at org.eclipse.jetty.io.ssl.SslConnection.onFillable(SslConnection.java:379)
# at org.eclipse.jetty.io.ssl.SslConnection$2.succeeded(SslConnection.java:146)
# at org.eclipse.jetty.io.FillInterest.fillable(FillInterest.java:100)
# at org.eclipse.jetty.io.SelectableChannelEndPoint$1.run(SelectableChannelEndPoint.java:53)
# at org.apache.solr.common.util.ExecutorUtil$MDCAwareThreadPoolExecutor.lambda$execute$0(ExecutorUtil.java:294)
# at java.base/java.util.concurrent.ThreadPoolExecutor.runWorker(ThreadPoolExecutor.java:1128)
# at java.base/java.util.concurrent.ThreadPoolExecutor$Worker.run(ThreadPoolExecutor.java:628)
# at java.base/java.lang.Thread.run(Thread.java:829)
# --
#
# Please find the SOLR_HOME snapshot for failed test #5 at: /home/jenkins/jenkins-slave/workspace/Solr/Solr-check-9.4/solr/packaging/build/test-output/failure-snapshots/62-5
# Last output:
# INFO - 2023-11-07 00:47:17.678; org.apache.solr.util.configuration.SSLConfigurations; Setting javax.net.ssl.keyStorePassword
# INFO - 2023-11-07 00:47:17.683; org.apache.solr.util.configuration.SSLConfigurations; Setting javax.net.ssl.trustStorePassword
# WARN - 2023-11-07 00:47:18.597; org.apache.solr.common.cloud.SolrZkClient; Using default ZkCredentialsInjector. ZkCredentialsInjector is not secure, it creates an empty list of credentials which leads to 'OPEN_ACL_UNSAFE' ACLs to Zookeeper nodes
# WARN - 2023-11-07 00:47:18.637; org.apache.solr.common.cloud.SolrZkClient; Using default ZkACLProvider. DefaultZkACLProvider is not secure, it creates 'OPEN_ACL_UNSAFE' ACLs to Zookeeper nodes
ok 63 start solr with mTLS wanted in 49636ms
ok 64 SOLR-11740 check 'solr stop' connection in 14573ms
ok 65 stop command for single port in 17681ms
ok 66 status detects locally running solr in 7743ms
ok 67 status does not expose cli parameters to end user in 243ms
ok 68 listing out files in 3097ms
ok 69 copying files around in 6576ms
ok 70 upconfig in 2604ms
ok 71 zkcli.sh gets 'solrhome' from 'solr.home' system property in 1248ms
ok 72 zkcli.sh gets 'solrhome' from 'solrhome' command line option in 1252ms
ok 73 Cleanup in 1266ms
> Task :solr:packaging:integrationTests FAILED
ERROR: The following test(s) have failed:
- org.apache.solr.s3.S3IncrementalBackupTest.classMethod (:solr:modules:s3-repository)
Test output: /home/jenkins/jenkins-slave/workspace/Solr/Solr-check-9.4/solr/modules/s3-repository/build/test-results/test/outputs/OUTPUT-org.apache.solr.s3.S3IncrementalBackupTest.txt
Reproduce with: gradlew :solr:modules:s3-repository:test --tests "org.apache.solr.s3.S3IncrementalBackupTest.classMethod" -Ptests.jvms=4 -Ptests.haltonfailure=false "-Ptests.jvmargs=-XX:TieredStopAtLevel=1 -XX:+UseParallelGC -XX:ActiveProcessorCount=1 -XX:ReservedCodeCacheSize=120m" -Ptests.seed=FF351A2BAB1A30C1 -Ptests.multiplier=2 -Ptests.badapples=false -Ptests.file.encoding=ISO-8859-1
FAILURE: Build failed with an exception.
* Where:
Build file '/home/jenkins/jenkins-slave/workspace/Solr/Solr-check-9.4/solr/packaging/build.gradle' line: 301
* What went wrong:
Execution failed for task ':solr:packaging:integrationTests'.
> Process 'command '/home/jenkins/jenkins-slave/workspace/Solr/Solr-check-9.4/.gradle/node/packaging/node_modules/bats/bin/bats'' finished with non-zero exit value 1
* Try:
> Run with --stacktrace option to get the stack trace.
> Run with --info or --debug option to get more log output.
* Get more help at https://help.gradle.org
Deprecated Gradle features were used in this build, making it incompatible with Gradle 8.0.
You can use '--warning-mode all' to show the individual deprecation warnings and determine if they come from your own scripts or plugins.
See https://docs.gradle.org/7.6/userguide/command_line_interface.html#sec:command_line_warnings
BUILD FAILED in 3h 1m 54s
672 actionable tasks: 672 executed
Publishing build scan...
https://ge.apache.org/s/c7gs5bcekapdk
Build step 'Invoke Gradle script' changed build result to FAILURE
Build step 'Invoke Gradle script' marked build as failure
Archiving artifacts
Recording test results
[Checks API] No suitable checks publisher found.
Email was triggered for: Failure - Any
Sending email for trigger: Failure - Any
[JENKINS] Solr » Solr-check-9.4 - Build # 942 - Still Failing!
Posted by Apache Jenkins Server <je...@builds.apache.org>.
Build: https://ci-builds.apache.org/job/Solr/job/Solr-check-9.4/942/
All tests passed
Build Log:
[...truncated 1252 lines...]
# ERROR: IOException occurred when talking to server at: https://localhost:36047/solr/test/select
#
# org.apache.solr.client.solrj.SolrServerException: IOException occurred when talking to server at: https://localhost:36047/solr/test/select
# at org.apache.solr.client.solrj.impl.Http2SolrClient.request(Http2SolrClient.java:550)
# at org.apache.solr.client.solrj.SolrClient.request(SolrClient.java:1192)
# at org.apache.solr.cli.ApiTool.callGet(ApiTool.java:92)
# at org.apache.solr.cli.ApiTool.runImpl(ApiTool.java:64)
# at org.apache.solr.cli.ToolBase.runTool(ToolBase.java:52)
# at org.apache.solr.cli.SolrCLI.main(SolrCLI.java:153)
# Caused by: java.nio.channels.ClosedChannelException
# at org.eclipse.jetty.http2.HTTP2Session$StreamsState.onShutdown(HTTP2Session.java:1865)
# at org.eclipse.jetty.http2.HTTP2Session.onShutdown(HTTP2Session.java:1036)
# at org.eclipse.jetty.http2.HTTP2Connection$HTTP2Producer.produce(HTTP2Connection.java:385)
# at org.eclipse.jetty.util.thread.strategy.AdaptiveExecutionStrategy.produceTask(AdaptiveExecutionStrategy.java:455)
# at org.eclipse.jetty.util.thread.strategy.AdaptiveExecutionStrategy.tryProduce(AdaptiveExecutionStrategy.java:248)
# at org.eclipse.jetty.util.thread.strategy.AdaptiveExecutionStrategy.produce(AdaptiveExecutionStrategy.java:193)
# at org.eclipse.jetty.http2.HTTP2Connection.produce(HTTP2Connection.java:208)
# at org.eclipse.jetty.http2.client.HTTP2ClientConnectionFactory$HTTP2ClientConnection.succeeded(HTTP2ClientConnectionFactory.java:174)
# at org.eclipse.jetty.util.Callback$Nested.succeeded(Callback.java:392)
# at org.eclipse.jetty.util.CountingCallback.succeeded(CountingCallback.java:63)
# at org.eclipse.jetty.util.Callback$Nested.succeeded(Callback.java:392)
# at org.eclipse.jetty.http2.HTTP2Session$ControlEntry.succeeded(HTTP2Session.java:1377)
# at java.base/java.util.ArrayList.forEach(ArrayList.java:1541)
# at org.eclipse.jetty.http2.HTTP2Flusher.finish(HTTP2Flusher.java:323)
# at org.eclipse.jetty.http2.HTTP2Flusher.succeeded(HTTP2Flusher.java:315)
# at org.eclipse.jetty.io.WriteFlusher.write(WriteFlusher.java:291)
# at org.eclipse.jetty.io.WriteFlusher.write(WriteFlusher.java:254)
# at org.eclipse.jetty.io.AbstractEndPoint.write(AbstractEndPoint.java:386)
# at org.eclipse.jetty.http2.HTTP2Flusher.process(HTTP2Flusher.java:292)
# at org.eclipse.jetty.util.IteratingCallback.processing(IteratingCallback.java:243)
# at org.eclipse.jetty.util.IteratingCallback.iterate(IteratingCallback.java:224)
# at org.eclipse.jetty.http2.HTTP2Session.frame(HTTP2Session.java:821)
# at org.eclipse.jetty.http2.HTTP2Session.frames(HTTP2Session.java:793)
# at org.eclipse.jetty.http2.client.HTTP2ClientConnectionFactory$HTTP2ClientConnection.onOpen(HTTP2ClientConnectionFactory.java:161)
# at org.eclipse.jetty.io.AbstractEndPoint.upgrade(AbstractEndPoint.java:451)
# at org.eclipse.jetty.io.NegotiatingClientConnection.replaceConnection(NegotiatingClientConnection.java:117)
# at org.eclipse.jetty.io.NegotiatingClientConnection.onFillable(NegotiatingClientConnection.java:87)
# at org.eclipse.jetty.io.AbstractConnection$ReadCallback.succeeded(AbstractConnection.java:314)
# at org.eclipse.jetty.io.FillInterest.fillable(FillInterest.java:100)
# at org.eclipse.jetty.io.ssl.SslConnection$DecryptedEndPoint.onFillable(SslConnection.java:558)
# at org.eclipse.jetty.io.ssl.SslConnection.onFillable(SslConnection.java:379)
# at org.eclipse.jetty.io.ssl.SslConnection$2.succeeded(SslConnection.java:146)
# at org.eclipse.jetty.io.FillInterest.fillable(FillInterest.java:100)
# at org.eclipse.jetty.io.SelectableChannelEndPoint$1.run(SelectableChannelEndPoint.java:53)
# at org.apache.solr.common.util.ExecutorUtil$MDCAwareThreadPoolExecutor.lambda$execute$0(ExecutorUtil.java:294)
# at java.base/java.util.concurrent.ThreadPoolExecutor.runWorker(ThreadPoolExecutor.java:1128)
# at java.base/java.util.concurrent.ThreadPoolExecutor$Worker.run(ThreadPoolExecutor.java:628)
# at java.base/java.lang.Thread.run(Thread.java:829)
# --
#
# Please find the SOLR_HOME snapshot for failed test #5 at: /home/jenkins/jenkins-slave/workspace/Solr/Solr-check-9.4/solr/packaging/build/test-output/failure-snapshots/62-5
# Last output:
# INFO - 2023-11-06 20:30:49.187; org.apache.solr.util.configuration.SSLConfigurations; Setting javax.net.ssl.keyStorePassword
# INFO - 2023-11-06 20:30:49.192; org.apache.solr.util.configuration.SSLConfigurations; Setting javax.net.ssl.trustStorePassword
# WARN - 2023-11-06 20:30:50.120; org.apache.solr.common.cloud.SolrZkClient; Using default ZkCredentialsInjector. ZkCredentialsInjector is not secure, it creates an empty list of credentials which leads to 'OPEN_ACL_UNSAFE' ACLs to Zookeeper nodes
# WARN - 2023-11-06 20:30:50.160; org.apache.solr.common.cloud.SolrZkClient; Using default ZkACLProvider. DefaultZkACLProvider is not secure, it creates 'OPEN_ACL_UNSAFE' ACLs to Zookeeper nodes
ok 63 start solr with mTLS wanted in 48697ms
ok 64 SOLR-11740 check 'solr stop' connection in 14657ms
ok 65 stop command for single port in 17619ms
ok 66 status detects locally running solr in 7737ms
ok 67 status does not expose cli parameters to end user in 242ms
ok 68 listing out files in 2974ms
ok 69 copying files around in 6482ms
ok 70 upconfig in 2657ms
ok 71 zkcli.sh gets 'solrhome' from 'solr.home' system property in 1240ms
ok 72 zkcli.sh gets 'solrhome' from 'solrhome' command line option in 1256ms
ok 73 Cleanup in 1256ms
> Task :solr:packaging:integrationTests FAILED
FAILURE: Build failed with an exception.
* Where:
Build file '/home/jenkins/jenkins-slave/workspace/Solr/Solr-check-9.4/solr/packaging/build.gradle' line: 301
* What went wrong:
Execution failed for task ':solr:packaging:integrationTests'.
> Process 'command '/home/jenkins/jenkins-slave/workspace/Solr/Solr-check-9.4/.gradle/node/packaging/node_modules/bats/bin/bats'' finished with non-zero exit value 1
* Try:
> Run with --stacktrace option to get the stack trace.
> Run with --info or --debug option to get more log output.
* Get more help at https://help.gradle.org
Deprecated Gradle features were used in this build, making it incompatible with Gradle 8.0.
You can use '--warning-mode all' to show the individual deprecation warnings and determine if they come from your own scripts or plugins.
See https://docs.gradle.org/7.6/userguide/command_line_interface.html#sec:command_line_warnings
BUILD FAILED in 1h 3m 38s
672 actionable tasks: 672 executed
Publishing build scan...
https://ge.apache.org/s/5emeni5eztyww
Build step 'Invoke Gradle script' changed build result to FAILURE
Build step 'Invoke Gradle script' marked build as failure
Archiving artifacts
Recording test results
[Checks API] No suitable checks publisher found.
Email was triggered for: Failure - Any
Sending email for trigger: Failure - Any
[JENKINS] Solr » Solr-check-9.4 - Build # 941 - Still Failing!
Posted by Apache Jenkins Server <je...@builds.apache.org>.
Build: https://ci-builds.apache.org/job/Solr/job/Solr-check-9.4/941/
All tests passed
Build Log:
[...truncated 1248 lines...]
# ERROR: IOException occurred when talking to server at: https://localhost:44863/solr/test/select
#
# org.apache.solr.client.solrj.SolrServerException: IOException occurred when talking to server at: https://localhost:44863/solr/test/select
# at org.apache.solr.client.solrj.impl.Http2SolrClient.request(Http2SolrClient.java:550)
# at org.apache.solr.client.solrj.SolrClient.request(SolrClient.java:1192)
# at org.apache.solr.cli.ApiTool.callGet(ApiTool.java:92)
# at org.apache.solr.cli.ApiTool.runImpl(ApiTool.java:64)
# at org.apache.solr.cli.ToolBase.runTool(ToolBase.java:52)
# at org.apache.solr.cli.SolrCLI.main(SolrCLI.java:153)
# Caused by: java.nio.channels.ClosedChannelException
# at org.eclipse.jetty.http2.HTTP2Session$StreamsState.onShutdown(HTTP2Session.java:1865)
# at org.eclipse.jetty.http2.HTTP2Session.onShutdown(HTTP2Session.java:1036)
# at org.eclipse.jetty.http2.HTTP2Connection$HTTP2Producer.produce(HTTP2Connection.java:385)
# at org.eclipse.jetty.util.thread.strategy.AdaptiveExecutionStrategy.produceTask(AdaptiveExecutionStrategy.java:455)
# at org.eclipse.jetty.util.thread.strategy.AdaptiveExecutionStrategy.tryProduce(AdaptiveExecutionStrategy.java:248)
# at org.eclipse.jetty.util.thread.strategy.AdaptiveExecutionStrategy.produce(AdaptiveExecutionStrategy.java:193)
# at org.eclipse.jetty.http2.HTTP2Connection.produce(HTTP2Connection.java:208)
# at org.eclipse.jetty.http2.client.HTTP2ClientConnectionFactory$HTTP2ClientConnection.succeeded(HTTP2ClientConnectionFactory.java:174)
# at org.eclipse.jetty.util.Callback$Nested.succeeded(Callback.java:392)
# at org.eclipse.jetty.util.CountingCallback.succeeded(CountingCallback.java:63)
# at org.eclipse.jetty.util.Callback$Nested.succeeded(Callback.java:392)
# at org.eclipse.jetty.http2.HTTP2Session$ControlEntry.succeeded(HTTP2Session.java:1377)
# at java.base/java.util.ArrayList.forEach(ArrayList.java:1541)
# at org.eclipse.jetty.http2.HTTP2Flusher.finish(HTTP2Flusher.java:323)
# at org.eclipse.jetty.http2.HTTP2Flusher.succeeded(HTTP2Flusher.java:315)
# at org.eclipse.jetty.io.WriteFlusher.write(WriteFlusher.java:291)
# at org.eclipse.jetty.io.WriteFlusher.write(WriteFlusher.java:254)
# at org.eclipse.jetty.io.AbstractEndPoint.write(AbstractEndPoint.java:386)
# at org.eclipse.jetty.http2.HTTP2Flusher.process(HTTP2Flusher.java:292)
# at org.eclipse.jetty.util.IteratingCallback.processing(IteratingCallback.java:243)
# at org.eclipse.jetty.util.IteratingCallback.iterate(IteratingCallback.java:224)
# at org.eclipse.jetty.http2.HTTP2Session.frame(HTTP2Session.java:821)
# at org.eclipse.jetty.http2.HTTP2Session.frames(HTTP2Session.java:793)
# at org.eclipse.jetty.http2.client.HTTP2ClientConnectionFactory$HTTP2ClientConnection.onOpen(HTTP2ClientConnectionFactory.java:161)
# at org.eclipse.jetty.io.AbstractEndPoint.upgrade(AbstractEndPoint.java:451)
# at org.eclipse.jetty.io.NegotiatingClientConnection.replaceConnection(NegotiatingClientConnection.java:117)
# at org.eclipse.jetty.io.NegotiatingClientConnection.onFillable(NegotiatingClientConnection.java:87)
# at org.eclipse.jetty.io.AbstractConnection$ReadCallback.succeeded(AbstractConnection.java:314)
# at org.eclipse.jetty.io.FillInterest.fillable(FillInterest.java:100)
# at org.eclipse.jetty.io.ssl.SslConnection$DecryptedEndPoint.onFillable(SslConnection.java:558)
# at org.eclipse.jetty.io.ssl.SslConnection.onFillable(SslConnection.java:379)
# at org.eclipse.jetty.io.ssl.SslConnection$2.succeeded(SslConnection.java:146)
# at org.eclipse.jetty.io.FillInterest.fillable(FillInterest.java:100)
# at org.eclipse.jetty.io.SelectableChannelEndPoint$1.run(SelectableChannelEndPoint.java:53)
# at org.apache.solr.common.util.ExecutorUtil$MDCAwareThreadPoolExecutor.lambda$execute$0(ExecutorUtil.java:294)
# at java.base/java.util.concurrent.ThreadPoolExecutor.runWorker(ThreadPoolExecutor.java:1128)
# at java.base/java.util.concurrent.ThreadPoolExecutor$Worker.run(ThreadPoolExecutor.java:628)
# at java.base/java.lang.Thread.run(Thread.java:829)
# --
#
# Please find the SOLR_HOME snapshot for failed test #5 at: /home/jenkins/jenkins-slave/workspace/Solr/Solr-check-9.4/solr/packaging/build/test-output/failure-snapshots/62-5
# Last output:
# INFO - 2023-11-06 16:28:09.920; org.apache.solr.util.configuration.SSLConfigurations; Setting javax.net.ssl.keyStorePassword
# INFO - 2023-11-06 16:28:09.925; org.apache.solr.util.configuration.SSLConfigurations; Setting javax.net.ssl.trustStorePassword
# WARN - 2023-11-06 16:28:10.858; org.apache.solr.common.cloud.SolrZkClient; Using default ZkCredentialsInjector. ZkCredentialsInjector is not secure, it creates an empty list of credentials which leads to 'OPEN_ACL_UNSAFE' ACLs to Zookeeper nodes
# WARN - 2023-11-06 16:28:10.893; org.apache.solr.common.cloud.SolrZkClient; Using default ZkACLProvider. DefaultZkACLProvider is not secure, it creates 'OPEN_ACL_UNSAFE' ACLs to Zookeeper nodes
ok 63 start solr with mTLS wanted in 49511ms
ok 64 SOLR-11740 check 'solr stop' connection in 15183ms
ok 65 stop command for single port in 18260ms
ok 66 status detects locally running solr in 7860ms
ok 67 status does not expose cli parameters to end user in 254ms
ok 68 listing out files in 2946ms
ok 69 copying files around in 6777ms
ok 70 upconfig in 3044ms
ok 71 zkcli.sh gets 'solrhome' from 'solr.home' system property in 1244ms
ok 72 zkcli.sh gets 'solrhome' from 'solrhome' command line option in 1249ms
ok 73 Cleanup in 1262ms
> Task :solr:packaging:integrationTests FAILED
FAILURE: Build failed with an exception.
* Where:
Build file '/home/jenkins/jenkins-slave/workspace/Solr/Solr-check-9.4/solr/packaging/build.gradle' line: 301
* What went wrong:
Execution failed for task ':solr:packaging:integrationTests'.
> Process 'command '/home/jenkins/jenkins-slave/workspace/Solr/Solr-check-9.4/.gradle/node/packaging/node_modules/bats/bin/bats'' finished with non-zero exit value 1
* Try:
> Run with --stacktrace option to get the stack trace.
> Run with --info or --debug option to get more log output.
* Get more help at https://help.gradle.org
Deprecated Gradle features were used in this build, making it incompatible with Gradle 8.0.
You can use '--warning-mode all' to show the individual deprecation warnings and determine if they come from your own scripts or plugins.
See https://docs.gradle.org/7.6/userguide/command_line_interface.html#sec:command_line_warnings
BUILD FAILED in 1h 2m 20s
672 actionable tasks: 672 executed
Publishing build scan...
https://ge.apache.org/s/e5lnodnh74y36
Build step 'Invoke Gradle script' changed build result to FAILURE
Build step 'Invoke Gradle script' marked build as failure
Archiving artifacts
Recording test results
[Checks API] No suitable checks publisher found.
Email was triggered for: Failure - Any
Sending email for trigger: Failure - Any
[JENKINS] Solr » Solr-check-9.4 - Build # 940 - Still Failing!
Posted by Apache Jenkins Server <je...@builds.apache.org>.
Build: https://ci-builds.apache.org/job/Solr/job/Solr-check-9.4/940/
All tests passed
Build Log:
[...truncated 1246 lines...]
# ERROR: IOException occurred when talking to server at: https://localhost:42997/solr/test/select
#
# org.apache.solr.client.solrj.SolrServerException: IOException occurred when talking to server at: https://localhost:42997/solr/test/select
# at org.apache.solr.client.solrj.impl.Http2SolrClient.request(Http2SolrClient.java:550)
# at org.apache.solr.client.solrj.SolrClient.request(SolrClient.java:1192)
# at org.apache.solr.cli.ApiTool.callGet(ApiTool.java:92)
# at org.apache.solr.cli.ApiTool.runImpl(ApiTool.java:64)
# at org.apache.solr.cli.ToolBase.runTool(ToolBase.java:52)
# at org.apache.solr.cli.SolrCLI.main(SolrCLI.java:153)
# Caused by: java.nio.channels.ClosedChannelException
# at org.eclipse.jetty.http2.HTTP2Session$StreamsState.onShutdown(HTTP2Session.java:1865)
# at org.eclipse.jetty.http2.HTTP2Session.onShutdown(HTTP2Session.java:1036)
# at org.eclipse.jetty.http2.HTTP2Connection$HTTP2Producer.produce(HTTP2Connection.java:385)
# at org.eclipse.jetty.util.thread.strategy.AdaptiveExecutionStrategy.produceTask(AdaptiveExecutionStrategy.java:455)
# at org.eclipse.jetty.util.thread.strategy.AdaptiveExecutionStrategy.tryProduce(AdaptiveExecutionStrategy.java:248)
# at org.eclipse.jetty.util.thread.strategy.AdaptiveExecutionStrategy.produce(AdaptiveExecutionStrategy.java:193)
# at org.eclipse.jetty.http2.HTTP2Connection.produce(HTTP2Connection.java:208)
# at org.eclipse.jetty.http2.client.HTTP2ClientConnectionFactory$HTTP2ClientConnection.succeeded(HTTP2ClientConnectionFactory.java:174)
# at org.eclipse.jetty.util.Callback$Nested.succeeded(Callback.java:392)
# at org.eclipse.jetty.util.CountingCallback.succeeded(CountingCallback.java:63)
# at org.eclipse.jetty.util.Callback$Nested.succeeded(Callback.java:392)
# at org.eclipse.jetty.http2.HTTP2Session$ControlEntry.succeeded(HTTP2Session.java:1377)
# at java.base/java.util.ArrayList.forEach(ArrayList.java:1541)
# at org.eclipse.jetty.http2.HTTP2Flusher.finish(HTTP2Flusher.java:323)
# at org.eclipse.jetty.http2.HTTP2Flusher.succeeded(HTTP2Flusher.java:315)
# at org.eclipse.jetty.io.WriteFlusher.write(WriteFlusher.java:291)
# at org.eclipse.jetty.io.WriteFlusher.write(WriteFlusher.java:254)
# at org.eclipse.jetty.io.AbstractEndPoint.write(AbstractEndPoint.java:386)
# at org.eclipse.jetty.http2.HTTP2Flusher.process(HTTP2Flusher.java:292)
# at org.eclipse.jetty.util.IteratingCallback.processing(IteratingCallback.java:243)
# at org.eclipse.jetty.util.IteratingCallback.iterate(IteratingCallback.java:224)
# at org.eclipse.jetty.http2.HTTP2Session.frame(HTTP2Session.java:821)
# at org.eclipse.jetty.http2.HTTP2Session.frames(HTTP2Session.java:793)
# at org.eclipse.jetty.http2.client.HTTP2ClientConnectionFactory$HTTP2ClientConnection.onOpen(HTTP2ClientConnectionFactory.java:161)
# at org.eclipse.jetty.io.AbstractEndPoint.upgrade(AbstractEndPoint.java:451)
# at org.eclipse.jetty.io.NegotiatingClientConnection.replaceConnection(NegotiatingClientConnection.java:117)
# at org.eclipse.jetty.io.NegotiatingClientConnection.onFillable(NegotiatingClientConnection.java:87)
# at org.eclipse.jetty.io.AbstractConnection$ReadCallback.succeeded(AbstractConnection.java:314)
# at org.eclipse.jetty.io.FillInterest.fillable(FillInterest.java:100)
# at org.eclipse.jetty.io.ssl.SslConnection$DecryptedEndPoint.onFillable(SslConnection.java:558)
# at org.eclipse.jetty.io.ssl.SslConnection.onFillable(SslConnection.java:379)
# at org.eclipse.jetty.io.ssl.SslConnection$2.succeeded(SslConnection.java:146)
# at org.eclipse.jetty.io.FillInterest.fillable(FillInterest.java:100)
# at org.eclipse.jetty.io.SelectableChannelEndPoint$1.run(SelectableChannelEndPoint.java:53)
# at org.apache.solr.common.util.ExecutorUtil$MDCAwareThreadPoolExecutor.lambda$execute$0(ExecutorUtil.java:294)
# at java.base/java.util.concurrent.ThreadPoolExecutor.runWorker(ThreadPoolExecutor.java:1128)
# at java.base/java.util.concurrent.ThreadPoolExecutor$Worker.run(ThreadPoolExecutor.java:628)
# at java.base/java.lang.Thread.run(Thread.java:829)
# --
#
# Please find the SOLR_HOME snapshot for failed test #5 at: /home/jenkins/jenkins-slave/workspace/Solr/Solr-check-9.4/solr/packaging/build/test-output/failure-snapshots/62-5
# Last output:
# INFO - 2023-11-06 13:42:42.946; org.apache.solr.util.configuration.SSLConfigurations; Setting javax.net.ssl.keyStorePassword
# INFO - 2023-11-06 13:42:42.950; org.apache.solr.util.configuration.SSLConfigurations; Setting javax.net.ssl.trustStorePassword
# WARN - 2023-11-06 13:42:43.828; org.apache.solr.common.cloud.SolrZkClient; Using default ZkCredentialsInjector. ZkCredentialsInjector is not secure, it creates an empty list of credentials which leads to 'OPEN_ACL_UNSAFE' ACLs to Zookeeper nodes
# WARN - 2023-11-06 13:42:43.867; org.apache.solr.common.cloud.SolrZkClient; Using default ZkACLProvider. DefaultZkACLProvider is not secure, it creates 'OPEN_ACL_UNSAFE' ACLs to Zookeeper nodes
ok 63 start solr with mTLS wanted in 47788ms
ok 64 SOLR-11740 check 'solr stop' connection in 15183ms
ok 65 stop command for single port in 17988ms
ok 66 status detects locally running solr in 7701ms
ok 67 status does not expose cli parameters to end user in 239ms
ok 68 listing out files in 3036ms
ok 69 copying files around in 6504ms
ok 70 upconfig in 2606ms
ok 71 zkcli.sh gets 'solrhome' from 'solr.home' system property in 1246ms
ok 72 zkcli.sh gets 'solrhome' from 'solrhome' command line option in 1263ms
ok 73 Cleanup in 1270ms
> Task :solr:packaging:integrationTests FAILED
FAILURE: Build failed with an exception.
* Where:
Build file '/home/jenkins/jenkins-slave/workspace/Solr/Solr-check-9.4/solr/packaging/build.gradle' line: 301
* What went wrong:
Execution failed for task ':solr:packaging:integrationTests'.
> Process 'command '/home/jenkins/jenkins-slave/workspace/Solr/Solr-check-9.4/.gradle/node/packaging/node_modules/bats/bin/bats'' finished with non-zero exit value 1
* Try:
> Run with --stacktrace option to get the stack trace.
> Run with --info or --debug option to get more log output.
* Get more help at https://help.gradle.org
Deprecated Gradle features were used in this build, making it incompatible with Gradle 8.0.
You can use '--warning-mode all' to show the individual deprecation warnings and determine if they come from your own scripts or plugins.
See https://docs.gradle.org/7.6/userguide/command_line_interface.html#sec:command_line_warnings
BUILD FAILED in 1h 2m 47s
672 actionable tasks: 672 executed
Publishing build scan...
https://ge.apache.org/s/elaf3xvb7uebw
Build step 'Invoke Gradle script' changed build result to FAILURE
Build step 'Invoke Gradle script' marked build as failure
Archiving artifacts
Recording test results
[Checks API] No suitable checks publisher found.
Email was triggered for: Failure - Any
Sending email for trigger: Failure - Any
[JENKINS] Solr » Solr-check-9.4 - Build # 939 - Still Failing!
Posted by Apache Jenkins Server <je...@builds.apache.org>.
Build: https://ci-builds.apache.org/job/Solr/job/Solr-check-9.4/939/
All tests passed
Build Log:
[...truncated 1248 lines...]
# ERROR: IOException occurred when talking to server at: https://localhost:39243/solr/test/select
#
# org.apache.solr.client.solrj.SolrServerException: IOException occurred when talking to server at: https://localhost:39243/solr/test/select
# at org.apache.solr.client.solrj.impl.Http2SolrClient.request(Http2SolrClient.java:550)
# at org.apache.solr.client.solrj.SolrClient.request(SolrClient.java:1192)
# at org.apache.solr.cli.ApiTool.callGet(ApiTool.java:92)
# at org.apache.solr.cli.ApiTool.runImpl(ApiTool.java:64)
# at org.apache.solr.cli.ToolBase.runTool(ToolBase.java:52)
# at org.apache.solr.cli.SolrCLI.main(SolrCLI.java:153)
# Caused by: java.nio.channels.ClosedChannelException
# at org.eclipse.jetty.http2.HTTP2Session$StreamsState.onShutdown(HTTP2Session.java:1865)
# at org.eclipse.jetty.http2.HTTP2Session.onShutdown(HTTP2Session.java:1036)
# at org.eclipse.jetty.http2.HTTP2Connection$HTTP2Producer.produce(HTTP2Connection.java:385)
# at org.eclipse.jetty.util.thread.strategy.AdaptiveExecutionStrategy.produceTask(AdaptiveExecutionStrategy.java:455)
# at org.eclipse.jetty.util.thread.strategy.AdaptiveExecutionStrategy.tryProduce(AdaptiveExecutionStrategy.java:248)
# at org.eclipse.jetty.util.thread.strategy.AdaptiveExecutionStrategy.produce(AdaptiveExecutionStrategy.java:193)
# at org.eclipse.jetty.http2.HTTP2Connection.produce(HTTP2Connection.java:208)
# at org.eclipse.jetty.http2.client.HTTP2ClientConnectionFactory$HTTP2ClientConnection.succeeded(HTTP2ClientConnectionFactory.java:174)
# at org.eclipse.jetty.util.Callback$Nested.succeeded(Callback.java:392)
# at org.eclipse.jetty.util.CountingCallback.succeeded(CountingCallback.java:63)
# at org.eclipse.jetty.util.Callback$Nested.succeeded(Callback.java:392)
# at org.eclipse.jetty.http2.HTTP2Session$ControlEntry.succeeded(HTTP2Session.java:1377)
# at java.base/java.util.ArrayList.forEach(ArrayList.java:1541)
# at org.eclipse.jetty.http2.HTTP2Flusher.finish(HTTP2Flusher.java:323)
# at org.eclipse.jetty.http2.HTTP2Flusher.succeeded(HTTP2Flusher.java:315)
# at org.eclipse.jetty.io.WriteFlusher.write(WriteFlusher.java:291)
# at org.eclipse.jetty.io.WriteFlusher.write(WriteFlusher.java:254)
# at org.eclipse.jetty.io.AbstractEndPoint.write(AbstractEndPoint.java:386)
# at org.eclipse.jetty.http2.HTTP2Flusher.process(HTTP2Flusher.java:292)
# at org.eclipse.jetty.util.IteratingCallback.processing(IteratingCallback.java:243)
# at org.eclipse.jetty.util.IteratingCallback.iterate(IteratingCallback.java:224)
# at org.eclipse.jetty.http2.HTTP2Session.frame(HTTP2Session.java:821)
# at org.eclipse.jetty.http2.HTTP2Session.frames(HTTP2Session.java:793)
# at org.eclipse.jetty.http2.client.HTTP2ClientConnectionFactory$HTTP2ClientConnection.onOpen(HTTP2ClientConnectionFactory.java:161)
# at org.eclipse.jetty.io.AbstractEndPoint.upgrade(AbstractEndPoint.java:451)
# at org.eclipse.jetty.io.NegotiatingClientConnection.replaceConnection(NegotiatingClientConnection.java:117)
# at org.eclipse.jetty.io.NegotiatingClientConnection.onFillable(NegotiatingClientConnection.java:87)
# at org.eclipse.jetty.io.AbstractConnection$ReadCallback.succeeded(AbstractConnection.java:314)
# at org.eclipse.jetty.io.FillInterest.fillable(FillInterest.java:100)
# at org.eclipse.jetty.io.ssl.SslConnection$DecryptedEndPoint.onFillable(SslConnection.java:558)
# at org.eclipse.jetty.io.ssl.SslConnection.onFillable(SslConnection.java:379)
# at org.eclipse.jetty.io.ssl.SslConnection$2.succeeded(SslConnection.java:146)
# at org.eclipse.jetty.io.FillInterest.fillable(FillInterest.java:100)
# at org.eclipse.jetty.io.SelectableChannelEndPoint$1.run(SelectableChannelEndPoint.java:53)
# at org.apache.solr.common.util.ExecutorUtil$MDCAwareThreadPoolExecutor.lambda$execute$0(ExecutorUtil.java:294)
# at java.base/java.util.concurrent.ThreadPoolExecutor.runWorker(ThreadPoolExecutor.java:1128)
# at java.base/java.util.concurrent.ThreadPoolExecutor$Worker.run(ThreadPoolExecutor.java:628)
# at java.base/java.lang.Thread.run(Thread.java:829)
# --
#
# Please find the SOLR_HOME snapshot for failed test #5 at: /home/jenkins/jenkins-slave/workspace/Solr/Solr-check-9.4/solr/packaging/build/test-output/failure-snapshots/62-5
# Last output:
# INFO - 2023-11-06 12:02:15.820; org.apache.solr.util.configuration.SSLConfigurations; Setting javax.net.ssl.keyStorePassword
# INFO - 2023-11-06 12:02:15.824; org.apache.solr.util.configuration.SSLConfigurations; Setting javax.net.ssl.trustStorePassword
# WARN - 2023-11-06 12:02:16.705; org.apache.solr.common.cloud.SolrZkClient; Using default ZkCredentialsInjector. ZkCredentialsInjector is not secure, it creates an empty list of credentials which leads to 'OPEN_ACL_UNSAFE' ACLs to Zookeeper nodes
# WARN - 2023-11-06 12:02:16.747; org.apache.solr.common.cloud.SolrZkClient; Using default ZkACLProvider. DefaultZkACLProvider is not secure, it creates 'OPEN_ACL_UNSAFE' ACLs to Zookeeper nodes
ok 63 start solr with mTLS wanted in 47402ms
ok 64 SOLR-11740 check 'solr stop' connection in 14668ms
ok 65 stop command for single port in 17647ms
ok 66 status detects locally running solr in 7806ms
ok 67 status does not expose cli parameters to end user in 250ms
ok 68 listing out files in 2823ms
ok 69 copying files around in 6612ms
ok 70 upconfig in 2782ms
ok 71 zkcli.sh gets 'solrhome' from 'solr.home' system property in 1239ms
ok 72 zkcli.sh gets 'solrhome' from 'solrhome' command line option in 1231ms
ok 73 Cleanup in 1261ms
> Task :solr:packaging:integrationTests FAILED
FAILURE: Build failed with an exception.
* Where:
Build file '/home/jenkins/jenkins-slave/workspace/Solr/Solr-check-9.4/solr/packaging/build.gradle' line: 301
* What went wrong:
Execution failed for task ':solr:packaging:integrationTests'.
> Process 'command '/home/jenkins/jenkins-slave/workspace/Solr/Solr-check-9.4/.gradle/node/packaging/node_modules/bats/bin/bats'' finished with non-zero exit value 1
* Try:
> Run with --stacktrace option to get the stack trace.
> Run with --info or --debug option to get more log output.
* Get more help at https://help.gradle.org
Deprecated Gradle features were used in this build, making it incompatible with Gradle 8.0.
You can use '--warning-mode all' to show the individual deprecation warnings and determine if they come from your own scripts or plugins.
See https://docs.gradle.org/7.6/userguide/command_line_interface.html#sec:command_line_warnings
BUILD FAILED in 1h 1m 8s
672 actionable tasks: 672 executed
Publishing build scan...
https://ge.apache.org/s/oihjcogu3s5fk
Build step 'Invoke Gradle script' changed build result to FAILURE
Build step 'Invoke Gradle script' marked build as failure
Archiving artifacts
Recording test results
[Checks API] No suitable checks publisher found.
Email was triggered for: Failure - Any
Sending email for trigger: Failure - Any
[JENKINS] Solr » Solr-check-9.4 - Build # 938 - Still Failing!
Posted by Apache Jenkins Server <je...@builds.apache.org>.
Build: https://ci-builds.apache.org/job/Solr/job/Solr-check-9.4/938/
All tests passed
Build Log:
[...truncated 1247 lines...]
# ERROR: IOException occurred when talking to server at: https://localhost:35975/solr/test/select
#
# org.apache.solr.client.solrj.SolrServerException: IOException occurred when talking to server at: https://localhost:35975/solr/test/select
# at org.apache.solr.client.solrj.impl.Http2SolrClient.request(Http2SolrClient.java:550)
# at org.apache.solr.client.solrj.SolrClient.request(SolrClient.java:1192)
# at org.apache.solr.cli.ApiTool.callGet(ApiTool.java:92)
# at org.apache.solr.cli.ApiTool.runImpl(ApiTool.java:64)
# at org.apache.solr.cli.ToolBase.runTool(ToolBase.java:52)
# at org.apache.solr.cli.SolrCLI.main(SolrCLI.java:153)
# Caused by: java.nio.channels.ClosedChannelException
# at org.eclipse.jetty.http2.HTTP2Session$StreamsState.onShutdown(HTTP2Session.java:1865)
# at org.eclipse.jetty.http2.HTTP2Session.onShutdown(HTTP2Session.java:1036)
# at org.eclipse.jetty.http2.HTTP2Connection$HTTP2Producer.produce(HTTP2Connection.java:385)
# at org.eclipse.jetty.util.thread.strategy.AdaptiveExecutionStrategy.produceTask(AdaptiveExecutionStrategy.java:455)
# at org.eclipse.jetty.util.thread.strategy.AdaptiveExecutionStrategy.tryProduce(AdaptiveExecutionStrategy.java:248)
# at org.eclipse.jetty.util.thread.strategy.AdaptiveExecutionStrategy.produce(AdaptiveExecutionStrategy.java:193)
# at org.eclipse.jetty.http2.HTTP2Connection.produce(HTTP2Connection.java:208)
# at org.eclipse.jetty.http2.client.HTTP2ClientConnectionFactory$HTTP2ClientConnection.succeeded(HTTP2ClientConnectionFactory.java:174)
# at org.eclipse.jetty.util.Callback$Nested.succeeded(Callback.java:392)
# at org.eclipse.jetty.util.CountingCallback.succeeded(CountingCallback.java:63)
# at org.eclipse.jetty.util.Callback$Nested.succeeded(Callback.java:392)
# at org.eclipse.jetty.http2.HTTP2Session$ControlEntry.succeeded(HTTP2Session.java:1377)
# at java.base/java.util.ArrayList.forEach(ArrayList.java:1541)
# at org.eclipse.jetty.http2.HTTP2Flusher.finish(HTTP2Flusher.java:323)
# at org.eclipse.jetty.http2.HTTP2Flusher.succeeded(HTTP2Flusher.java:315)
# at org.eclipse.jetty.io.WriteFlusher.write(WriteFlusher.java:291)
# at org.eclipse.jetty.io.WriteFlusher.write(WriteFlusher.java:254)
# at org.eclipse.jetty.io.AbstractEndPoint.write(AbstractEndPoint.java:386)
# at org.eclipse.jetty.http2.HTTP2Flusher.process(HTTP2Flusher.java:292)
# at org.eclipse.jetty.util.IteratingCallback.processing(IteratingCallback.java:243)
# at org.eclipse.jetty.util.IteratingCallback.iterate(IteratingCallback.java:224)
# at org.eclipse.jetty.http2.HTTP2Session.frame(HTTP2Session.java:821)
# at org.eclipse.jetty.http2.HTTP2Session.frames(HTTP2Session.java:793)
# at org.eclipse.jetty.http2.client.HTTP2ClientConnectionFactory$HTTP2ClientConnection.onOpen(HTTP2ClientConnectionFactory.java:161)
# at org.eclipse.jetty.io.AbstractEndPoint.upgrade(AbstractEndPoint.java:451)
# at org.eclipse.jetty.io.NegotiatingClientConnection.replaceConnection(NegotiatingClientConnection.java:117)
# at org.eclipse.jetty.io.NegotiatingClientConnection.onFillable(NegotiatingClientConnection.java:87)
# at org.eclipse.jetty.io.AbstractConnection$ReadCallback.succeeded(AbstractConnection.java:314)
# at org.eclipse.jetty.io.FillInterest.fillable(FillInterest.java:100)
# at org.eclipse.jetty.io.ssl.SslConnection$DecryptedEndPoint.onFillable(SslConnection.java:558)
# at org.eclipse.jetty.io.ssl.SslConnection.onFillable(SslConnection.java:379)
# at org.eclipse.jetty.io.ssl.SslConnection$2.succeeded(SslConnection.java:146)
# at org.eclipse.jetty.io.FillInterest.fillable(FillInterest.java:100)
# at org.eclipse.jetty.io.SelectableChannelEndPoint$1.run(SelectableChannelEndPoint.java:53)
# at org.apache.solr.common.util.ExecutorUtil$MDCAwareThreadPoolExecutor.lambda$execute$0(ExecutorUtil.java:294)
# at java.base/java.util.concurrent.ThreadPoolExecutor.runWorker(ThreadPoolExecutor.java:1128)
# at java.base/java.util.concurrent.ThreadPoolExecutor$Worker.run(ThreadPoolExecutor.java:628)
# at java.base/java.lang.Thread.run(Thread.java:829)
# --
#
# Please find the SOLR_HOME snapshot for failed test #5 at: /home/jenkins/jenkins-slave/workspace/Solr/Solr-check-9.4/solr/packaging/build/test-output/failure-snapshots/62-5
# Last output:
# INFO - 2023-11-06 09:45:07.832; org.apache.solr.util.configuration.SSLConfigurations; Setting javax.net.ssl.keyStorePassword
# INFO - 2023-11-06 09:45:07.836; org.apache.solr.util.configuration.SSLConfigurations; Setting javax.net.ssl.trustStorePassword
# WARN - 2023-11-06 09:45:08.730; org.apache.solr.common.cloud.SolrZkClient; Using default ZkCredentialsInjector. ZkCredentialsInjector is not secure, it creates an empty list of credentials which leads to 'OPEN_ACL_UNSAFE' ACLs to Zookeeper nodes
# WARN - 2023-11-06 09:45:08.769; org.apache.solr.common.cloud.SolrZkClient; Using default ZkACLProvider. DefaultZkACLProvider is not secure, it creates 'OPEN_ACL_UNSAFE' ACLs to Zookeeper nodes
ok 63 start solr with mTLS wanted in 50925ms
ok 64 SOLR-11740 check 'solr stop' connection in 14343ms
ok 65 stop command for single port in 17067ms
ok 66 status detects locally running solr in 8126ms
ok 67 status does not expose cli parameters to end user in 242ms
ok 68 listing out files in 2889ms
ok 69 copying files around in 6464ms
ok 70 upconfig in 2631ms
ok 71 zkcli.sh gets 'solrhome' from 'solr.home' system property in 1237ms
ok 72 zkcli.sh gets 'solrhome' from 'solrhome' command line option in 1245ms
ok 73 Cleanup in 1255ms
> Task :solr:packaging:integrationTests FAILED
FAILURE: Build failed with an exception.
* Where:
Build file '/home/jenkins/jenkins-slave/workspace/Solr/Solr-check-9.4/solr/packaging/build.gradle' line: 301
* What went wrong:
Execution failed for task ':solr:packaging:integrationTests'.
> Process 'command '/home/jenkins/jenkins-slave/workspace/Solr/Solr-check-9.4/.gradle/node/packaging/node_modules/bats/bin/bats'' finished with non-zero exit value 1
* Try:
> Run with --stacktrace option to get the stack trace.
> Run with --info or --debug option to get more log output.
* Get more help at https://help.gradle.org
Deprecated Gradle features were used in this build, making it incompatible with Gradle 8.0.
You can use '--warning-mode all' to show the individual deprecation warnings and determine if they come from your own scripts or plugins.
See https://docs.gradle.org/7.6/userguide/command_line_interface.html#sec:command_line_warnings
BUILD FAILED in 1h 2m 37s
672 actionable tasks: 672 executed
Publishing build scan...
https://ge.apache.org/s/gnan5ps6qbxsy
Build step 'Invoke Gradle script' changed build result to FAILURE
Build step 'Invoke Gradle script' marked build as failure
Archiving artifacts
Recording test results
[Checks API] No suitable checks publisher found.
Email was triggered for: Failure - Any
Sending email for trigger: Failure - Any