You are viewing a plain text version of this content. The canonical link for it is here.
Posted to alerts@harmony.apache.org by Apache Hudson Server <hu...@hudson.zones.apache.org> on 2010/03/13 19:25:43 UTC
Build failed in Hudson: Harmony-1.5-head-linux-x86_64-full-tests
#104
See <http://hudson.zones.apache.org/hudson/job/Harmony-1.5-head-linux-x86_64-full-tests/104/changes>
Changes:
[hindessm] Making new directories.
------------------------------------------
[...truncated 14433 lines...]
A src/test/regression/H1802
AU src/test/regression/H1802/run.test.xml
AU src/test/regression/H1802/UnresolvedHandlerTest.java
AU src/test/regression/H1802/UnresolvedParamTest.java
A src/test/regression/H4511
AU src/test/regression/H4511/run.test.xml
AU src/test/regression/H4511/GCTagged.java
AU src/test/regression/H4511/GCTagged.cpp
A src/test/regression/H3225
AU src/test/regression/H3225/MergeEmptyStackNegativeTest.j
AU src/test/regression/H3225/MergeStackNegativeTest.j
AU src/test/regression/H3225/NegativeJsrTest.java
AU src/test/regression/H3225/RetOrderNegativeTest.j
AU src/test/regression/H3225/run.test.xml
AU src/test/regression/H3225/J9CompatibleJsrTest.j
AU src/test/regression/H3225/PositiveJsrTest.j
AU src/test/regression/H3225/MergeIntFloatNegativeTest.j
AU src/test/regression/H3225/PerfTest.java
AU src/test/regression/H3225/MergeExecutionNegativeTest.j
A src/test/regression/H3027
AU src/test/regression/H3027/run.test.xml
AU src/test/regression/H3027/AgentLibTest.java
AU src/test/regression/H3027/AgentLib.cpp
A src/test/regression/H4512
AU src/test/regression/H4512/GetCurrentThreadCpuTime.java
AU src/test/regression/H4512/run.test.xml
AU src/test/regression/H4512/GetCurrentThreadCpuTime.cpp
A src/test/regression/H3505
AU src/test/regression/H3505/run.test.xml
AU src/test/regression/H3505/GetFieldModifiersTest.java
AU src/test/regression/H3505/GetFieldModifiersTest.cpp
A src/test/regression/H1840
AU src/test/regression/H1840/run.test.xml
AU src/test/regression/H1840/SimplestTest.j
A src/test/regression/H2092
AU src/test/regression/H2092/Test.java
AU src/test/regression/H2092/run.test.xml
A src/test/regression/H2335
AU src/test/regression/H2335/run.test.xml
AU src/test/regression/H2335/SimplestLibraryPathTest.java
AU src/test/regression/H2335/readme.txt
A src/test/regression/H5206
AU src/test/regression/H5206/VolatileLongTest.java
AU src/test/regression/H5206/run.test.xml
A src/test/regression/H3380
AU src/test/regression/H3380/run.test.xml
AU src/test/regression/H3380/LongToBitsTest.java
A src/test/regression/H2057
AU src/test/regression/H2057/run.test.xml
AU src/test/regression/H2057/SyncTest.java
A src/test/regression/H4073
AU src/test/regression/H4073/Test.java
AU src/test/regression/H4073/run.test.xml
A src/test/regression/H4514
AU src/test/regression/H4514/Test.java
AU src/test/regression/H4514/run.test.xml
A src/test/regression/H3228
AU src/test/regression/H3228/run.test.xml
AU src/test/regression/H3228/H3228.java
A src/test/regression/H3822
AU src/test/regression/H3822/Test.java
A src/test/regression/H5127
AU src/test/regression/H5127/Test.java
AU src/test/regression/H5127/run.test.xml
A src/test/regression/H3382
AU src/test/regression/H3382/run.test.xml
AU src/test/regression/H3382/Test.j
AU src/test/regression/H3382/TestX.java
A src/test/regression/H3067
AU src/test/regression/H3067/Test.java
AU src/test/regression/H3067/WideGoto.j
A src/test/regression/H4751
AU src/test/regression/H4751/Test.java
AU src/test/regression/H4751/run.test.xml
A src/test/regression/H5480
AU src/test/regression/H5480/run.test.xml
AU src/test/regression/H5480/LooseMathTest.java
A src/test/regression/H3582
AU src/test/regression/H3582/Test.java
A src/test/regression/H2259
AU src/test/regression/H2259/run.test.xml
AU src/test/regression/H2259/H2259.java
A src/test/regression/H2773
AU src/test/regression/H2773/run.test.xml
AU src/test/regression/H2773/InfinityTest.java
A src/test/regression/H3862
AU src/test/regression/H3862/neg.j
AU src/test/regression/H3862/run.test.xml
AU src/test/regression/H3862/neg2.j
AU src/test/regression/H3862/neg3.j
AU src/test/regression/H3862/SubrBounds.java
AU src/test/regression/H3862/pos.j
AU src/test/regression/H3862/pos2.j
A src/test/regression/H3908
AU src/test/regression/H3908/InvokeTest.java
A src/test/regression/H3909
AU src/test/regression/H3909/run.test.xml
AU src/test/regression/H3909/FinalizerThreadGroup.java
AU src/test/regression/H3909/FinalizerThreadGroup.cpp
A src/test/regression/H3784
AU src/test/regression/H3784/Test.java
AU src/test/regression/H3784/run.test.xml
AU src/test/regression/H3784/check.cpp
A src/test/regression/H3982
AU src/test/regression/H3982/run.test.xml
AU src/test/regression/H3982/EmptyStackTrace.java
AU src/test/regression/H3982/EmptyStackTrace.cpp
A src/test/regression/H4675
AU src/test/regression/H4675/run.test.xml
AU src/test/regression/H4675/DivLongTest.java
A src/test/regression/H4595
AU src/test/regression/H4595/Test.java
AU src/test/regression/H4595/run.test.xml
A src/test/regression/H4874
AU src/test/regression/H4874/Test.java
AU src/test/regression/H4874/run.test.xml
A src/test/harmony-1800
AU src/test/harmony-1800/testExec1.java
A src/test/microbenchmark
A src/test/microbenchmark/harmony-2012
AU src/test/microbenchmark/harmony-2012/test2012.java
A src/test/microbenchmark/harmony-2874
AU src/test/microbenchmark/harmony-2874/test0.java
AU src/test/microbenchmark/harmony-2874/test1.java
AU src/test/microbenchmark/harmony-2874/test2.java
A src/test/microbenchmark/harmony-2223
AU src/test/microbenchmark/harmony-2223/test_longmuldiv_speed.java
A src/test/microbenchmark/harmony-3243
AU src/test/microbenchmark/harmony-3243/ArrayFillPerf.java
A src/test/microbenchmark/harmony-3630
A src/test/microbenchmark/harmony-3630/abstractCall
AU src/test/microbenchmark/harmony-3630/abstractCall/test.java
A src/test/microbenchmark/harmony-3630/virtualCall
AU src/test/microbenchmark/harmony-3630/virtualCall/test.java
A src/test/microbenchmark/harmony-3630/virtualIndirectCall
AU src/test/microbenchmark/harmony-3630/virtualIndirectCall/test.java
A src/test/microbenchmark/harmony-3630/directCall
AU src/test/microbenchmark/harmony-3630/directCall/test.java
A src/test/microbenchmark/harmony-3630/interfaceCall
AU src/test/microbenchmark/harmony-3630/interfaceCall/test.java
A src/test/microbenchmark/harmony-2345
AU src/test/microbenchmark/harmony-2345/test_f2i_speed.java
A src/test/microbenchmark/harmony-2247
AU src/test/microbenchmark/harmony-2247/ArraycopyTest.java
A src/test/microbenchmark/harmony-2815
AU src/test/microbenchmark/harmony-2815/SecurityPerfTest.java
A src/test/microbenchmark/harmony-5480
AU src/test/microbenchmark/harmony-5480/MathTest.java
A src/test/harmony-1417
AU src/test/harmony-1417/Test2_LE.java
A src/test/final_method_test
AU src/test/final_method_test/FinalMethodTest.java
A src/test/final_method_test/finalmethodtest
AU src/test/final_method_test/finalmethodtest/A.java
A src/test/verifier_aastore
A src/test/verifier_aastore/src
AU src/test/verifier_aastore/src/Test.java
AU src/test/verifier_aastore/src/TestInterface.java
AU src/test/verifier_aastore/src/TestAastore2.j
AU src/test/verifier_aastore/src/TestAastore.java
AU src/test/verifier_aastore/HowTo.txt
A src/test/invokespecial_super
A src/test/invokespecial_super/src
AU src/test/invokespecial_super/src/Test.java
AU src/test/invokespecial_super/src/TestInvokeSpecial.j
AU src/test/invokespecial_super/src/Super.j
AU src/test/invokespecial_super/HowTo.txt
A src/test/negative_array_size
AU src/test/negative_array_size/NegativeArray.java
A src/test/array_method_limit
A src/test/array_method_limit/src
AU src/test/array_method_limit/src/Test.java
AU src/test/array_method_limit/src/TestStatic.j
AU src/test/array_method_limit/src/Invoke.j
AU src/test/array_method_limit/src/InvokeInterface.j
AU src/test/array_method_limit/src/TestArray.j
AU src/test/array_method_limit/src/TestInterface.j
AU src/test/array_method_limit/src/TestSpecial.j
AU src/test/array_method_limit/src/TestVirtual.j
AU src/test/array_method_limit/HowTo.txt
A src/test/verifier_empty_init
A src/test/verifier_empty_init/src
AU src/test/verifier_empty_init/src/Test.java
AU src/test/verifier_empty_init/src/TestEmptyInit.j
AU src/test/verifier_empty_init/HowTo.txt
A src/test/package_tests
AU src/test/package_tests/Test1.java
AU src/test/package_tests/Test2.java
AU src/test/package_tests/Test3.java
A src/test/harmony-1694
AU src/test/harmony-1694/StressTest01.java
AU README.txt
A make
AU make/depends.xml
AU make/build-native.xml
A make/tests
AU make/tests/ehwa-test.xml
AU make/tests/test-common.xml
AU make/tests/jvmti-test.xml
AU make/tests/reg-test.xml
AU make/tests/smoke-test.xml
AU make/tests/lazy-test.xml
AU make/tests/reg-test-run.xml
AU make/tests/kernel-test.xml
AU make/tests/cunit-test.xml
A make/vm
AU make/vm/kernel.xml
AU make/vm/em.xml
AU make/vm/gc_gen.xml
AU make/vm/interpreter.xml
AU make/vm/port.xml
AU make/vm/common-vm.xml
AU make/vm/verifier-ext.xml
AU make/vm/verifier.xml
AU make/vm/vmcore.xml
AU make/vm/vmi.xml
AU make/vm/hythr.xml
AU make/vm/jitrino.xml
AU make/vm/port_ch.xml
AU make/vm/encoder.xml
A make/extra
AU make/extra/apr.xml
A make/classlib.override.file.patterns
A make/resources
A make/resources/patches
AU make/resources/harmonyvm.properties
AU make/resources/readme.txt
AU make/test.properties
AU make/properties.xml
AU make/build-java.xml
AU make/depends.properties
AU build.xml
U .
At revision 922641
no change for http://svn.apache.org/repos/asf/harmony/enhanced/classlib/trunk since the previous build
no change for http://svn.apache.org/repos/asf/harmony/enhanced/jdktools/trunk since the previous build
no change for http://svn.apache.org/repos/asf/harmony/enhanced/drlvm/trunk since the previous build
[harmony] $ ant -Duse.libstdc++6=true fetch-depends rebuild bundle-hdk
Buildfile: build.xml
fetch-classlib-libs:
BUILD FAILED
<http://hudson.zones.apache.org/hudson/job/Harmony-1.5-head-linux-x86_64-full-tests/ws/harmony/build.xml>:468: The following error occurred while executing this line:
java.io.FileNotFoundException: <http://hudson.zones.apache.org/hudson/job/Harmony-1.5-head-linux-x86_64-full-tests/ws/harmony/working_classlib/build.xml> (No such file or directory)
Total time: 0 seconds
Archiving artifacts
Recording test results
Build failed in Hudson: Harmony-1.5-head-linux-x86_64-full-tests
#123
Posted by Apache Hudson Server <hu...@hudson.zones.apache.org>.
See <http://hudson.zones.apache.org/hudson/job/Harmony-1.5-head-linux-x86_64-full-tests/123/changes>
Changes:
[hindessm] Remove unused reference to the old fdlibm download.
[hindessm] Use unix path separators for z/OS only ant tasks.
[hindessm] Add includeantruntime="false" to silence ant 1.8.0 warning and make our
builds more consistent by not relying on jars in ant lib. (Still need
ecj in ant lib but might not need junit now? At least not for compiling
anyway.)
------------------------------------------
[...truncated 25939 lines...]
[junit] STDOUT> StopDebuggee: started
[junit] STDOUT> TestedThread: started
[junit] STDOUT> TestedThread: Wait for 'Stop' command with NullPointerException...
[junit] STDOUT> StopDebuggee: Wait for TestedThread to finish...
[junit] [SYNC] Received message: ready
[junit] testStop001: get threadID to Stop...
[junit] testStop001: ID of the tested thread to Stop = 2032
[junit] testStop001: get throwable for Stop command...
[junit] testStop001: throwable = ObjectID: 1586
[junit] testStop001: send "Stop" command
[junit] testStop001: wait for Debuggee message about test status...
[junit] [SYNC] Waiting for any messsage
[junit] STDOUT> TestedThread: Exception is caught: java.lang.NullPointerException
[junit] STDOUT> TestedThread: PASSED: It is expected Exception
[junit] STDOUT> StopDebuggee: TestedThread finished
[junit] [SYNC] Received message: PASSED
[junit] testStop001: Received from Debuggee test status = PASSED
[junit] testStop001: PASSED
[junit] ----------------------------------------
[junit] [SYNC] Closed socket
[junit] Completed sync connection
[junit] Waiting for process exit
[junit] STDOUT> [SYNC] Message sent: PASSED
[junit] STDOUT> StopDebuggee: finishing...
[junit] STDOUT> [SYNC] Closed socket
[junit] Redirector completed: STDOUT
[junit] Redirector completed: STDERR
[junit] Finished debuggee with exit code: 0
[junit] Finished process
[junit] Waiting for redirectors finish
[junit] Finished redirectors
[junit] Closed JDWP connection with debuggee VM
[junit] <<<=====================================
[junit]
[junit]
[junit] Running org.apache.harmony.jpda.tests.jdwp.VirtualMachine.HoldEventsTest
[junit] Tests run: 1, Failures: 0, Errors: 0, Time elapsed: 61.585 sec
[junit] Output:
[junit]
[junit] =====================================>>>
[junit] Run: org.apache.harmony.jpda.tests.jdwp.VirtualMachine.HoldEventsTest.testHoldEvents001
[junit] ----------------------------------------
[junit] [SYNC] Binding socket on port: 0
[junit] [SYNC] Bound socket on port: 57190
[junit] Start listening on: null
[junit] Listening on: minerva.apache.org:51191
[junit] Launch: <http://hudson.zones.apache.org/hudson/job/Harmony-1.5-head-linux-x86_64-full-tests/ws/harmony/target/hdk/jdk/jre/bin/java> -cp "<http://hudson.zones.apache.org/hudson/job/Harmony-1.5-head-linux-x86_64-full-tests/ws/harmony/jdktools/build/tests/classes>:/home/hudson/.ant/lib/junit-4.6.jar:/usr/share/ant/lib/ant-launcher.jar:/usr/share/ant/lib/ant.jar:/usr/share/ant/lib/ant-junit.jar" -agentlib:jdwp=transport=dt_socket,address=minerva.apache.org:51191,server=n,suspend=y -Djpda.settings.verbose=true -Djpda.settings.syncPort=57190 org.apache.harmony.jpda.tests.jdwp.VirtualMachine.HoldEventsDebuggee
[junit] Launch process: <http://hudson.zones.apache.org/hudson/job/Harmony-1.5-head-linux-x86_64-full-tests/ws/harmony/target/hdk/jdk/jre/bin/java> -cp "<http://hudson.zones.apache.org/hudson/job/Harmony-1.5-head-linux-x86_64-full-tests/ws/harmony/jdktools/build/tests/classes>:/home/hudson/.ant/lib/junit-4.6.jar:/usr/share/ant/lib/ant-launcher.jar:/usr/share/ant/lib/ant.jar:/usr/share/ant/lib/ant-junit.jar" -agentlib:jdwp=transport=dt_socket,address=minerva.apache.org:51191,server=n,suspend=y -Djpda.settings.verbose=true -Djpda.settings.syncPort=57190 org.apache.harmony.jpda.tests.jdwp.VirtualMachine.HoldEventsDebuggee
[junit] Splitted command line: [<http://hudson.zones.apache.org/hudson/job/Harmony-1.5-head-linux-x86_64-full-tests/ws/harmony/target/hdk/jdk/jre/bin/java,> -cp, <http://hudson.zones.apache.org/hudson/job/Harmony-1.5-head-linux-x86_64-full-tests/ws/harmony/jdktools/build/tests/classes>:/home/hudson/.ant/lib/junit-4.6.jar:/usr/share/ant/lib/ant-launcher.jar:/usr/share/ant/lib/ant.jar:/usr/share/ant/lib/ant-junit.jar, -agentlib:jdwp=transport=dt_socket,address=minerva.apache.org:51191,server=n,suspend=y, -Djpda.settings.verbose=true, -Djpda.settings.syncPort=57190, org.apache.harmony.jpda.tests.jdwp.VirtualMachine.HoldEventsDebuggee]
[junit] Launched process
[junit] Start redirectors
[junit] Redirector started: STDERR
[junit] Redirector started: STDOUT
[junit] Started redirectors
[junit] Launched debuggee process
[junit] Accepting JDWP connection
[junit] Established transport connection
[junit] Established JDWP connection with debuggee VM
[junit] Received inital VM_INIT event
[junit] Adjusted VM-dependent type lengths
[junit] Resumed debuggee VM
[junit] [SYNC] Accepting socket connection
[junit] STDOUT> [SYNC] Attaching socket to: localhost:57190
[junit] [SYNC] Accepted socket connection
[junit] Established sync connection
[junit] ----------------------------------------
[junit] [SYNC] Waiting for message: ready
[junit] STDOUT> [SYNC] Attached socket
[junit] [SYNC] Received message: ready
[junit] send HoldEvents
[junit] allow to start thread
[junit] [SYNC] Message sent: continue
[junit] STDOUT> [SYNC] Message sent: ready
[junit] STDOUT> wait for SGNL_CONTINUE to start thread
[junit] STDOUT> [SYNC] Waiting for message: continue
[junit] STDOUT> [SYNC] Received message: continue
[junit] STDOUT> starting thread
[junit] no events were received
[junit] send ReleaseEvents
[junit] expected event received: org.apache.harmony.jpda.tests.framework.jdwp.EventPacket@3dce82ae
[junit] ----------------------------------------
[junit] [SYNC] Closed socket
[junit] Completed sync connection
[junit] Waiting for process exit
[junit] STDOUT> TestedThread: started
[junit] STDOUT> thread is finished
[junit] STDOUT> [SYNC] Closed socket
[junit] Redirector completed: STDOUT
[junit] Redirector completed: STDERR
[junit] Finished debuggee with exit code: 0
[junit] Finished process
[junit] Waiting for redirectors finish
[junit] Finished redirectors
[junit] Closed JDWP connection with debuggee VM
[junit] <<<=====================================
[junit]
[junit]
touch-failures-file:
touch-errors-file:
test-module:
build-tests:
[echo] Compiling TOOLS tests
[mkdir] Created dir: <http://hudson.zones.apache.org/hudson/job/Harmony-1.5-head-linux-x86_64-full-tests/ws/harmony/jdktools/modules/jretools/bin/test>
[hy.javac] Compiling 3 source files to <http://hudson.zones.apache.org/hudson/job/Harmony-1.5-head-linux-x86_64-full-tests/ws/harmony/jdktools/modules/jretools/bin/test>
[hy.javac] Since fork is false, ignoring memoryMaximumSize setting
prepare-exclude:
[echo] TOOLS exclude list: <http://hudson.zones.apache.org/hudson/job/Harmony-1.5-head-linux-x86_64-full-tests/ws/harmony/classlib/deploy/build/jretools.tools.exclude>
run-tests:
[echo] Running TOOLS tests
[echo] test.jre.home=<http://hudson.zones.apache.org/hudson/job/Harmony-1.5-head-linux-x86_64-full-tests/ws/harmony/target/hdk/jdk/jre>
[junit] Running org.apache.harmony.jretools.tests.keytool.GenKeyTest
[junit] Tests run: 1, Failures: 0, Errors: 0, Time elapsed: 1.502 sec
[junit] Running org.apache.harmony.jretools.tests.toolutils.KeyStoreLoaderSaverTest
[junit] Tests run: 2, Failures: 0, Errors: 0, Time elapsed: 0.01 sec
touch-failures-file:
touch-errors-file:
test-module:
prepare-exclude:
[echo] SAMSA exclude list: <http://hudson.zones.apache.org/hudson/job/Harmony-1.5-head-linux-x86_64-full-tests/ws/harmony/classlib/deploy/build/jdktools.samsa.exclude>
run-tests:
[echo] Running SAMSA tests
[echo] test.jre.home=<http://hudson.zones.apache.org/hudson/job/Harmony-1.5-head-linux-x86_64-full-tests/ws/harmony/target/hdk/jdk/jre>
[echo] Run jdk/bin/java -version in <http://hudson.zones.apache.org/hudson/job/Harmony-1.5-head-linux-x86_64-full-tests/ws/harmony/build/test_report>
[echo] Run jdk/bin/javac -version in <http://hudson.zones.apache.org/hudson/job/Harmony-1.5-head-linux-x86_64-full-tests/ws/harmony/build/test_report>
[exec] Eclipse Java Compiler 0.972_R35x, 3.5.1 release, Copyright IBM Corp 2000, 2009. All rights reserved.
[echo] Run jdk/bin/javah in <http://hudson.zones.apache.org/hudson/job/Harmony-1.5-head-linux-x86_64-full-tests/ws/harmony/build/test_report>
[exec] JNI-style header files generator.
[exec]
[exec] Usage: org.apache.harmony.tools.javah.Main [options] <class names>
[exec]
[exec] [options]
[exec] -bootclasspath <path> The given path will be prepended to
[exec] the default class path.
[exec]
[exec] -classpath <path> The given path will be appended to
[exec] the default class path.
[exec]
[exec] -o <file> All the output will be redirected into
[exec] the specified file.
[exec]
[exec] -d <directory> All the header files will be created in the specified
[exec] directory which will be created if it is necessary.
[exec]
[exec] -inner Inner classes will be processed automatically.
[exec]
[exec] -verbose Allows running commentary.
[exec]
[exec] <class names> A list of the fully qualified class names
[exec] separated by a space.
[exec] Result: 1
[echo] Run jdk/bin/javadoc in <http://hudson.zones.apache.org/hudson/job/Harmony-1.5-head-linux-x86_64-full-tests/ws/harmony/build/test_report>
[exec] JavaDoc is not implemented yet
[echo] Run jdk/bin/jarsigner in <http://hudson.zones.apache.org/hudson/job/Harmony-1.5-head-linux-x86_64-full-tests/ws/harmony/build/test_report>
[exec] JarSigner help.
[exec] Usage: jarsigner {options} JAR-file alias
[exec] jarsigner -verify {options} JAR-file
[exec]
[exec] -verify verify a signed JAR file
[exec] -keystore <keystore_path> location of the keystore
[exec] -storetype <keystore_type> type of the keystore
[exec] -storepass <keystore_password> keystore password
[exec] -keypass <key_password> private key password (if differs from <keystore_password>)
[exec] -signedjar <file_name> name of the signed JAR file
[exec] -sigfile <file_name> name of .SF and .DSA files
[exec] -verbose provide additional output
[exec] -silent provide as few output as possible
[exec] -certs display certificates (use with -verify and -verbose)
[exec] -tsa <TSA_URL> location of time-stamp authority
[exec] -tsacert <TSA_cert_alias> keystore alias of the TSA certificate
[exec] -proxy <host_address>{:<port>} proxy server host address and port, e.g. proxy.server.com:1234
[exec] -proxytype <type_name> type of the proxy server (HTTP or SOCKS)
[exec] -providerclass <class> class name of cryptographic service provider
[exec] -providername <name> provider name
[exec] -ksproviderclass <class> class name of cryptographic service provider for managing keystore
[exec] -ksprovidername <name> keystore provider name
[exec] -sigproviderclass <class> class name of cryptographic service provider for work with signatures
[exec] -sigprovidername <name> signature provider name
[exec] -certproviderclass <class> class name of cryptographic service provider for work with certificates
[exec] -certprovidername <name> certificate provider name
[exec] -mdproviderclass <class> class name of cryptographic service provider for work with message digests
[exec] -mdprovidername <name> message digest provider name
[echo] Run jdk/jre/bin/keytool -help in <http://hudson.zones.apache.org/hudson/job/Harmony-1.5-head-linux-x86_64-full-tests/ws/harmony/build/test_report>
[exec]
[exec] Keytool usage:
[exec] keytool {-<command_name>} {-<command_option>} {<option_value>}... -J<java_option>
[exec]
[exec] Known commands:
[exec] -certreq Generate certificate request
[exec] -checkcrl Check certificates revocation status
[exec] -convert Convert keystore to another format
[exec] -delete Remove entry from keystore
[exec] -export Export certificate to a file or stdout
[exec] -genkey Secret key or key pair generation
[exec] -help This help message or help on a command
[exec] -import Import a certificate (chain) or a CSR reply
[exec] -keyclone Duplicate a key entry
[exec] -keypasswd Change key password
[exec] -printcert Print to stdout a certificate from file
[exec] -selfcert Generate a self-signed certificate with existing key
[exec] -storepasswd Change keystore password
[exec] -verify Verify a certificate chain
[exec]
[exec] Help usage:
[exec] keytool -help {<command_name>}
[exec] E.g.: keytool -help genkey
[exec]
[echo] Run jdk/jre/bin/unpack200 in <http://hudson.zones.apache.org/hudson/job/Harmony-1.5-head-linux-x86_64-full-tests/ws/harmony/build/test_report>
[exec] Usage: unpack200 [-opt... | --option=value]... x.pack[.gz] y.jar
[exec] (For more information, run unpack200 --help)
[echo] Run jdk/jre/bin/pack200 in <http://hudson.zones.apache.org/hudson/job/Harmony-1.5-head-linux-x86_64-full-tests/ws/harmony/build/test_report>
[exec] Usage: pack200 [-opt... | --option=value]... x.pack[.gz] y.jar
[exec] (For more information, run pack200 --help)
test-module:
process-test-output:
-check-for-empty:
-process-empty:
process-empty:
full-report:
short-report:
gen-report:
check-test-result:
BUILD FAILED
<http://hudson.zones.apache.org/hudson/job/Harmony-1.5-head-linux-x86_64-full-tests/ws/harmony/build.xml>:983: The following error occurred while executing this line:
<http://hudson.zones.apache.org/hudson/job/Harmony-1.5-head-linux-x86_64-full-tests/ws/harmony/classlib/make/build-test.xml>:161: There were test errors.
Total time: 23 minutes 21 seconds
Archiving artifacts
Recording test results
Build failed in Hudson: Harmony-1.5-head-linux-x86_64-full-tests
#122
Posted by Apache Hudson Server <hu...@hudson.zones.apache.org>.
See <http://hudson.zones.apache.org/hudson/job/Harmony-1.5-head-linux-x86_64-full-tests/122/changes>
Changes:
[hindessm] Make more consistent use of hy.javac compiler definition.
------------------------------------------
[...truncated 25825 lines...]
[junit] STDOUT> StopDebuggee: started
[junit] STDOUT> TestedThread: started
[junit] STDOUT> TestedThread: Wait for 'Stop' command with NullPointerException...
[junit] STDOUT> StopDebuggee: Wait for TestedThread to finish...
[junit] [SYNC] Received message: ready
[junit] testStop001: get threadID to Stop...
[junit] testStop001: ID of the tested thread to Stop = 2032
[junit] testStop001: get throwable for Stop command...
[junit] testStop001: throwable = ObjectID: 1586
[junit] testStop001: send "Stop" command
[junit] testStop001: wait for Debuggee message about test status...
[junit] [SYNC] Waiting for any messsage
[junit] STDOUT> TestedThread: Exception is caught: java.lang.NullPointerException
[junit] STDOUT> TestedThread: PASSED: It is expected Exception
[junit] STDOUT> StopDebuggee: TestedThread finished
[junit] [SYNC] Received message: PASSED
[junit] testStop001: Received from Debuggee test status = PASSED
[junit] testStop001: PASSED
[junit] ----------------------------------------
[junit] [SYNC] Closed socket
[junit] Completed sync connection
[junit] Waiting for process exit
[junit] STDOUT> [SYNC] Message sent: PASSED
[junit] STDOUT> StopDebuggee: finishing...
[junit] STDOUT> [SYNC] Closed socket
[junit] Redirector completed: STDOUT
[junit] Redirector completed: STDERR
[junit] Finished debuggee with exit code: 0
[junit] Finished process
[junit] Waiting for redirectors finish
[junit] Finished redirectors
[junit] Closed JDWP connection with debuggee VM
[junit] <<<=====================================
[junit]
[junit]
[junit] Running org.apache.harmony.jpda.tests.jdwp.VirtualMachine.HoldEventsTest
[junit] Tests run: 1, Failures: 0, Errors: 0, Time elapsed: 61.582 sec
[junit] Output:
[junit]
[junit] =====================================>>>
[junit] Run: org.apache.harmony.jpda.tests.jdwp.VirtualMachine.HoldEventsTest.testHoldEvents001
[junit] ----------------------------------------
[junit] [SYNC] Binding socket on port: 0
[junit] [SYNC] Bound socket on port: 53741
[junit] Start listening on: null
[junit] Listening on: minerva.apache.org:32991
[junit] Launch: <http://hudson.zones.apache.org/hudson/job/Harmony-1.5-head-linux-x86_64-full-tests/ws/harmony/target/hdk/jdk/jre/bin/java> -cp "<http://hudson.zones.apache.org/hudson/job/Harmony-1.5-head-linux-x86_64-full-tests/ws/harmony/jdktools/build/tests/classes>:/home/hudson/.ant/lib/junit-4.6.jar:/usr/share/ant/lib/ant-launcher.jar:/usr/share/ant/lib/ant.jar:/usr/share/ant/lib/ant-junit.jar" -agentlib:jdwp=transport=dt_socket,address=minerva.apache.org:32991,server=n,suspend=y -Djpda.settings.verbose=true -Djpda.settings.syncPort=53741 org.apache.harmony.jpda.tests.jdwp.VirtualMachine.HoldEventsDebuggee
[junit] Launch process: <http://hudson.zones.apache.org/hudson/job/Harmony-1.5-head-linux-x86_64-full-tests/ws/harmony/target/hdk/jdk/jre/bin/java> -cp "<http://hudson.zones.apache.org/hudson/job/Harmony-1.5-head-linux-x86_64-full-tests/ws/harmony/jdktools/build/tests/classes>:/home/hudson/.ant/lib/junit-4.6.jar:/usr/share/ant/lib/ant-launcher.jar:/usr/share/ant/lib/ant.jar:/usr/share/ant/lib/ant-junit.jar" -agentlib:jdwp=transport=dt_socket,address=minerva.apache.org:32991,server=n,suspend=y -Djpda.settings.verbose=true -Djpda.settings.syncPort=53741 org.apache.harmony.jpda.tests.jdwp.VirtualMachine.HoldEventsDebuggee
[junit] Splitted command line: [<http://hudson.zones.apache.org/hudson/job/Harmony-1.5-head-linux-x86_64-full-tests/ws/harmony/target/hdk/jdk/jre/bin/java,> -cp, <http://hudson.zones.apache.org/hudson/job/Harmony-1.5-head-linux-x86_64-full-tests/ws/harmony/jdktools/build/tests/classes>:/home/hudson/.ant/lib/junit-4.6.jar:/usr/share/ant/lib/ant-launcher.jar:/usr/share/ant/lib/ant.jar:/usr/share/ant/lib/ant-junit.jar, -agentlib:jdwp=transport=dt_socket,address=minerva.apache.org:32991,server=n,suspend=y, -Djpda.settings.verbose=true, -Djpda.settings.syncPort=53741, org.apache.harmony.jpda.tests.jdwp.VirtualMachine.HoldEventsDebuggee]
[junit] Launched process
[junit] Start redirectors
[junit] Redirector started: STDERR
[junit] Redirector started: STDOUT
[junit] Started redirectors
[junit] Launched debuggee process
[junit] Accepting JDWP connection
[junit] Established transport connection
[junit] Established JDWP connection with debuggee VM
[junit] Received inital VM_INIT event
[junit] Adjusted VM-dependent type lengths
[junit] Resumed debuggee VM
[junit] [SYNC] Accepting socket connection
[junit] STDOUT> [SYNC] Attaching socket to: localhost:53741
[junit] [SYNC] Accepted socket connection
[junit] Established sync connection
[junit] ----------------------------------------
[junit] [SYNC] Waiting for message: ready
[junit] STDOUT> [SYNC] Attached socket
[junit] [SYNC] Received message: ready
[junit] send HoldEvents
[junit] allow to start thread
[junit] [SYNC] Message sent: continue
[junit] STDOUT> [SYNC] Message sent: ready
[junit] STDOUT> wait for SGNL_CONTINUE to start thread
[junit] STDOUT> [SYNC] Waiting for message: continue
[junit] STDOUT> [SYNC] Received message: continue
[junit] STDOUT> starting thread
[junit] no events were received
[junit] send ReleaseEvents
[junit] expected event received: org.apache.harmony.jpda.tests.framework.jdwp.EventPacket@fc3c62ae
[junit] ----------------------------------------
[junit] [SYNC] Closed socket
[junit] Completed sync connection
[junit] Waiting for process exit
[junit] STDOUT> TestedThread: started
[junit] STDOUT> thread is finished
[junit] STDOUT> [SYNC] Closed socket
[junit] Redirector completed: STDOUT
[junit] Redirector completed: STDERR
[junit] Finished debuggee with exit code: 0
[junit] Finished process
[junit] Waiting for redirectors finish
[junit] Finished redirectors
[junit] Closed JDWP connection with debuggee VM
[junit] <<<=====================================
[junit]
[junit]
touch-failures-file:
touch-errors-file:
test-module:
build-tests:
[echo] Compiling TOOLS tests
[mkdir] Created dir: <http://hudson.zones.apache.org/hudson/job/Harmony-1.5-head-linux-x86_64-full-tests/ws/harmony/jdktools/modules/jretools/bin/test>
[hy.javac] Compiling 3 source files to <http://hudson.zones.apache.org/hudson/job/Harmony-1.5-head-linux-x86_64-full-tests/ws/harmony/jdktools/modules/jretools/bin/test>
[hy.javac] Since fork is false, ignoring memoryMaximumSize setting
prepare-exclude:
[echo] TOOLS exclude list: <http://hudson.zones.apache.org/hudson/job/Harmony-1.5-head-linux-x86_64-full-tests/ws/harmony/classlib/deploy/build/jretools.tools.exclude>
run-tests:
[echo] Running TOOLS tests
[echo] test.jre.home=<http://hudson.zones.apache.org/hudson/job/Harmony-1.5-head-linux-x86_64-full-tests/ws/harmony/target/hdk/jdk/jre>
[junit] Running org.apache.harmony.jretools.tests.keytool.GenKeyTest
[junit] Tests run: 1, Failures: 0, Errors: 0, Time elapsed: 1.177 sec
[junit] Running org.apache.harmony.jretools.tests.toolutils.KeyStoreLoaderSaverTest
[junit] Tests run: 2, Failures: 0, Errors: 0, Time elapsed: 0.011 sec
touch-failures-file:
touch-errors-file:
test-module:
prepare-exclude:
[echo] SAMSA exclude list: <http://hudson.zones.apache.org/hudson/job/Harmony-1.5-head-linux-x86_64-full-tests/ws/harmony/classlib/deploy/build/jdktools.samsa.exclude>
run-tests:
[echo] Running SAMSA tests
[echo] test.jre.home=<http://hudson.zones.apache.org/hudson/job/Harmony-1.5-head-linux-x86_64-full-tests/ws/harmony/target/hdk/jdk/jre>
[echo] Run jdk/bin/java -version in <http://hudson.zones.apache.org/hudson/job/Harmony-1.5-head-linux-x86_64-full-tests/ws/harmony/build/test_report>
[echo] Run jdk/bin/javac -version in <http://hudson.zones.apache.org/hudson/job/Harmony-1.5-head-linux-x86_64-full-tests/ws/harmony/build/test_report>
[exec] Eclipse Java Compiler 0.972_R35x, 3.5.1 release, Copyright IBM Corp 2000, 2009. All rights reserved.
[echo] Run jdk/bin/javah in <http://hudson.zones.apache.org/hudson/job/Harmony-1.5-head-linux-x86_64-full-tests/ws/harmony/build/test_report>
[exec] JNI-style header files generator.
[exec]
[exec] Usage: org.apache.harmony.tools.javah.Main [options] <class names>
[exec]
[exec] [options]
[exec] -bootclasspath <path> The given path will be prepended to
[exec] the default class path.
[exec]
[exec] -classpath <path> The given path will be appended to
[exec] the default class path.
[exec]
[exec] -o <file> All the output will be redirected into
[exec] the specified file.
[exec]
[exec] -d <directory> All the header files will be created in the specified
[exec] directory which will be created if it is necessary.
[exec]
[exec] -inner Inner classes will be processed automatically.
[exec]
[exec] -verbose Allows running commentary.
[exec]
[exec] <class names> A list of the fully qualified class names
[exec] separated by a space.
[exec] Result: 1
[echo] Run jdk/bin/javadoc in <http://hudson.zones.apache.org/hudson/job/Harmony-1.5-head-linux-x86_64-full-tests/ws/harmony/build/test_report>
[exec] JavaDoc is not implemented yet
[echo] Run jdk/bin/jarsigner in <http://hudson.zones.apache.org/hudson/job/Harmony-1.5-head-linux-x86_64-full-tests/ws/harmony/build/test_report>
[exec] JarSigner help.
[exec] Usage: jarsigner {options} JAR-file alias
[exec] jarsigner -verify {options} JAR-file
[exec]
[exec] -verify verify a signed JAR file
[exec] -keystore <keystore_path> location of the keystore
[exec] -storetype <keystore_type> type of the keystore
[exec] -storepass <keystore_password> keystore password
[exec] -keypass <key_password> private key password (if differs from <keystore_password>)
[exec] -signedjar <file_name> name of the signed JAR file
[exec] -sigfile <file_name> name of .SF and .DSA files
[exec] -verbose provide additional output
[exec] -silent provide as few output as possible
[exec] -certs display certificates (use with -verify and -verbose)
[exec] -tsa <TSA_URL> location of time-stamp authority
[exec] -tsacert <TSA_cert_alias> keystore alias of the TSA certificate
[exec] -proxy <host_address>{:<port>} proxy server host address and port, e.g. proxy.server.com:1234
[exec] -proxytype <type_name> type of the proxy server (HTTP or SOCKS)
[exec] -providerclass <class> class name of cryptographic service provider
[exec] -providername <name> provider name
[exec] -ksproviderclass <class> class name of cryptographic service provider for managing keystore
[exec] -ksprovidername <name> keystore provider name
[exec] -sigproviderclass <class> class name of cryptographic service provider for work with signatures
[exec] -sigprovidername <name> signature provider name
[exec] -certproviderclass <class> class name of cryptographic service provider for work with certificates
[exec] -certprovidername <name> certificate provider name
[exec] -mdproviderclass <class> class name of cryptographic service provider for work with message digests
[exec] -mdprovidername <name> message digest provider name
[echo] Run jdk/jre/bin/keytool -help in <http://hudson.zones.apache.org/hudson/job/Harmony-1.5-head-linux-x86_64-full-tests/ws/harmony/build/test_report>
[exec]
[exec] Keytool usage:
[exec] keytool {-<command_name>} {-<command_option>} {<option_value>}... -J<java_option>
[exec]
[exec] Known commands:
[exec] -certreq Generate certificate request
[exec] -checkcrl Check certificates revocation status
[exec] -convert Convert keystore to another format
[exec] -delete Remove entry from keystore
[exec] -export Export certificate to a file or stdout
[exec] -genkey Secret key or key pair generation
[exec] -help This help message or help on a command
[exec] -import Import a certificate (chain) or a CSR reply
[exec] -keyclone Duplicate a key entry
[exec] -keypasswd Change key password
[exec] -printcert Print to stdout a certificate from file
[exec] -selfcert Generate a self-signed certificate with existing key
[exec] -storepasswd Change keystore password
[exec] -verify Verify a certificate chain
[exec]
[exec] Help usage:
[exec] keytool -help {<command_name>}
[exec] E.g.: keytool -help genkey
[exec]
[echo] Run jdk/jre/bin/unpack200 in <http://hudson.zones.apache.org/hudson/job/Harmony-1.5-head-linux-x86_64-full-tests/ws/harmony/build/test_report>
[exec] Usage: unpack200 [-opt... | --option=value]... x.pack[.gz] y.jar
[exec] (For more information, run unpack200 --help)
[echo] Run jdk/jre/bin/pack200 in <http://hudson.zones.apache.org/hudson/job/Harmony-1.5-head-linux-x86_64-full-tests/ws/harmony/build/test_report>
[exec] Usage: pack200 [-opt... | --option=value]... x.pack[.gz] y.jar
[exec] (For more information, run pack200 --help)
test-module:
process-test-output:
-check-for-empty:
-process-empty:
process-empty:
full-report:
short-report:
gen-report:
check-test-result:
BUILD FAILED
<http://hudson.zones.apache.org/hudson/job/Harmony-1.5-head-linux-x86_64-full-tests/ws/harmony/build.xml>:983: The following error occurred while executing this line:
<http://hudson.zones.apache.org/hudson/job/Harmony-1.5-head-linux-x86_64-full-tests/ws/harmony/classlib/make/build-test.xml>:161: There were test errors.
Total time: 23 minutes 42 seconds
Archiving artifacts
Recording test results
Build failed in Hudson: Harmony-1.5-head-linux-x86_64-full-tests
#121
Posted by Apache Hudson Server <hu...@hudson.zones.apache.org>.
See <http://hudson.zones.apache.org/hudson/job/Harmony-1.5-head-linux-x86_64-full-tests/121/changes>
Changes:
[hindessm] Avoid mixing declarations and code.
------------------------------------------
[...truncated 25838 lines...]
[junit] STDOUT> StopDebuggee: started
[junit] STDOUT> TestedThread: started
[junit] STDOUT> TestedThread: Wait for 'Stop' command with NullPointerException...
[junit] STDOUT> StopDebuggee: Wait for TestedThread to finish...
[junit] [SYNC] Received message: ready
[junit] testStop001: get threadID to Stop...
[junit] testStop001: ID of the tested thread to Stop = 2032
[junit] testStop001: get throwable for Stop command...
[junit] testStop001: throwable = ObjectID: 1586
[junit] testStop001: send "Stop" command
[junit] testStop001: wait for Debuggee message about test status...
[junit] [SYNC] Waiting for any messsage
[junit] STDOUT> TestedThread: Exception is caught: java.lang.NullPointerException
[junit] STDOUT> TestedThread: PASSED: It is expected Exception
[junit] STDOUT> StopDebuggee: TestedThread finished
[junit] [SYNC] Received message: PASSED
[junit] testStop001: Received from Debuggee test status = PASSED
[junit] testStop001: PASSED
[junit] ----------------------------------------
[junit] [SYNC] Closed socket
[junit] Completed sync connection
[junit] Waiting for process exit
[junit] STDOUT> [SYNC] Message sent: PASSED
[junit] STDOUT> StopDebuggee: finishing...
[junit] STDOUT> [SYNC] Closed socket
[junit] Redirector completed: STDOUT
[junit] Redirector completed: STDERR
[junit] Finished debuggee with exit code: 0
[junit] Finished process
[junit] Waiting for redirectors finish
[junit] Finished redirectors
[junit] Closed JDWP connection with debuggee VM
[junit] <<<=====================================
[junit]
[junit]
[junit] Running org.apache.harmony.jpda.tests.jdwp.VirtualMachine.HoldEventsTest
[junit] Tests run: 1, Failures: 0, Errors: 0, Time elapsed: 61.609 sec
[junit] Output:
[junit]
[junit] =====================================>>>
[junit] Run: org.apache.harmony.jpda.tests.jdwp.VirtualMachine.HoldEventsTest.testHoldEvents001
[junit] ----------------------------------------
[junit] [SYNC] Binding socket on port: 0
[junit] [SYNC] Bound socket on port: 43837
[junit] Start listening on: null
[junit] Listening on: minerva.apache.org:44959
[junit] Launch: <http://hudson.zones.apache.org/hudson/job/Harmony-1.5-head-linux-x86_64-full-tests/ws/harmony/target/hdk/jdk/jre/bin/java> -cp "<http://hudson.zones.apache.org/hudson/job/Harmony-1.5-head-linux-x86_64-full-tests/ws/harmony/jdktools/build/tests/classes>:/home/hudson/.ant/lib/junit-4.6.jar:/usr/share/ant/lib/ant-launcher.jar:/usr/share/ant/lib/ant.jar:/usr/share/ant/lib/ant-junit.jar" -agentlib:jdwp=transport=dt_socket,address=minerva.apache.org:44959,server=n,suspend=y -Djpda.settings.verbose=true -Djpda.settings.syncPort=43837 org.apache.harmony.jpda.tests.jdwp.VirtualMachine.HoldEventsDebuggee
[junit] Launch process: <http://hudson.zones.apache.org/hudson/job/Harmony-1.5-head-linux-x86_64-full-tests/ws/harmony/target/hdk/jdk/jre/bin/java> -cp "<http://hudson.zones.apache.org/hudson/job/Harmony-1.5-head-linux-x86_64-full-tests/ws/harmony/jdktools/build/tests/classes>:/home/hudson/.ant/lib/junit-4.6.jar:/usr/share/ant/lib/ant-launcher.jar:/usr/share/ant/lib/ant.jar:/usr/share/ant/lib/ant-junit.jar" -agentlib:jdwp=transport=dt_socket,address=minerva.apache.org:44959,server=n,suspend=y -Djpda.settings.verbose=true -Djpda.settings.syncPort=43837 org.apache.harmony.jpda.tests.jdwp.VirtualMachine.HoldEventsDebuggee
[junit] Splitted command line: [<http://hudson.zones.apache.org/hudson/job/Harmony-1.5-head-linux-x86_64-full-tests/ws/harmony/target/hdk/jdk/jre/bin/java,> -cp, <http://hudson.zones.apache.org/hudson/job/Harmony-1.5-head-linux-x86_64-full-tests/ws/harmony/jdktools/build/tests/classes>:/home/hudson/.ant/lib/junit-4.6.jar:/usr/share/ant/lib/ant-launcher.jar:/usr/share/ant/lib/ant.jar:/usr/share/ant/lib/ant-junit.jar, -agentlib:jdwp=transport=dt_socket,address=minerva.apache.org:44959,server=n,suspend=y, -Djpda.settings.verbose=true, -Djpda.settings.syncPort=43837, org.apache.harmony.jpda.tests.jdwp.VirtualMachine.HoldEventsDebuggee]
[junit] Launched process
[junit] Start redirectors
[junit] Redirector started: STDERR
[junit] Redirector started: STDOUT
[junit] Started redirectors
[junit] Launched debuggee process
[junit] Accepting JDWP connection
[junit] Established transport connection
[junit] Established JDWP connection with debuggee VM
[junit] Received inital VM_INIT event
[junit] Adjusted VM-dependent type lengths
[junit] Resumed debuggee VM
[junit] [SYNC] Accepting socket connection
[junit] STDOUT> [SYNC] Attaching socket to: localhost:43837
[junit] [SYNC] Accepted socket connection
[junit] Established sync connection
[junit] ----------------------------------------
[junit] [SYNC] Waiting for message: ready
[junit] STDOUT> [SYNC] Attached socket
[junit] [SYNC] Received message: ready
[junit] send HoldEvents
[junit] allow to start thread
[junit] [SYNC] Message sent: continue
[junit] STDOUT> [SYNC] Message sent: ready
[junit] STDOUT> wait for SGNL_CONTINUE to start thread
[junit] STDOUT> [SYNC] Waiting for message: continue
[junit] STDOUT> [SYNC] Received message: continue
[junit] STDOUT> starting thread
[junit] no events were received
[junit] send ReleaseEvents
[junit] expected event received: org.apache.harmony.jpda.tests.framework.jdwp.EventPacket@6814c2ae
[junit] ----------------------------------------
[junit] [SYNC] Closed socket
[junit] Completed sync connection
[junit] Waiting for process exit
[junit] STDOUT> TestedThread: started
[junit] STDOUT> thread is finished
[junit] STDOUT> [SYNC] Closed socket
[junit] Redirector completed: STDOUT
[junit] Redirector completed: STDERR
[junit] Finished debuggee with exit code: 0
[junit] Finished process
[junit] Waiting for redirectors finish
[junit] Finished redirectors
[junit] Closed JDWP connection with debuggee VM
[junit] <<<=====================================
[junit]
[junit]
touch-failures-file:
touch-errors-file:
test-module:
build-tests:
[echo] Compiling TOOLS tests
[mkdir] Created dir: <http://hudson.zones.apache.org/hudson/job/Harmony-1.5-head-linux-x86_64-full-tests/ws/harmony/jdktools/modules/jretools/bin/test>
[hy.javac] Compiling 3 source files to <http://hudson.zones.apache.org/hudson/job/Harmony-1.5-head-linux-x86_64-full-tests/ws/harmony/jdktools/modules/jretools/bin/test>
[hy.javac] Since fork is false, ignoring memoryMaximumSize setting
prepare-exclude:
[echo] TOOLS exclude list: <http://hudson.zones.apache.org/hudson/job/Harmony-1.5-head-linux-x86_64-full-tests/ws/harmony/classlib/deploy/build/jretools.tools.exclude>
run-tests:
[echo] Running TOOLS tests
[echo] test.jre.home=<http://hudson.zones.apache.org/hudson/job/Harmony-1.5-head-linux-x86_64-full-tests/ws/harmony/target/hdk/jdk/jre>
[junit] Running org.apache.harmony.jretools.tests.keytool.GenKeyTest
[junit] Tests run: 1, Failures: 0, Errors: 0, Time elapsed: 1.414 sec
[junit] Running org.apache.harmony.jretools.tests.toolutils.KeyStoreLoaderSaverTest
[junit] Tests run: 2, Failures: 0, Errors: 0, Time elapsed: 0.009 sec
touch-failures-file:
touch-errors-file:
test-module:
prepare-exclude:
[echo] SAMSA exclude list: <http://hudson.zones.apache.org/hudson/job/Harmony-1.5-head-linux-x86_64-full-tests/ws/harmony/classlib/deploy/build/jdktools.samsa.exclude>
run-tests:
[echo] Running SAMSA tests
[echo] test.jre.home=<http://hudson.zones.apache.org/hudson/job/Harmony-1.5-head-linux-x86_64-full-tests/ws/harmony/target/hdk/jdk/jre>
[echo] Run jdk/bin/java -version in <http://hudson.zones.apache.org/hudson/job/Harmony-1.5-head-linux-x86_64-full-tests/ws/harmony/build/test_report>
[echo] Run jdk/bin/javac -version in <http://hudson.zones.apache.org/hudson/job/Harmony-1.5-head-linux-x86_64-full-tests/ws/harmony/build/test_report>
[exec] Eclipse Java Compiler 0.972_R35x, 3.5.1 release, Copyright IBM Corp 2000, 2009. All rights reserved.
[echo] Run jdk/bin/javah in <http://hudson.zones.apache.org/hudson/job/Harmony-1.5-head-linux-x86_64-full-tests/ws/harmony/build/test_report>
[exec] JNI-style header files generator.
[exec]
[exec] Usage: org.apache.harmony.tools.javah.Main [options] <class names>
[exec]
[exec] [options]
[exec] -bootclasspath <path> The given path will be prepended to
[exec] the default class path.
[exec]
[exec] -classpath <path> The given path will be appended to
[exec] the default class path.
[exec]
[exec] -o <file> All the output will be redirected into
[exec] the specified file.
[exec]
[exec] -d <directory> All the header files will be created in the specified
[exec] directory which will be created if it is necessary.
[exec]
[exec] -inner Inner classes will be processed automatically.
[exec]
[exec] -verbose Allows running commentary.
[exec]
[exec] <class names> A list of the fully qualified class names
[exec] separated by a space.
[exec] Result: 1
[echo] Run jdk/bin/javadoc in <http://hudson.zones.apache.org/hudson/job/Harmony-1.5-head-linux-x86_64-full-tests/ws/harmony/build/test_report>
[exec] JavaDoc is not implemented yet
[echo] Run jdk/bin/jarsigner in <http://hudson.zones.apache.org/hudson/job/Harmony-1.5-head-linux-x86_64-full-tests/ws/harmony/build/test_report>
[exec] JarSigner help.
[exec] Usage: jarsigner {options} JAR-file alias
[exec] jarsigner -verify {options} JAR-file
[exec]
[exec] -verify verify a signed JAR file
[exec] -keystore <keystore_path> location of the keystore
[exec] -storetype <keystore_type> type of the keystore
[exec] -storepass <keystore_password> keystore password
[exec] -keypass <key_password> private key password (if differs from <keystore_password>)
[exec] -signedjar <file_name> name of the signed JAR file
[exec] -sigfile <file_name> name of .SF and .DSA files
[exec] -verbose provide additional output
[exec] -silent provide as few output as possible
[exec] -certs display certificates (use with -verify and -verbose)
[exec] -tsa <TSA_URL> location of time-stamp authority
[exec] -tsacert <TSA_cert_alias> keystore alias of the TSA certificate
[exec] -proxy <host_address>{:<port>} proxy server host address and port, e.g. proxy.server.com:1234
[exec] -proxytype <type_name> type of the proxy server (HTTP or SOCKS)
[exec] -providerclass <class> class name of cryptographic service provider
[exec] -providername <name> provider name
[exec] -ksproviderclass <class> class name of cryptographic service provider for managing keystore
[exec] -ksprovidername <name> keystore provider name
[exec] -sigproviderclass <class> class name of cryptographic service provider for work with signatures
[exec] -sigprovidername <name> signature provider name
[exec] -certproviderclass <class> class name of cryptographic service provider for work with certificates
[exec] -certprovidername <name> certificate provider name
[exec] -mdproviderclass <class> class name of cryptographic service provider for work with message digests
[exec] -mdprovidername <name> message digest provider name
[echo] Run jdk/jre/bin/keytool -help in <http://hudson.zones.apache.org/hudson/job/Harmony-1.5-head-linux-x86_64-full-tests/ws/harmony/build/test_report>
[exec]
[exec] Keytool usage:
[exec] keytool {-<command_name>} {-<command_option>} {<option_value>}... -J<java_option>
[exec]
[exec] Known commands:
[exec] -certreq Generate certificate request
[exec] -checkcrl Check certificates revocation status
[exec] -convert Convert keystore to another format
[exec] -delete Remove entry from keystore
[exec] -export Export certificate to a file or stdout
[exec] -genkey Secret key or key pair generation
[exec] -help This help message or help on a command
[exec] -import Import a certificate (chain) or a CSR reply
[exec] -keyclone Duplicate a key entry
[exec] -keypasswd Change key password
[exec] -printcert Print to stdout a certificate from file
[exec] -selfcert Generate a self-signed certificate with existing key
[exec] -storepasswd Change keystore password
[exec] -verify Verify a certificate chain
[exec]
[exec] Help usage:
[exec] keytool -help {<command_name>}
[exec] E.g.: keytool -help genkey
[exec]
[echo] Run jdk/jre/bin/unpack200 in <http://hudson.zones.apache.org/hudson/job/Harmony-1.5-head-linux-x86_64-full-tests/ws/harmony/build/test_report>
[exec] Usage: unpack200 [-opt... | --option=value]... x.pack[.gz] y.jar
[exec] (For more information, run unpack200 --help)
[echo] Run jdk/jre/bin/pack200 in <http://hudson.zones.apache.org/hudson/job/Harmony-1.5-head-linux-x86_64-full-tests/ws/harmony/build/test_report>
[exec] Usage: pack200 [-opt... | --option=value]... x.pack[.gz] y.jar
[exec] (For more information, run pack200 --help)
test-module:
process-test-output:
-check-for-empty:
-process-empty:
process-empty:
full-report:
short-report:
gen-report:
check-test-result:
BUILD FAILED
<http://hudson.zones.apache.org/hudson/job/Harmony-1.5-head-linux-x86_64-full-tests/ws/harmony/build.xml>:983: The following error occurred while executing this line:
<http://hudson.zones.apache.org/hudson/job/Harmony-1.5-head-linux-x86_64-full-tests/ws/harmony/classlib/make/build-test.xml>:161: There were test errors.
Total time: 23 minutes 32 seconds
Archiving artifacts
Recording test results
Build failed in Hudson: Harmony-1.5-head-linux-x86_64-full-tests
#120
Posted by Apache Hudson Server <hu...@hudson.zones.apache.org>.
See <http://hudson.zones.apache.org/hudson/job/Harmony-1.5-head-linux-x86_64-full-tests/120/changes>
Changes:
[hindessm] Copy updates from classlib copy of this file.
[hindessm] Minor fixes to help on freebsd.
------------------------------------------
[...truncated 25793 lines...]
[junit] STDOUT> TestedThread: started
[junit] STDOUT> TestedThread: Wait for 'Stop' command with NullPointerException...
[junit] STDOUT> StopDebuggee: Wait for TestedThread to finish...
[junit] STDOUT> [SYNC] Message sent: ready
[junit] [SYNC] Received message: ready
[junit] testStop001: get threadID to Stop...
[junit] testStop001: ID of the tested thread to Stop = 2032
[junit] testStop001: get throwable for Stop command...
[junit] testStop001: throwable = ObjectID: 1586
[junit] testStop001: send "Stop" command
[junit] STDOUT> TestedThread: Exception is caught: java.lang.NullPointerException
[junit] STDOUT> TestedThread: PASSED: It is expected Exception
[junit] testStop001: wait for Debuggee message about test status...
[junit] [SYNC] Waiting for any messsage
[junit] STDOUT> StopDebuggee: TestedThread finished
[junit] [SYNC] Received message: PASSED
[junit] testStop001: Received from Debuggee test status = PASSED
[junit] testStop001: PASSED
[junit] ----------------------------------------
[junit] [SYNC] Closed socket
[junit] Completed sync connection
[junit] Waiting for process exit
[junit] STDOUT> [SYNC] Message sent: PASSED
[junit] STDOUT> StopDebuggee: finishing...
[junit] STDOUT> [SYNC] Closed socket
[junit] Redirector completed: STDOUT
[junit] Redirector completed: STDERR
[junit] Finished debuggee with exit code: 0
[junit] Finished process
[junit] Waiting for redirectors finish
[junit] Finished redirectors
[junit] Closed JDWP connection with debuggee VM
[junit] <<<=====================================
[junit]
[junit]
[junit] Running org.apache.harmony.jpda.tests.jdwp.VirtualMachine.HoldEventsTest
[junit] Tests run: 1, Failures: 0, Errors: 0, Time elapsed: 61.589 sec
[junit] Output:
[junit]
[junit] =====================================>>>
[junit] Run: org.apache.harmony.jpda.tests.jdwp.VirtualMachine.HoldEventsTest.testHoldEvents001
[junit] ----------------------------------------
[junit] [SYNC] Binding socket on port: 0
[junit] [SYNC] Bound socket on port: 59588
[junit] Start listening on: null
[junit] Listening on: minerva.apache.org:33063
[junit] Launch: <http://hudson.zones.apache.org/hudson/job/Harmony-1.5-head-linux-x86_64-full-tests/ws/harmony/target/hdk/jdk/jre/bin/java> -cp "<http://hudson.zones.apache.org/hudson/job/Harmony-1.5-head-linux-x86_64-full-tests/ws/harmony/jdktools/build/tests/classes>:/home/hudson/.ant/lib/junit-4.6.jar:/usr/share/ant/lib/ant-launcher.jar:/usr/share/ant/lib/ant.jar:/usr/share/ant/lib/ant-junit.jar" -agentlib:jdwp=transport=dt_socket,address=minerva.apache.org:33063,server=n,suspend=y -Djpda.settings.verbose=true -Djpda.settings.syncPort=59588 org.apache.harmony.jpda.tests.jdwp.VirtualMachine.HoldEventsDebuggee
[junit] Launch process: <http://hudson.zones.apache.org/hudson/job/Harmony-1.5-head-linux-x86_64-full-tests/ws/harmony/target/hdk/jdk/jre/bin/java> -cp "<http://hudson.zones.apache.org/hudson/job/Harmony-1.5-head-linux-x86_64-full-tests/ws/harmony/jdktools/build/tests/classes>:/home/hudson/.ant/lib/junit-4.6.jar:/usr/share/ant/lib/ant-launcher.jar:/usr/share/ant/lib/ant.jar:/usr/share/ant/lib/ant-junit.jar" -agentlib:jdwp=transport=dt_socket,address=minerva.apache.org:33063,server=n,suspend=y -Djpda.settings.verbose=true -Djpda.settings.syncPort=59588 org.apache.harmony.jpda.tests.jdwp.VirtualMachine.HoldEventsDebuggee
[junit] Splitted command line: [<http://hudson.zones.apache.org/hudson/job/Harmony-1.5-head-linux-x86_64-full-tests/ws/harmony/target/hdk/jdk/jre/bin/java,> -cp, <http://hudson.zones.apache.org/hudson/job/Harmony-1.5-head-linux-x86_64-full-tests/ws/harmony/jdktools/build/tests/classes>:/home/hudson/.ant/lib/junit-4.6.jar:/usr/share/ant/lib/ant-launcher.jar:/usr/share/ant/lib/ant.jar:/usr/share/ant/lib/ant-junit.jar, -agentlib:jdwp=transport=dt_socket,address=minerva.apache.org:33063,server=n,suspend=y, -Djpda.settings.verbose=true, -Djpda.settings.syncPort=59588, org.apache.harmony.jpda.tests.jdwp.VirtualMachine.HoldEventsDebuggee]
[junit] Launched process
[junit] Start redirectors
[junit] Redirector started: STDERR
[junit] Redirector started: STDOUT
[junit] Started redirectors
[junit] Launched debuggee process
[junit] Accepting JDWP connection
[junit] Established transport connection
[junit] Established JDWP connection with debuggee VM
[junit] Received inital VM_INIT event
[junit] Adjusted VM-dependent type lengths
[junit] Resumed debuggee VM
[junit] [SYNC] Accepting socket connection
[junit] STDOUT> [SYNC] Attaching socket to: localhost:59588
[junit] [SYNC] Accepted socket connection
[junit] Established sync connection
[junit] ----------------------------------------
[junit] [SYNC] Waiting for message: ready
[junit] STDOUT> [SYNC] Attached socket
[junit] [SYNC] Received message: ready
[junit] send HoldEvents
[junit] allow to start thread
[junit] [SYNC] Message sent: continue
[junit] STDOUT> [SYNC] Message sent: ready
[junit] STDOUT> wait for SGNL_CONTINUE to start thread
[junit] STDOUT> [SYNC] Waiting for message: continue
[junit] STDOUT> [SYNC] Received message: continue
[junit] STDOUT> starting thread
[junit] no events were received
[junit] send ReleaseEvents
[junit] expected event received: org.apache.harmony.jpda.tests.framework.jdwp.EventPacket@4b12c2ae
[junit] ----------------------------------------
[junit] [SYNC] Closed socket
[junit] Completed sync connection
[junit] Waiting for process exit
[junit] STDOUT> TestedThread: started
[junit] STDOUT> thread is finished
[junit] STDOUT> [SYNC] Closed socket
[junit] Redirector completed: STDERR
[junit] Redirector completed: STDOUT
[junit] Finished debuggee with exit code: 0
[junit] Finished process
[junit] Waiting for redirectors finish
[junit] Finished redirectors
[junit] Closed JDWP connection with debuggee VM
[junit] <<<=====================================
[junit]
[junit]
touch-failures-file:
touch-errors-file:
test-module:
build-tests:
[echo] Compiling TOOLS tests
[mkdir] Created dir: <http://hudson.zones.apache.org/hudson/job/Harmony-1.5-head-linux-x86_64-full-tests/ws/harmony/jdktools/modules/jretools/bin/test>
[hy.javac] Compiling 3 source files to <http://hudson.zones.apache.org/hudson/job/Harmony-1.5-head-linux-x86_64-full-tests/ws/harmony/jdktools/modules/jretools/bin/test>
[hy.javac] Since fork is false, ignoring memoryMaximumSize setting
prepare-exclude:
[echo] TOOLS exclude list: <http://hudson.zones.apache.org/hudson/job/Harmony-1.5-head-linux-x86_64-full-tests/ws/harmony/classlib/deploy/build/jretools.tools.exclude>
run-tests:
[echo] Running TOOLS tests
[echo] test.jre.home=<http://hudson.zones.apache.org/hudson/job/Harmony-1.5-head-linux-x86_64-full-tests/ws/harmony/target/hdk/jdk/jre>
[junit] Running org.apache.harmony.jretools.tests.keytool.GenKeyTest
[junit] Tests run: 1, Failures: 0, Errors: 0, Time elapsed: 1.532 sec
[junit] Running org.apache.harmony.jretools.tests.toolutils.KeyStoreLoaderSaverTest
[junit] Tests run: 2, Failures: 0, Errors: 0, Time elapsed: 0.011 sec
touch-failures-file:
touch-errors-file:
test-module:
prepare-exclude:
[echo] SAMSA exclude list: <http://hudson.zones.apache.org/hudson/job/Harmony-1.5-head-linux-x86_64-full-tests/ws/harmony/classlib/deploy/build/jdktools.samsa.exclude>
run-tests:
[echo] Running SAMSA tests
[echo] test.jre.home=<http://hudson.zones.apache.org/hudson/job/Harmony-1.5-head-linux-x86_64-full-tests/ws/harmony/target/hdk/jdk/jre>
[echo] Run jdk/bin/java -version in <http://hudson.zones.apache.org/hudson/job/Harmony-1.5-head-linux-x86_64-full-tests/ws/harmony/build/test_report>
[echo] Run jdk/bin/javac -version in <http://hudson.zones.apache.org/hudson/job/Harmony-1.5-head-linux-x86_64-full-tests/ws/harmony/build/test_report>
[exec] Eclipse Java Compiler 0.972_R35x, 3.5.1 release, Copyright IBM Corp 2000, 2009. All rights reserved.
[echo] Run jdk/bin/javah in <http://hudson.zones.apache.org/hudson/job/Harmony-1.5-head-linux-x86_64-full-tests/ws/harmony/build/test_report>
[exec] JNI-style header files generator.
[exec]
[exec] Usage: org.apache.harmony.tools.javah.Main [options] <class names>
[exec]
[exec] [options]
[exec] -bootclasspath <path> The given path will be prepended to
[exec] the default class path.
[exec]
[exec] -classpath <path> The given path will be appended to
[exec] the default class path.
[exec]
[exec] -o <file> All the output will be redirected into
[exec] the specified file.
[exec]
[exec] -d <directory> All the header files will be created in the specified
[exec] directory which will be created if it is necessary.
[exec]
[exec] -inner Inner classes will be processed automatically.
[exec]
[exec] -verbose Allows running commentary.
[exec]
[exec] <class names> A list of the fully qualified class names
[exec] separated by a space.
[exec] Result: 1
[echo] Run jdk/bin/javadoc in <http://hudson.zones.apache.org/hudson/job/Harmony-1.5-head-linux-x86_64-full-tests/ws/harmony/build/test_report>
[exec] JavaDoc is not implemented yet
[echo] Run jdk/bin/jarsigner in <http://hudson.zones.apache.org/hudson/job/Harmony-1.5-head-linux-x86_64-full-tests/ws/harmony/build/test_report>
[exec] JarSigner help.
[exec] Usage: jarsigner {options} JAR-file alias
[exec] jarsigner -verify {options} JAR-file
[exec]
[exec] -verify verify a signed JAR file
[exec] -keystore <keystore_path> location of the keystore
[exec] -storetype <keystore_type> type of the keystore
[exec] -storepass <keystore_password> keystore password
[exec] -keypass <key_password> private key password (if differs from <keystore_password>)
[exec] -signedjar <file_name> name of the signed JAR file
[exec] -sigfile <file_name> name of .SF and .DSA files
[exec] -verbose provide additional output
[exec] -silent provide as few output as possible
[exec] -certs display certificates (use with -verify and -verbose)
[exec] -tsa <TSA_URL> location of time-stamp authority
[exec] -tsacert <TSA_cert_alias> keystore alias of the TSA certificate
[exec] -proxy <host_address>{:<port>} proxy server host address and port, e.g. proxy.server.com:1234
[exec] -proxytype <type_name> type of the proxy server (HTTP or SOCKS)
[exec] -providerclass <class> class name of cryptographic service provider
[exec] -providername <name> provider name
[exec] -ksproviderclass <class> class name of cryptographic service provider for managing keystore
[exec] -ksprovidername <name> keystore provider name
[exec] -sigproviderclass <class> class name of cryptographic service provider for work with signatures
[exec] -sigprovidername <name> signature provider name
[exec] -certproviderclass <class> class name of cryptographic service provider for work with certificates
[exec] -certprovidername <name> certificate provider name
[exec] -mdproviderclass <class> class name of cryptographic service provider for work with message digests
[exec] -mdprovidername <name> message digest provider name
[echo] Run jdk/jre/bin/keytool -help in <http://hudson.zones.apache.org/hudson/job/Harmony-1.5-head-linux-x86_64-full-tests/ws/harmony/build/test_report>
[exec]
[exec] Keytool usage:
[exec] keytool {-<command_name>} {-<command_option>} {<option_value>}... -J<java_option>
[exec]
[exec] Known commands:
[exec] -certreq Generate certificate request
[exec] -checkcrl Check certificates revocation status
[exec] -convert Convert keystore to another format
[exec] -delete Remove entry from keystore
[exec] -export Export certificate to a file or stdout
[exec] -genkey Secret key or key pair generation
[exec] -help This help message or help on a command
[exec] -import Import a certificate (chain) or a CSR reply
[exec] -keyclone Duplicate a key entry
[exec] -keypasswd Change key password
[exec] -printcert Print to stdout a certificate from file
[exec] -selfcert Generate a self-signed certificate with existing key
[exec] -storepasswd Change keystore password
[exec] -verify Verify a certificate chain
[exec]
[exec] Help usage:
[exec] keytool -help {<command_name>}
[exec] E.g.: keytool -help genkey
[exec]
[echo] Run jdk/jre/bin/unpack200 in <http://hudson.zones.apache.org/hudson/job/Harmony-1.5-head-linux-x86_64-full-tests/ws/harmony/build/test_report>
[exec] Usage: unpack200 [-opt... | --option=value]... x.pack[.gz] y.jar
[exec] (For more information, run unpack200 --help)
[echo] Run jdk/jre/bin/pack200 in <http://hudson.zones.apache.org/hudson/job/Harmony-1.5-head-linux-x86_64-full-tests/ws/harmony/build/test_report>
[exec] Usage: pack200 [-opt... | --option=value]... x.pack[.gz] y.jar
[exec] (For more information, run pack200 --help)
test-module:
process-test-output:
-check-for-empty:
-process-empty:
process-empty:
full-report:
short-report:
gen-report:
check-test-result:
BUILD FAILED
<http://hudson.zones.apache.org/hudson/job/Harmony-1.5-head-linux-x86_64-full-tests/ws/harmony/build.xml>:983: The following error occurred while executing this line:
<http://hudson.zones.apache.org/hudson/job/Harmony-1.5-head-linux-x86_64-full-tests/ws/harmony/classlib/make/build-test.xml>:161: There were test errors.
Total time: 23 minutes 41 seconds
Archiving artifacts
Recording test results
Build failed in Hudson: Harmony-1.5-head-linux-x86_64-full-tests
#119
Posted by Apache Hudson Server <hu...@hudson.zones.apache.org>.
See <http://hudson.zones.apache.org/hudson/job/Harmony-1.5-head-linux-x86_64-full-tests/119/changes>
Changes:
[hindessm] Commit r925287 "Apply partial jdktools patch for HARMONY-6477
(Problems building jdktools modules in Eclipse)." removed the Class-Path
entries from this MANIFEST. This broke the
org.apache.harmony.tests.tools.javac.MainTest test so I'm putting them back.
------------------------------------------
[...truncated 25858 lines...]
[junit] STDOUT> StopDebuggee: started
[junit] STDOUT> TestedThread: started
[junit] STDOUT> TestedThread: Wait for 'Stop' command with NullPointerException...
[junit] STDOUT> StopDebuggee: Wait for TestedThread to finish...
[junit] [SYNC] Received message: ready
[junit] testStop001: get threadID to Stop...
[junit] testStop001: ID of the tested thread to Stop = 2032
[junit] testStop001: get throwable for Stop command...
[junit] testStop001: throwable = ObjectID: 1586
[junit] testStop001: send "Stop" command
[junit] testStop001: wait for Debuggee message about test status...
[junit] [SYNC] Waiting for any messsage
[junit] STDOUT> TestedThread: Exception is caught: java.lang.NullPointerException
[junit] STDOUT> TestedThread: PASSED: It is expected Exception
[junit] STDOUT> StopDebuggee: TestedThread finished
[junit] [SYNC] Received message: PASSED
[junit] testStop001: Received from Debuggee test status = PASSED
[junit] testStop001: PASSED
[junit] ----------------------------------------
[junit] [SYNC] Closed socket
[junit] Completed sync connection
[junit] Waiting for process exit
[junit] STDOUT> [SYNC] Message sent: PASSED
[junit] STDOUT> StopDebuggee: finishing...
[junit] STDOUT> [SYNC] Closed socket
[junit] Redirector completed: STDOUT
[junit] Redirector completed: STDERR
[junit] Finished debuggee with exit code: 0
[junit] Finished process
[junit] Waiting for redirectors finish
[junit] Finished redirectors
[junit] Closed JDWP connection with debuggee VM
[junit] <<<=====================================
[junit]
[junit]
[junit] Running org.apache.harmony.jpda.tests.jdwp.VirtualMachine.HoldEventsTest
[junit] Tests run: 1, Failures: 0, Errors: 0, Time elapsed: 61.581 sec
[junit] Output:
[junit]
[junit] =====================================>>>
[junit] Run: org.apache.harmony.jpda.tests.jdwp.VirtualMachine.HoldEventsTest.testHoldEvents001
[junit] ----------------------------------------
[junit] [SYNC] Binding socket on port: 0
[junit] [SYNC] Bound socket on port: 56174
[junit] Start listening on: null
[junit] Listening on: minerva.apache.org:49680
[junit] Launch: <http://hudson.zones.apache.org/hudson/job/Harmony-1.5-head-linux-x86_64-full-tests/ws/harmony/target/hdk/jdk/jre/bin/java> -cp "<http://hudson.zones.apache.org/hudson/job/Harmony-1.5-head-linux-x86_64-full-tests/ws/harmony/jdktools/build/tests/classes>:/home/hudson/.ant/lib/junit-4.6.jar:/usr/share/ant/lib/ant-launcher.jar:/usr/share/ant/lib/ant.jar:/usr/share/ant/lib/ant-junit.jar" -agentlib:jdwp=transport=dt_socket,address=minerva.apache.org:49680,server=n,suspend=y -Djpda.settings.verbose=true -Djpda.settings.syncPort=56174 org.apache.harmony.jpda.tests.jdwp.VirtualMachine.HoldEventsDebuggee
[junit] Launch process: <http://hudson.zones.apache.org/hudson/job/Harmony-1.5-head-linux-x86_64-full-tests/ws/harmony/target/hdk/jdk/jre/bin/java> -cp "<http://hudson.zones.apache.org/hudson/job/Harmony-1.5-head-linux-x86_64-full-tests/ws/harmony/jdktools/build/tests/classes>:/home/hudson/.ant/lib/junit-4.6.jar:/usr/share/ant/lib/ant-launcher.jar:/usr/share/ant/lib/ant.jar:/usr/share/ant/lib/ant-junit.jar" -agentlib:jdwp=transport=dt_socket,address=minerva.apache.org:49680,server=n,suspend=y -Djpda.settings.verbose=true -Djpda.settings.syncPort=56174 org.apache.harmony.jpda.tests.jdwp.VirtualMachine.HoldEventsDebuggee
[junit] Splitted command line: [<http://hudson.zones.apache.org/hudson/job/Harmony-1.5-head-linux-x86_64-full-tests/ws/harmony/target/hdk/jdk/jre/bin/java,> -cp, <http://hudson.zones.apache.org/hudson/job/Harmony-1.5-head-linux-x86_64-full-tests/ws/harmony/jdktools/build/tests/classes>:/home/hudson/.ant/lib/junit-4.6.jar:/usr/share/ant/lib/ant-launcher.jar:/usr/share/ant/lib/ant.jar:/usr/share/ant/lib/ant-junit.jar, -agentlib:jdwp=transport=dt_socket,address=minerva.apache.org:49680,server=n,suspend=y, -Djpda.settings.verbose=true, -Djpda.settings.syncPort=56174, org.apache.harmony.jpda.tests.jdwp.VirtualMachine.HoldEventsDebuggee]
[junit] Launched process
[junit] Start redirectors
[junit] Redirector started: STDERR
[junit] Redirector started: STDOUT
[junit] Started redirectors
[junit] Launched debuggee process
[junit] Accepting JDWP connection
[junit] Established transport connection
[junit] Established JDWP connection with debuggee VM
[junit] Received inital VM_INIT event
[junit] Adjusted VM-dependent type lengths
[junit] Resumed debuggee VM
[junit] [SYNC] Accepting socket connection
[junit] STDOUT> [SYNC] Attaching socket to: localhost:56174
[junit] [SYNC] Accepted socket connection
[junit] Established sync connection
[junit] ----------------------------------------
[junit] [SYNC] Waiting for message: ready
[junit] STDOUT> [SYNC] Attached socket
[junit] [SYNC] Received message: ready
[junit] send HoldEvents
[junit] allow to start thread
[junit] [SYNC] Message sent: continue
[junit] STDOUT> [SYNC] Message sent: ready
[junit] STDOUT> wait for SGNL_CONTINUE to start thread
[junit] STDOUT> [SYNC] Waiting for message: continue
[junit] STDOUT> [SYNC] Received message: continue
[junit] STDOUT> starting thread
[junit] no events were received
[junit] send ReleaseEvents
[junit] expected event received: org.apache.harmony.jpda.tests.framework.jdwp.EventPacket@a3f402ae
[junit] ----------------------------------------
[junit] [SYNC] Closed socket
[junit] Completed sync connection
[junit] Waiting for process exit
[junit] STDOUT> TestedThread: started
[junit] STDOUT> thread is finished
[junit] STDOUT> [SYNC] Closed socket
[junit] Redirector completed: STDOUT
[junit] Redirector completed: STDERR
[junit] Finished debuggee with exit code: 0
[junit] Finished process
[junit] Waiting for redirectors finish
[junit] Finished redirectors
[junit] Closed JDWP connection with debuggee VM
[junit] <<<=====================================
[junit]
[junit]
touch-failures-file:
touch-errors-file:
test-module:
build-tests:
[echo] Compiling TOOLS tests
[mkdir] Created dir: <http://hudson.zones.apache.org/hudson/job/Harmony-1.5-head-linux-x86_64-full-tests/ws/harmony/jdktools/modules/jretools/bin/test>
[hy.javac] Compiling 3 source files to <http://hudson.zones.apache.org/hudson/job/Harmony-1.5-head-linux-x86_64-full-tests/ws/harmony/jdktools/modules/jretools/bin/test>
[hy.javac] Since fork is false, ignoring memoryMaximumSize setting
prepare-exclude:
[echo] TOOLS exclude list: <http://hudson.zones.apache.org/hudson/job/Harmony-1.5-head-linux-x86_64-full-tests/ws/harmony/classlib/deploy/build/jretools.tools.exclude>
run-tests:
[echo] Running TOOLS tests
[echo] test.jre.home=<http://hudson.zones.apache.org/hudson/job/Harmony-1.5-head-linux-x86_64-full-tests/ws/harmony/target/hdk/jdk/jre>
[junit] Running org.apache.harmony.jretools.tests.keytool.GenKeyTest
[junit] Tests run: 1, Failures: 0, Errors: 0, Time elapsed: 1.581 sec
[junit] Running org.apache.harmony.jretools.tests.toolutils.KeyStoreLoaderSaverTest
[junit] Tests run: 2, Failures: 0, Errors: 0, Time elapsed: 0.009 sec
touch-failures-file:
touch-errors-file:
test-module:
prepare-exclude:
[echo] SAMSA exclude list: <http://hudson.zones.apache.org/hudson/job/Harmony-1.5-head-linux-x86_64-full-tests/ws/harmony/classlib/deploy/build/jdktools.samsa.exclude>
run-tests:
[echo] Running SAMSA tests
[echo] test.jre.home=<http://hudson.zones.apache.org/hudson/job/Harmony-1.5-head-linux-x86_64-full-tests/ws/harmony/target/hdk/jdk/jre>
[echo] Run jdk/bin/java -version in <http://hudson.zones.apache.org/hudson/job/Harmony-1.5-head-linux-x86_64-full-tests/ws/harmony/build/test_report>
[echo] Run jdk/bin/javac -version in <http://hudson.zones.apache.org/hudson/job/Harmony-1.5-head-linux-x86_64-full-tests/ws/harmony/build/test_report>
[exec] Eclipse Java Compiler 0.972_R35x, 3.5.1 release, Copyright IBM Corp 2000, 2009. All rights reserved.
[echo] Run jdk/bin/javah in <http://hudson.zones.apache.org/hudson/job/Harmony-1.5-head-linux-x86_64-full-tests/ws/harmony/build/test_report>
[exec] JNI-style header files generator.
[exec]
[exec] Usage: org.apache.harmony.tools.javah.Main [options] <class names>
[exec]
[exec] [options]
[exec] -bootclasspath <path> The given path will be prepended to
[exec] the default class path.
[exec]
[exec] -classpath <path> The given path will be appended to
[exec] the default class path.
[exec]
[exec] -o <file> All the output will be redirected into
[exec] the specified file.
[exec]
[exec] -d <directory> All the header files will be created in the specified
[exec] directory which will be created if it is necessary.
[exec]
[exec] -inner Inner classes will be processed automatically.
[exec]
[exec] -verbose Allows running commentary.
[exec]
[exec] <class names> A list of the fully qualified class names
[exec] separated by a space.
[exec] Result: 1
[echo] Run jdk/bin/javadoc in <http://hudson.zones.apache.org/hudson/job/Harmony-1.5-head-linux-x86_64-full-tests/ws/harmony/build/test_report>
[exec] JavaDoc is not implemented yet
[echo] Run jdk/bin/jarsigner in <http://hudson.zones.apache.org/hudson/job/Harmony-1.5-head-linux-x86_64-full-tests/ws/harmony/build/test_report>
[exec] JarSigner help.
[exec] Usage: jarsigner {options} JAR-file alias
[exec] jarsigner -verify {options} JAR-file
[exec]
[exec] -verify verify a signed JAR file
[exec] -keystore <keystore_path> location of the keystore
[exec] -storetype <keystore_type> type of the keystore
[exec] -storepass <keystore_password> keystore password
[exec] -keypass <key_password> private key password (if differs from <keystore_password>)
[exec] -signedjar <file_name> name of the signed JAR file
[exec] -sigfile <file_name> name of .SF and .DSA files
[exec] -verbose provide additional output
[exec] -silent provide as few output as possible
[exec] -certs display certificates (use with -verify and -verbose)
[exec] -tsa <TSA_URL> location of time-stamp authority
[exec] -tsacert <TSA_cert_alias> keystore alias of the TSA certificate
[exec] -proxy <host_address>{:<port>} proxy server host address and port, e.g. proxy.server.com:1234
[exec] -proxytype <type_name> type of the proxy server (HTTP or SOCKS)
[exec] -providerclass <class> class name of cryptographic service provider
[exec] -providername <name> provider name
[exec] -ksproviderclass <class> class name of cryptographic service provider for managing keystore
[exec] -ksprovidername <name> keystore provider name
[exec] -sigproviderclass <class> class name of cryptographic service provider for work with signatures
[exec] -sigprovidername <name> signature provider name
[exec] -certproviderclass <class> class name of cryptographic service provider for work with certificates
[exec] -certprovidername <name> certificate provider name
[exec] -mdproviderclass <class> class name of cryptographic service provider for work with message digests
[exec] -mdprovidername <name> message digest provider name
[echo] Run jdk/jre/bin/keytool -help in <http://hudson.zones.apache.org/hudson/job/Harmony-1.5-head-linux-x86_64-full-tests/ws/harmony/build/test_report>
[exec]
[exec] Keytool usage:
[exec] keytool {-<command_name>} {-<command_option>} {<option_value>}... -J<java_option>
[exec]
[exec] Known commands:
[exec] -certreq Generate certificate request
[exec] -checkcrl Check certificates revocation status
[exec] -convert Convert keystore to another format
[exec] -delete Remove entry from keystore
[exec] -export Export certificate to a file or stdout
[exec] -genkey Secret key or key pair generation
[exec] -help This help message or help on a command
[exec] -import Import a certificate (chain) or a CSR reply
[exec] -keyclone Duplicate a key entry
[exec] -keypasswd Change key password
[exec] -printcert Print to stdout a certificate from file
[exec] -selfcert Generate a self-signed certificate with existing key
[exec] -storepasswd Change keystore password
[exec] -verify Verify a certificate chain
[exec]
[exec] Help usage:
[exec] keytool -help {<command_name>}
[exec] E.g.: keytool -help genkey
[exec]
[echo] Run jdk/jre/bin/unpack200 in <http://hudson.zones.apache.org/hudson/job/Harmony-1.5-head-linux-x86_64-full-tests/ws/harmony/build/test_report>
[exec] Usage: unpack200 [-opt... | --option=value]... x.pack[.gz] y.jar
[exec] (For more information, run unpack200 --help)
[echo] Run jdk/jre/bin/pack200 in <http://hudson.zones.apache.org/hudson/job/Harmony-1.5-head-linux-x86_64-full-tests/ws/harmony/build/test_report>
[exec] Usage: pack200 [-opt... | --option=value]... x.pack[.gz] y.jar
[exec] (For more information, run pack200 --help)
test-module:
process-test-output:
-check-for-empty:
-process-empty:
process-empty:
full-report:
short-report:
gen-report:
check-test-result:
BUILD FAILED
<http://hudson.zones.apache.org/hudson/job/Harmony-1.5-head-linux-x86_64-full-tests/ws/harmony/build.xml>:983: The following error occurred while executing this line:
<http://hudson.zones.apache.org/hudson/job/Harmony-1.5-head-linux-x86_64-full-tests/ws/harmony/classlib/make/build-test.xml>:161: There were test errors.
Total time: 23 minutes 58 seconds
Archiving artifacts
Recording test results
Build failed in Hudson: Harmony-1.5-head-linux-x86_64-full-tests
#118
Posted by Apache Hudson Server <hu...@hudson.zones.apache.org>.
See <http://hudson.zones.apache.org/hudson/job/Harmony-1.5-head-linux-x86_64-full-tests/118/changes>
Changes:
[hindessm] Commit r925287 "Apply partial jdktools patch for HARMONY-6477
(Problems building jdktools modules in Eclipse)." uses a variable
bcel.jar.url which is not defined. This caused a build break. This
commit fixes this.
It also added a depends check so I've added a corresponding fetch.
------------------------------------------
[...truncated 25763 lines...]
[junit] STDOUT> StopDebuggee: started
[junit] STDOUT> TestedThread: started
[junit] STDOUT> TestedThread: Wait for 'Stop' command with NullPointerException...
[junit] STDOUT> StopDebuggee: Wait for TestedThread to finish...
[junit] [SYNC] Received message: ready
[junit] testStop001: get threadID to Stop...
[junit] testStop001: ID of the tested thread to Stop = 2032
[junit] testStop001: get throwable for Stop command...
[junit] testStop001: throwable = ObjectID: 1586
[junit] testStop001: send "Stop" command
[junit] testStop001: wait for Debuggee message about test status...
[junit] [SYNC] Waiting for any messsage
[junit] STDOUT> TestedThread: Exception is caught: java.lang.NullPointerException
[junit] STDOUT> TestedThread: PASSED: It is expected Exception
[junit] STDOUT> StopDebuggee: TestedThread finished
[junit] [SYNC] Received message: PASSED
[junit] testStop001: Received from Debuggee test status = PASSED
[junit] testStop001: PASSED
[junit] ----------------------------------------
[junit] [SYNC] Closed socket
[junit] Completed sync connection
[junit] Waiting for process exit
[junit] STDOUT> [SYNC] Message sent: PASSED
[junit] STDOUT> StopDebuggee: finishing...
[junit] STDOUT> [SYNC] Closed socket
[junit] Redirector completed: STDOUT
[junit] Redirector completed: STDERR
[junit] Finished debuggee with exit code: 0
[junit] Finished process
[junit] Waiting for redirectors finish
[junit] Finished redirectors
[junit] Closed JDWP connection with debuggee VM
[junit] <<<=====================================
[junit]
[junit]
[junit] Running org.apache.harmony.jpda.tests.jdwp.VirtualMachine.HoldEventsTest
[junit] Tests run: 1, Failures: 0, Errors: 0, Time elapsed: 61.591 sec
[junit] Output:
[junit]
[junit] =====================================>>>
[junit] Run: org.apache.harmony.jpda.tests.jdwp.VirtualMachine.HoldEventsTest.testHoldEvents001
[junit] ----------------------------------------
[junit] [SYNC] Binding socket on port: 0
[junit] [SYNC] Bound socket on port: 38395
[junit] Start listening on: null
[junit] Listening on: minerva.apache.org:54285
[junit] Launch: <http://hudson.zones.apache.org/hudson/job/Harmony-1.5-head-linux-x86_64-full-tests/ws/harmony/target/hdk/jdk/jre/bin/java> -cp "<http://hudson.zones.apache.org/hudson/job/Harmony-1.5-head-linux-x86_64-full-tests/ws/harmony/jdktools/build/tests/classes>:/home/hudson/.ant/lib/junit-4.6.jar:/usr/share/ant/lib/ant-launcher.jar:/usr/share/ant/lib/ant.jar:/usr/share/ant/lib/ant-junit.jar" -agentlib:jdwp=transport=dt_socket,address=minerva.apache.org:54285,server=n,suspend=y -Djpda.settings.verbose=true -Djpda.settings.syncPort=38395 org.apache.harmony.jpda.tests.jdwp.VirtualMachine.HoldEventsDebuggee
[junit] Launch process: <http://hudson.zones.apache.org/hudson/job/Harmony-1.5-head-linux-x86_64-full-tests/ws/harmony/target/hdk/jdk/jre/bin/java> -cp "<http://hudson.zones.apache.org/hudson/job/Harmony-1.5-head-linux-x86_64-full-tests/ws/harmony/jdktools/build/tests/classes>:/home/hudson/.ant/lib/junit-4.6.jar:/usr/share/ant/lib/ant-launcher.jar:/usr/share/ant/lib/ant.jar:/usr/share/ant/lib/ant-junit.jar" -agentlib:jdwp=transport=dt_socket,address=minerva.apache.org:54285,server=n,suspend=y -Djpda.settings.verbose=true -Djpda.settings.syncPort=38395 org.apache.harmony.jpda.tests.jdwp.VirtualMachine.HoldEventsDebuggee
[junit] Splitted command line: [<http://hudson.zones.apache.org/hudson/job/Harmony-1.5-head-linux-x86_64-full-tests/ws/harmony/target/hdk/jdk/jre/bin/java,> -cp, <http://hudson.zones.apache.org/hudson/job/Harmony-1.5-head-linux-x86_64-full-tests/ws/harmony/jdktools/build/tests/classes>:/home/hudson/.ant/lib/junit-4.6.jar:/usr/share/ant/lib/ant-launcher.jar:/usr/share/ant/lib/ant.jar:/usr/share/ant/lib/ant-junit.jar, -agentlib:jdwp=transport=dt_socket,address=minerva.apache.org:54285,server=n,suspend=y, -Djpda.settings.verbose=true, -Djpda.settings.syncPort=38395, org.apache.harmony.jpda.tests.jdwp.VirtualMachine.HoldEventsDebuggee]
[junit] Launched process
[junit] Start redirectors
[junit] Redirector started: STDERR
[junit] Started redirectors
[junit] Redirector started: STDOUT
[junit] Launched debuggee process
[junit] Accepting JDWP connection
[junit] Established transport connection
[junit] Established JDWP connection with debuggee VM
[junit] Received inital VM_INIT event
[junit] Adjusted VM-dependent type lengths
[junit] Resumed debuggee VM
[junit] [SYNC] Accepting socket connection
[junit] STDOUT> [SYNC] Attaching socket to: localhost:38395
[junit] [SYNC] Accepted socket connection
[junit] Established sync connection
[junit] ----------------------------------------
[junit] [SYNC] Waiting for message: ready
[junit] STDOUT> [SYNC] Attached socket
[junit] [SYNC] Received message: ready
[junit] send HoldEvents
[junit] allow to start thread
[junit] [SYNC] Message sent: continue
[junit] STDOUT> [SYNC] Message sent: ready
[junit] STDOUT> wait for SGNL_CONTINUE to start thread
[junit] STDOUT> [SYNC] Waiting for message: continue
[junit] STDOUT> [SYNC] Received message: continue
[junit] STDOUT> starting thread
[junit] no events were received
[junit] send ReleaseEvents
[junit] expected event received: org.apache.harmony.jpda.tests.framework.jdwp.EventPacket@a67d02ae
[junit] ----------------------------------------
[junit] [SYNC] Closed socket
[junit] Completed sync connection
[junit] Waiting for process exit
[junit] STDOUT> TestedThread: started
[junit] STDOUT> thread is finished
[junit] STDOUT> [SYNC] Closed socket
[junit] Redirector completed: STDOUT
[junit] Redirector completed: STDERR
[junit] Finished debuggee with exit code: 0
[junit] Finished process
[junit] Waiting for redirectors finish
[junit] Finished redirectors
[junit] Closed JDWP connection with debuggee VM
[junit] <<<=====================================
[junit]
[junit]
touch-failures-file:
touch-errors-file:
test-module:
build-tests:
[echo] Compiling TOOLS tests
[mkdir] Created dir: <http://hudson.zones.apache.org/hudson/job/Harmony-1.5-head-linux-x86_64-full-tests/ws/harmony/jdktools/modules/jretools/bin/test>
[hy.javac] Compiling 3 source files to <http://hudson.zones.apache.org/hudson/job/Harmony-1.5-head-linux-x86_64-full-tests/ws/harmony/jdktools/modules/jretools/bin/test>
[hy.javac] Since fork is false, ignoring memoryMaximumSize setting
prepare-exclude:
[echo] TOOLS exclude list: <http://hudson.zones.apache.org/hudson/job/Harmony-1.5-head-linux-x86_64-full-tests/ws/harmony/classlib/deploy/build/jretools.tools.exclude>
run-tests:
[echo] Running TOOLS tests
[echo] test.jre.home=<http://hudson.zones.apache.org/hudson/job/Harmony-1.5-head-linux-x86_64-full-tests/ws/harmony/target/hdk/jdk/jre>
[junit] Running org.apache.harmony.jretools.tests.keytool.GenKeyTest
[junit] Tests run: 1, Failures: 0, Errors: 0, Time elapsed: 1.618 sec
[junit] Running org.apache.harmony.jretools.tests.toolutils.KeyStoreLoaderSaverTest
[junit] Tests run: 2, Failures: 0, Errors: 0, Time elapsed: 0.01 sec
touch-failures-file:
touch-errors-file:
test-module:
prepare-exclude:
[echo] SAMSA exclude list: <http://hudson.zones.apache.org/hudson/job/Harmony-1.5-head-linux-x86_64-full-tests/ws/harmony/classlib/deploy/build/jdktools.samsa.exclude>
run-tests:
[echo] Running SAMSA tests
[echo] test.jre.home=<http://hudson.zones.apache.org/hudson/job/Harmony-1.5-head-linux-x86_64-full-tests/ws/harmony/target/hdk/jdk/jre>
[echo] Run jdk/bin/java -version in <http://hudson.zones.apache.org/hudson/job/Harmony-1.5-head-linux-x86_64-full-tests/ws/harmony/build/test_report>
[echo] Run jdk/bin/javac -version in <http://hudson.zones.apache.org/hudson/job/Harmony-1.5-head-linux-x86_64-full-tests/ws/harmony/build/test_report>
[exec] Eclipse Java Compiler 0.972_R35x, 3.5.1 release, Copyright IBM Corp 2000, 2009. All rights reserved.
[echo] Run jdk/bin/javah in <http://hudson.zones.apache.org/hudson/job/Harmony-1.5-head-linux-x86_64-full-tests/ws/harmony/build/test_report>
[exec] JNI-style header files generator.
[exec]
[exec] Usage: org.apache.harmony.tools.javah.Main [options] <class names>
[exec]
[exec] [options]
[exec] -bootclasspath <path> The given path will be prepended to
[exec] the default class path.
[exec]
[exec] -classpath <path> The given path will be appended to
[exec] the default class path.
[exec]
[exec] -o <file> All the output will be redirected into
[exec] the specified file.
[exec]
[exec] -d <directory> All the header files will be created in the specified
[exec] directory which will be created if it is necessary.
[exec]
[exec] -inner Inner classes will be processed automatically.
[exec]
[exec] -verbose Allows running commentary.
[exec]
[exec] <class names> A list of the fully qualified class names
[exec] separated by a space.
[exec] Result: 1
[echo] Run jdk/bin/javadoc in <http://hudson.zones.apache.org/hudson/job/Harmony-1.5-head-linux-x86_64-full-tests/ws/harmony/build/test_report>
[exec] JavaDoc is not implemented yet
[echo] Run jdk/bin/jarsigner in <http://hudson.zones.apache.org/hudson/job/Harmony-1.5-head-linux-x86_64-full-tests/ws/harmony/build/test_report>
[exec] JarSigner help.
[exec] Usage: jarsigner {options} JAR-file alias
[exec] jarsigner -verify {options} JAR-file
[exec]
[exec] -verify verify a signed JAR file
[exec] -keystore <keystore_path> location of the keystore
[exec] -storetype <keystore_type> type of the keystore
[exec] -storepass <keystore_password> keystore password
[exec] -keypass <key_password> private key password (if differs from <keystore_password>)
[exec] -signedjar <file_name> name of the signed JAR file
[exec] -sigfile <file_name> name of .SF and .DSA files
[exec] -verbose provide additional output
[exec] -silent provide as few output as possible
[exec] -certs display certificates (use with -verify and -verbose)
[exec] -tsa <TSA_URL> location of time-stamp authority
[exec] -tsacert <TSA_cert_alias> keystore alias of the TSA certificate
[exec] -proxy <host_address>{:<port>} proxy server host address and port, e.g. proxy.server.com:1234
[exec] -proxytype <type_name> type of the proxy server (HTTP or SOCKS)
[exec] -providerclass <class> class name of cryptographic service provider
[exec] -providername <name> provider name
[exec] -ksproviderclass <class> class name of cryptographic service provider for managing keystore
[exec] -ksprovidername <name> keystore provider name
[exec] -sigproviderclass <class> class name of cryptographic service provider for work with signatures
[exec] -sigprovidername <name> signature provider name
[exec] -certproviderclass <class> class name of cryptographic service provider for work with certificates
[exec] -certprovidername <name> certificate provider name
[exec] -mdproviderclass <class> class name of cryptographic service provider for work with message digests
[exec] -mdprovidername <name> message digest provider name
[echo] Run jdk/jre/bin/keytool -help in <http://hudson.zones.apache.org/hudson/job/Harmony-1.5-head-linux-x86_64-full-tests/ws/harmony/build/test_report>
[exec]
[exec] Keytool usage:
[exec] keytool {-<command_name>} {-<command_option>} {<option_value>}... -J<java_option>
[exec]
[exec] Known commands:
[exec] -certreq Generate certificate request
[exec] -checkcrl Check certificates revocation status
[exec] -convert Convert keystore to another format
[exec] -delete Remove entry from keystore
[exec] -export Export certificate to a file or stdout
[exec] -genkey Secret key or key pair generation
[exec] -help This help message or help on a command
[exec] -import Import a certificate (chain) or a CSR reply
[exec] -keyclone Duplicate a key entry
[exec] -keypasswd Change key password
[exec] -printcert Print to stdout a certificate from file
[exec] -selfcert Generate a self-signed certificate with existing key
[exec] -storepasswd Change keystore password
[exec] -verify Verify a certificate chain
[exec]
[exec] Help usage:
[exec] keytool -help {<command_name>}
[exec] E.g.: keytool -help genkey
[exec]
[echo] Run jdk/jre/bin/unpack200 in <http://hudson.zones.apache.org/hudson/job/Harmony-1.5-head-linux-x86_64-full-tests/ws/harmony/build/test_report>
[exec] Usage: unpack200 [-opt... | --option=value]... x.pack[.gz] y.jar
[exec] (For more information, run unpack200 --help)
[echo] Run jdk/jre/bin/pack200 in <http://hudson.zones.apache.org/hudson/job/Harmony-1.5-head-linux-x86_64-full-tests/ws/harmony/build/test_report>
[exec] Usage: pack200 [-opt... | --option=value]... x.pack[.gz] y.jar
[exec] (For more information, run pack200 --help)
test-module:
process-test-output:
-check-for-empty:
-process-empty:
process-empty:
full-report:
short-report:
gen-report:
check-test-result:
BUILD FAILED
<http://hudson.zones.apache.org/hudson/job/Harmony-1.5-head-linux-x86_64-full-tests/ws/harmony/build.xml>:983: The following error occurred while executing this line:
<http://hudson.zones.apache.org/hudson/job/Harmony-1.5-head-linux-x86_64-full-tests/ws/harmony/classlib/make/build-test.xml>:161: There were test errors.
Total time: 23 minutes 56 seconds
Archiving artifacts
Recording test results
Build failed in Hudson: Harmony-1.5-head-linux-x86_64-full-tests
#117
Posted by Apache Hudson Server <hu...@hudson.zones.apache.org>.
See <http://hudson.zones.apache.org/hudson/job/Harmony-1.5-head-linux-x86_64-full-tests/117/changes>
Changes:
[odeakin] Apply partial jdktools patch for HARMONY-6477 (Problems building jdktools modules in Eclipse).
------------------------------------------
[...truncated 4390 lines...]
[mkdir] Created dir: <http://hudson.zones.apache.org/hudson/job/Harmony-1.5-head-linux-x86_64-full-tests/ws/harmony/drlvm/build/linux_x86_64_gcc_release/semis/vmcore/bin>
[mkdir] Created dir: <http://hudson.zones.apache.org/hudson/job/Harmony-1.5-head-linux-x86_64-full-tests/ws/harmony/drlvm/build/linux_x86_64_gcc_release/semis/vmcore/obj>
[compile-cc] 173 total files to be compiled.
[compile-cc] <http://hudson.zones.apache.org/hudson/job/Harmony-1.5-head-linux-x86_64-full-tests/ws/harmony/drlvm/vm/vmcore/src/util/linux/crash_dump_os.cpp>: In function ‘void cd_parse_module_info(native_module_t*, void*)’:
[compile-cc] <http://hudson.zones.apache.org/hudson/job/Harmony-1.5-head-linux-x86_64-full-tests/ws/harmony/drlvm/vm/vmcore/src/util/linux/crash_dump_os.cpp>:70: warning: format ‘%016llx’ expects type ‘long long unsigned int’, but argument 3 has type ‘size_t’
[compile-cc] <http://hudson.zones.apache.org/hudson/job/Harmony-1.5-head-linux-x86_64-full-tests/ws/harmony/drlvm/vm/vmcore/src/util/linux/crash_dump_os.cpp>:70: warning: format ‘%016llx’ expects type ‘long long unsigned int’, but argument 4 has type ‘long unsigned int’
[compile-cc] <http://hudson.zones.apache.org/hudson/job/Harmony-1.5-head-linux-x86_64-full-tests/ws/harmony/drlvm/vm/vmcore/src/util/linux/crash_dump_os.cpp>:79: warning: format ‘%016llx’ expects type ‘long long unsigned int’, but argument 4 has type ‘size_t’
[compile-cc] <http://hudson.zones.apache.org/hudson/job/Harmony-1.5-head-linux-x86_64-full-tests/ws/harmony/drlvm/vm/vmcore/src/util/linux/crash_dump_os.cpp>:79: warning: format ‘%016llx’ expects type ‘long long unsigned int’, but argument 5 has type ‘long unsigned int’
[compile-cc] <http://hudson.zones.apache.org/hudson/job/Harmony-1.5-head-linux-x86_64-full-tests/ws/harmony/drlvm/vm/vmcore/src/ncai/ncai_thread.cpp>: In function ‘ncaiError ncaiGetThreadInfo(ncaiEnv*, _ncaiThread*, ncaiThreadInfo*)’:
[compile-cc] <http://hudson.zones.apache.org/hudson/job/Harmony-1.5-head-linux-x86_64-full-tests/ws/harmony/drlvm/vm/vmcore/src/ncai/ncai_thread.cpp>:153: warning: format ‘%04X’ expects type ‘unsigned int’, but argument 4 has type ‘IDATA’
[compile-cc] <http://hudson.zones.apache.org/hudson/job/Harmony-1.5-head-linux-x86_64-full-tests/ws/harmony/drlvm/vm/vmcore/src/lil/lil.cpp>: In function ‘void lil_print_instruction(FILE*, LilInstruction*)’:
[compile-cc] <http://hudson.zones.apache.org/hudson/job/Harmony-1.5-head-linux-x86_64-full-tests/ws/harmony/drlvm/vm/vmcore/src/lil/lil.cpp>:2380: warning: format ‘%p’ expects type ‘void*’, but argument 4 has type ‘frame_type’
[compile-cc] <http://hudson.zones.apache.org/hudson/job/Harmony-1.5-head-linux-x86_64-full-tests/ws/harmony/drlvm/vm/vmcore/src/kernel_classes/native/Runtime_lnx.cpp>: In function ‘void Java_java_lang_Runtime_00024SubProcess_createProcess0(JNIEnv*, _jobject*, _jobject*, _jobject*, _jobject*, _jobject*)’:
[compile-cc] <http://hudson.zones.apache.org/hudson/job/Harmony-1.5-head-linux-x86_64-full-tests/ws/harmony/drlvm/vm/vmcore/src/kernel_classes/native/Runtime_lnx.cpp>:179: warning: ignoring return value of ‘ssize_t write(int, const void*, size_t)’, declared with attribute warn_unused_result
[compile-cc] <http://hudson.zones.apache.org/hudson/job/Harmony-1.5-head-linux-x86_64-full-tests/ws/harmony/drlvm/vm/vmcore/src/kernel_classes/native/Runtime_lnx.cpp>:213: warning: ignoring return value of ‘ssize_t write(int, const void*, size_t)’, declared with attribute warn_unused_result
[compile-cc] <http://hudson.zones.apache.org/hudson/job/Harmony-1.5-head-linux-x86_64-full-tests/ws/harmony/drlvm/vm/vmcore/src/util/crash_dump.cpp>: In function ‘void cd_print_threads_info()’:
[compile-cc] <http://hudson.zones.apache.org/hudson/job/Harmony-1.5-head-linux-x86_64-full-tests/ws/harmony/drlvm/vm/vmcore/src/util/crash_dump.cpp>:497: warning: format ‘%p’ expects type ‘void*’, but argument 4 has type ‘pthread_t’
[compile-cc] <http://hudson.zones.apache.org/hudson/job/Harmony-1.5-head-linux-x86_64-full-tests/ws/harmony/drlvm/vm/vmcore/src/util/crash_dump.cpp>:505: warning: format ‘%p’ expects type ‘void*’, but argument 4 has type ‘pthread_t’
[cc] 0 total files to be compiled.
[cc] Starting link
[copy] Copying 1 file to <http://hudson.zones.apache.org/hudson/job/Harmony-1.5-head-linux-x86_64-full-tests/ws/harmony/drlvm/build/linux_x86_64_gcc_release/deploy/jdk/jre/bin/default>
[echo] Copying files for internationalization...
[copy] Copying 1 file to <http://hudson.zones.apache.org/hudson/job/Harmony-1.5-head-linux-x86_64-full-tests/ws/harmony/drlvm/build/linux_x86_64_gcc_release/deploy/jdk/jre/bin/default>
interpreter:
-plugin-cpptasks:
[echo] Checking for <http://hudson.zones.apache.org/hudson/job/Harmony-1.5-head-linux-x86_64-full-tests/ws/harmony/common_resources/depends/jars/cpptasks-1.0b4/cpptasks.jar>
setup-native-build:
init-compression-mode:
-common-vm:
build:
[echo] ## Building 'interpreter'
[mkdir] Created dir: <http://hudson.zones.apache.org/hudson/job/Harmony-1.5-head-linux-x86_64-full-tests/ws/harmony/drlvm/build/linux_x86_64_gcc_release/semis/interpreter/bin>
[mkdir] Created dir: <http://hudson.zones.apache.org/hudson/job/Harmony-1.5-head-linux-x86_64-full-tests/ws/harmony/drlvm/build/linux_x86_64_gcc_release/semis/interpreter/obj>
[compile-cc] 6 total files to be compiled.
[cc] 0 total files to be compiled.
[cc] Starting link
[copy] Copying 1 file to <http://hudson.zones.apache.org/hudson/job/Harmony-1.5-head-linux-x86_64-full-tests/ws/harmony/drlvm/build/linux_x86_64_gcc_release/deploy/jdk/jre/bin/default>
[copy] Copying 1 file to <http://hudson.zones.apache.org/hudson/job/Harmony-1.5-head-linux-x86_64-full-tests/ws/harmony/drlvm/build/linux_x86_64_gcc_release/deploy/jdk/jre/bin/default>
kernel:
check-setup:
setup:
[echo] Checking for <http://hudson.zones.apache.org/hudson/job/Harmony-1.5-head-linux-x86_64-full-tests/ws/harmony/common_resources/depends/jars/antlr-2.7.5/antlr-2.7.5.jar>
[echo] Checking for <http://hudson.zones.apache.org/hudson/job/Harmony-1.5-head-linux-x86_64-full-tests/ws/harmony/common_resources/depends/jars/vmmagic/vmmagic-20070207.jar>
[copy] Copying 1 file to <http://hudson.zones.apache.org/hudson/job/Harmony-1.5-head-linux-x86_64-full-tests/ws/harmony/drlvm/build/linux_x86_64_gcc_release/deploy/jdk/jre/bin/default>
[copy] Copying 1 file to <http://hudson.zones.apache.org/hudson/job/Harmony-1.5-head-linux-x86_64-full-tests/ws/harmony/drlvm/build/linux_x86_64_gcc_release/deploy/jdk/jre/bin/default>
build:
[mkdir] Created dir: <http://hudson.zones.apache.org/hudson/job/Harmony-1.5-head-linux-x86_64-full-tests/ws/harmony/drlvm/build/linux_x86_64_gcc_release/semis/kernel/classes>
[hy.javac] Compiling 87 source files to <http://hudson.zones.apache.org/hudson/job/Harmony-1.5-head-linux-x86_64-full-tests/ws/harmony/drlvm/build/linux_x86_64_gcc_release/semis/kernel/classes>
[hy.javac] Since fork is false, ignoring memoryMaximumSize setting
[hy.jar.bin] Building jar: <http://hudson.zones.apache.org/hudson/job/Harmony-1.5-head-linux-x86_64-full-tests/ws/harmony/drlvm/build/linux_x86_64_gcc_release/deploy/jdk/jre/bin/default/kernel.jar>
[hy.jar.src] Building jar: <http://hudson.zones.apache.org/hudson/job/Harmony-1.5-head-linux-x86_64-full-tests/ws/harmony/drlvm/build/linux_x86_64_gcc_release/deploy/jdk/jre/bin/default/kernel-src.jar>
em:
-plugin-cpptasks:
[echo] Checking for <http://hudson.zones.apache.org/hudson/job/Harmony-1.5-head-linux-x86_64-full-tests/ws/harmony/common_resources/depends/jars/cpptasks-1.0b4/cpptasks.jar>
setup-native-build:
init-compression-mode:
-common-vm:
build:
[echo] ## Building 'em'
[mkdir] Created dir: <http://hudson.zones.apache.org/hudson/job/Harmony-1.5-head-linux-x86_64-full-tests/ws/harmony/drlvm/build/linux_x86_64_gcc_release/semis/em/bin>
[mkdir] Created dir: <http://hudson.zones.apache.org/hudson/job/Harmony-1.5-head-linux-x86_64-full-tests/ws/harmony/drlvm/build/linux_x86_64_gcc_release/semis/em/obj>
[cc] 7 total files to be compiled.
[cc] <http://hudson.zones.apache.org/hudson/job/Harmony-1.5-head-linux-x86_64-full-tests/ws/harmony/drlvm/vm/em/src/EdgeProfileCollector.cpp>: In member function ‘void EdgeMethodProfile::dump(const char*)’:
[cc] <http://hudson.zones.apache.org/hudson/job/Harmony-1.5-head-linux-x86_64-full-tests/ws/harmony/drlvm/vm/em/src/EdgeProfileCollector.cpp>:173: warning: format ‘%d’ expects type ‘int’, but argument 5 has type ‘size_t’
[cc] Starting link
[copy] Copying 1 file to <http://hudson.zones.apache.org/hudson/job/Harmony-1.5-head-linux-x86_64-full-tests/ws/harmony/drlvm/build/linux_x86_64_gcc_release/deploy/jdk/jre/bin/default>
vmi:
-plugin-cpptasks:
[echo] Checking for <http://hudson.zones.apache.org/hudson/job/Harmony-1.5-head-linux-x86_64-full-tests/ws/harmony/common_resources/depends/jars/cpptasks-1.0b4/cpptasks.jar>
setup-native-build:
init-compression-mode:
-common-vm:
build:
[echo] ## Building 'vmi'
[mkdir] Created dir: <http://hudson.zones.apache.org/hudson/job/Harmony-1.5-head-linux-x86_64-full-tests/ws/harmony/drlvm/build/linux_x86_64_gcc_release/semis/vmi/bin>
[mkdir] Created dir: <http://hudson.zones.apache.org/hudson/job/Harmony-1.5-head-linux-x86_64-full-tests/ws/harmony/drlvm/build/linux_x86_64_gcc_release/semis/vmi/obj>
[cc] 2 total files to be compiled.
[cc] Starting link
[copy] Copying 1 file to <http://hudson.zones.apache.org/hudson/job/Harmony-1.5-head-linux-x86_64-full-tests/ws/harmony/drlvm/build/linux_x86_64_gcc_release/deploy/jdk/jre/bin/default>
jitrino:
-plugin-cpptasks:
[echo] Checking for <http://hudson.zones.apache.org/hudson/job/Harmony-1.5-head-linux-x86_64-full-tests/ws/harmony/common_resources/depends/jars/cpptasks-1.0b4/cpptasks.jar>
setup-native-build:
init-compression-mode:
-common-vm:
-init-win:
-init-unix:
build:
[echo] ## Building 'jitrino'
[mkdir] Created dir: <http://hudson.zones.apache.org/hudson/job/Harmony-1.5-head-linux-x86_64-full-tests/ws/harmony/drlvm/build/linux_x86_64_gcc_release/semis/jitrino/bin>
[mkdir] Created dir: <http://hudson.zones.apache.org/hudson/job/Harmony-1.5-head-linux-x86_64-full-tests/ws/harmony/drlvm/build/linux_x86_64_gcc_release/semis/jitrino/obj>
[compile-cc] 154 total files to be compiled.
[cc] 0 total files to be compiled.
[cc] Starting link
[copy] Copying 1 file to <http://hudson.zones.apache.org/hudson/job/Harmony-1.5-head-linux-x86_64-full-tests/ws/harmony/drlvm/build/linux_x86_64_gcc_release/deploy/jdk/jre/bin/default>
[echo] Copying configuration files for jitrino...
[copy] Copying 6 files to <http://hudson.zones.apache.org/hudson/job/Harmony-1.5-head-linux-x86_64-full-tests/ws/harmony/drlvm/build/linux_x86_64_gcc_release/deploy/jdk/jre/bin/default>
gc_gen:
build:
-plugin-cpptasks:
[echo] Checking for <http://hudson.zones.apache.org/hudson/job/Harmony-1.5-head-linux-x86_64-full-tests/ws/harmony/common_resources/depends/jars/cpptasks-1.0b4/cpptasks.jar>
setup-native-build:
init-compression-mode:
-common-vm:
init:
build-uncompressed:
[echo] ## Building 'gc_gen_uncomp'
[mkdir] Created dir: <http://hudson.zones.apache.org/hudson/job/Harmony-1.5-head-linux-x86_64-full-tests/ws/harmony/drlvm/build/linux_x86_64_gcc_release/semis/gc_gen_uncomp/bin>
[mkdir] Created dir: <http://hudson.zones.apache.org/hudson/job/Harmony-1.5-head-linux-x86_64-full-tests/ws/harmony/drlvm/build/linux_x86_64_gcc_release/semis/gc_gen_uncomp/obj>
[compile-cc] 76 total files to be compiled.
[cc] 0 total files to be compiled.
[cc] Starting link
[copy] Copying 1 file to <http://hudson.zones.apache.org/hudson/job/Harmony-1.5-head-linux-x86_64-full-tests/ws/harmony/drlvm/build/linux_x86_64_gcc_release/deploy/jdk/jre/bin/default>
-plugin-cpptasks:
[echo] Checking for <http://hudson.zones.apache.org/hudson/job/Harmony-1.5-head-linux-x86_64-full-tests/ws/harmony/common_resources/depends/jars/cpptasks-1.0b4/cpptasks.jar>
setup-native-build:
init-compression-mode:
-common-vm:
init:
build-compressed:
[echo] ## Building 'gc_gen'
[mkdir] Created dir: <http://hudson.zones.apache.org/hudson/job/Harmony-1.5-head-linux-x86_64-full-tests/ws/harmony/drlvm/build/linux_x86_64_gcc_release/semis/gc_gen/bin>
[mkdir] Created dir: <http://hudson.zones.apache.org/hudson/job/Harmony-1.5-head-linux-x86_64-full-tests/ws/harmony/drlvm/build/linux_x86_64_gcc_release/semis/gc_gen/obj>
[compile-cc] 76 total files to be compiled.
[compile-cc] <http://hudson.zones.apache.org/hudson/job/Harmony-1.5-head-linux-x86_64-full-tests/ws/harmony/drlvm/vm/gc_gen/src/common/gc_for_barrier.cpp>: In function ‘Boolean gc_heap_copy_object_array(void*, unsigned int, void*, unsigned int, unsigned int)’:
[compile-cc] <http://hudson.zones.apache.org/hudson/job/Harmony-1.5-head-linux-x86_64-full-tests/ws/harmony/drlvm/vm/gc_gen/src/common/gc_for_barrier.cpp>:313: warning: NULL used in arithmetic
[cc] 0 total files to be compiled.
[cc] Starting link
[copy] Copying 1 file to <http://hudson.zones.apache.org/hudson/job/Harmony-1.5-head-linux-x86_64-full-tests/ws/harmony/drlvm/build/linux_x86_64_gcc_release/deploy/jdk/jre/bin/default>
[mkdir] Created dir: <http://hudson.zones.apache.org/hudson/job/Harmony-1.5-head-linux-x86_64-full-tests/ws/harmony/drlvm/build/linux_x86_64_gcc_release/semis/gc_gen/classes>
[hy.javac] Compiling 1 source file to <http://hudson.zones.apache.org/hudson/job/Harmony-1.5-head-linux-x86_64-full-tests/ws/harmony/drlvm/build/linux_x86_64_gcc_release/semis/gc_gen/classes>
[hy.javac] Since fork is false, ignoring memoryMaximumSize setting
[hy.jar.bin] Building jar: <http://hudson.zones.apache.org/hudson/job/Harmony-1.5-head-linux-x86_64-full-tests/ws/harmony/drlvm/build/linux_x86_64_gcc_release/deploy/jdk/jre/bin/default/gc_gen.jar>
[hy.jar.src] Building jar: <http://hudson.zones.apache.org/hudson/job/Harmony-1.5-head-linux-x86_64-full-tests/ws/harmony/drlvm/build/linux_x86_64_gcc_release/deploy/jdk/jre/bin/default/gc_gen-src.jar>
deploy:
[copy] Copying 6 files to <http://hudson.zones.apache.org/hudson/job/Harmony-1.5-head-linux-x86_64-full-tests/ws/harmony/drlvm/build/linux_x86_64_gcc_release/deploy/jdk/include>
[copy] Copying 1 file to <http://hudson.zones.apache.org/hudson/job/Harmony-1.5-head-linux-x86_64-full-tests/ws/harmony/drlvm/build/linux_x86_64_gcc_release/deploy/jdk/jre/bin>
[copy] Copying 1 file to <http://hudson.zones.apache.org/hudson/job/Harmony-1.5-head-linux-x86_64-full-tests/ws/harmony/drlvm/build/linux_x86_64_gcc_release/deploy/jdk/jre/bin/default>
[copy] Copying 1 file to <http://hudson.zones.apache.org/hudson/job/Harmony-1.5-head-linux-x86_64-full-tests/ws/harmony/drlvm/build/linux_x86_64_gcc_release/deploy/jdk/jre>
deploy-relocate:
deploy-canonical:
[delete] Deleting directory <http://hudson.zones.apache.org/hudson/job/Harmony-1.5-head-linux-x86_64-full-tests/ws/harmony/drlvm/deploy>
[mkdir] Created dir: <http://hudson.zones.apache.org/hudson/job/Harmony-1.5-head-linux-x86_64-full-tests/ws/harmony/drlvm/deploy>
[copy] Copying 326 files to <http://hudson.zones.apache.org/hudson/job/Harmony-1.5-head-linux-x86_64-full-tests/ws/harmony/drlvm/deploy>
build:
auto-fetch-commonresources:
build-commonresources:
auto-fetch-jdktools-libs:
build-jdktools:
build-java:
[echo]
[echo] ========================================
[echo] Building Java component archives...
[echo] ========================================
[echo]
-prepare-depends:
check:
[echo] Checking for <http://hudson.zones.apache.org/hudson/job/Harmony-1.5-head-linux-x86_64-full-tests/ws/harmony/common_resources/depends/jars/ecj_3.5.1/ecj-3.5.1.jar>
[echo] Checking for <http://hudson.zones.apache.org/hudson/job/Harmony-1.5-head-linux-x86_64-full-tests/ws/harmony/common_resources/depends/jars/junit_4.6/junit-4.6.jar>
[echo] Checking for <http://hudson.zones.apache.org/hudson/job/Harmony-1.5-head-linux-x86_64-full-tests/ws/harmony/common_resources/depends/jars/hamcrest-library_1.1/hamcrest-library-1.1.jar>
[echo] polling jdktools/*.xml,jpda/*.xml,jretools/*.xml,samsa/*.xml
check-depends:
[echo] Checking for <http://hudson.zones.apache.org/hudson/job/Harmony-1.5-head-linux-x86_64-full-tests/ws/harmony/common_resources/depends/jars/eclipse-JDT-3.5.1/jdi.jar>
[echo] Checking for <http://hudson.zones.apache.org/hudson/job/Harmony-1.5-head-linux-x86_64-full-tests/ws/harmony/common_resources/depends/jars/eclipse-JDT-3.5.1/jdimodel.jar>
[echo] Checking for <http://hudson.zones.apache.org/hudson/job/Harmony-1.5-head-linux-x86_64-full-tests/ws/harmony/common_resources/depends/jars/eclipse-ICU4J/com.ibm.icu.base_3.6.1.v20070417.jar>
[echo] Checking for <http://hudson.zones.apache.org/hudson/job/Harmony-1.5-head-linux-x86_64-full-tests/ws/harmony/common_resources/depends/jars/ecj_3.5.1/ecj-3.5.1.jar>
[echo] Checking for <http://hudson.zones.apache.org/hudson/job/Harmony-1.5-head-linux-x86_64-full-tests/ws/harmony/common_resources/depends/jars/bcel-5.2/bcel-5.2.jar>
BUILD FAILED
<http://hudson.zones.apache.org/hudson/job/Harmony-1.5-head-linux-x86_64-full-tests/ws/harmony/build.xml>:599: The following error occurred while executing this line:
<http://hudson.zones.apache.org/hudson/job/Harmony-1.5-head-linux-x86_64-full-tests/ws/harmony/jdktools/build.xml>:82: The following error occurred while executing this line:
<http://hudson.zones.apache.org/hudson/job/Harmony-1.5-head-linux-x86_64-full-tests/ws/harmony/jdktools/make/build-java.xml>:76: The following error occurred while executing this line:
<http://hudson.zones.apache.org/hudson/job/Harmony-1.5-head-linux-x86_64-full-tests/ws/harmony/jdktools/make/depends.xml>:36: The following error occurred while executing this line:
<http://hudson.zones.apache.org/hudson/job/Harmony-1.5-head-linux-x86_64-full-tests/ws/harmony/common_resources/make/depends.xml>:66: The following error occurred while executing this line:
<http://hudson.zones.apache.org/hudson/job/Harmony-1.5-head-linux-x86_64-full-tests/ws/harmony/common_resources/make/depends.xml>:78: The following error occurred while executing this line:
<http://hudson.zones.apache.org/hudson/job/Harmony-1.5-head-linux-x86_64-full-tests/ws/harmony/jdktools/modules/jdktools/build.xml>:42: The following error occurred while executing this line:
<http://hudson.zones.apache.org/hudson/job/Harmony-1.5-head-linux-x86_64-full-tests/ws/harmony/common_resources/make/depends.xml>:214: ...
Missing dependency. The file from:
${bcel.jar.url}
should be downloaded (extracted) to:
<http://hudson.zones.apache.org/hudson/job/Harmony-1.5-head-linux-x86_64-full-tests/ws/harmony/common_resources/depends/jars/bcel-5.2/bcel-5.2.jar>
Run "ant fetch-depends" to automatically fetch dependencies.
Note: Some of Harmony's dependencies are licensed under terms other
than the Apache License v2.
Total time: 11 minutes 33 seconds
Archiving artifacts
Recording test results
Build failed in Hudson: Harmony-1.5-head-linux-x86_64-full-tests
#116
Posted by Apache Hudson Server <hu...@hudson.zones.apache.org>.
See <http://hudson.zones.apache.org/hudson/job/Harmony-1.5-head-linux-x86_64-full-tests/116/changes>
Changes:
[odeakin] Apply classlib patch for HARMONY-6477 (Problems building jdktools modules in Eclipse).
------------------------------------------
[...truncated 26019 lines...]
[junit] STDOUT> TestedThread: started
[junit] STDOUT> TestedThread: Wait for 'Stop' command with NullPointerException...
[junit] STDOUT> StopDebuggee: Wait for TestedThread to finish...
[junit] STDOUT> [SYNC] Message sent: ready
[junit] [SYNC] Received message: ready
[junit] testStop001: get threadID to Stop...
[junit] testStop001: ID of the tested thread to Stop = 2032
[junit] testStop001: get throwable for Stop command...
[junit] testStop001: throwable = ObjectID: 1586
[junit] testStop001: send "Stop" command
[junit] STDOUT> TestedThread: Exception is caught: java.lang.NullPointerException
[junit] STDOUT> TestedThread: PASSED: It is expected Exception
[junit] testStop001: wait for Debuggee message about test status...
[junit] [SYNC] Waiting for any messsage
[junit] STDOUT> StopDebuggee: TestedThread finished
[junit] [SYNC] Received message: PASSED
[junit] STDOUT> [SYNC] Message sent: PASSED
[junit] testStop001: Received from Debuggee test status = PASSED
[junit] testStop001: PASSED
[junit] ----------------------------------------
[junit] [SYNC] Closed socket
[junit] STDOUT> StopDebuggee: finishing...
[junit] Completed sync connection
[junit] Waiting for process exit
[junit] STDOUT> [SYNC] Closed socket
[junit] Redirector completed: STDOUT
[junit] Redirector completed: STDERR
[junit] Finished debuggee with exit code: 0
[junit] Finished process
[junit] Waiting for redirectors finish
[junit] Finished redirectors
[junit] Closed JDWP connection with debuggee VM
[junit] <<<=====================================
[junit]
[junit]
[junit] Running org.apache.harmony.jpda.tests.jdwp.VirtualMachine.HoldEventsTest
[junit] Tests run: 1, Failures: 0, Errors: 0, Time elapsed: 61.589 sec
[junit] Output:
[junit]
[junit] =====================================>>>
[junit] Run: org.apache.harmony.jpda.tests.jdwp.VirtualMachine.HoldEventsTest.testHoldEvents001
[junit] ----------------------------------------
[junit] [SYNC] Binding socket on port: 0
[junit] [SYNC] Bound socket on port: 60097
[junit] Start listening on: null
[junit] Listening on: minerva.apache.org:53498
[junit] Launch: <http://hudson.zones.apache.org/hudson/job/Harmony-1.5-head-linux-x86_64-full-tests/ws/harmony/target/hdk/jdk/jre/bin/java> -cp "<http://hudson.zones.apache.org/hudson/job/Harmony-1.5-head-linux-x86_64-full-tests/ws/harmony/jdktools/build/tests/classes>:/home/hudson/.ant/lib/junit-4.6.jar:/usr/share/ant/lib/ant-launcher.jar:/usr/share/ant/lib/ant.jar:/usr/share/ant/lib/ant-junit.jar" -agentlib:jdwp=transport=dt_socket,address=minerva.apache.org:53498,server=n,suspend=y -Djpda.settings.verbose=true -Djpda.settings.syncPort=60097 org.apache.harmony.jpda.tests.jdwp.VirtualMachine.HoldEventsDebuggee
[junit] Launch process: <http://hudson.zones.apache.org/hudson/job/Harmony-1.5-head-linux-x86_64-full-tests/ws/harmony/target/hdk/jdk/jre/bin/java> -cp "<http://hudson.zones.apache.org/hudson/job/Harmony-1.5-head-linux-x86_64-full-tests/ws/harmony/jdktools/build/tests/classes>:/home/hudson/.ant/lib/junit-4.6.jar:/usr/share/ant/lib/ant-launcher.jar:/usr/share/ant/lib/ant.jar:/usr/share/ant/lib/ant-junit.jar" -agentlib:jdwp=transport=dt_socket,address=minerva.apache.org:53498,server=n,suspend=y -Djpda.settings.verbose=true -Djpda.settings.syncPort=60097 org.apache.harmony.jpda.tests.jdwp.VirtualMachine.HoldEventsDebuggee
[junit] Splitted command line: [<http://hudson.zones.apache.org/hudson/job/Harmony-1.5-head-linux-x86_64-full-tests/ws/harmony/target/hdk/jdk/jre/bin/java,> -cp, <http://hudson.zones.apache.org/hudson/job/Harmony-1.5-head-linux-x86_64-full-tests/ws/harmony/jdktools/build/tests/classes>:/home/hudson/.ant/lib/junit-4.6.jar:/usr/share/ant/lib/ant-launcher.jar:/usr/share/ant/lib/ant.jar:/usr/share/ant/lib/ant-junit.jar, -agentlib:jdwp=transport=dt_socket,address=minerva.apache.org:53498,server=n,suspend=y, -Djpda.settings.verbose=true, -Djpda.settings.syncPort=60097, org.apache.harmony.jpda.tests.jdwp.VirtualMachine.HoldEventsDebuggee]
[junit] Launched process
[junit] Start redirectors
[junit] Redirector started: STDERR
[junit] Redirector started: STDOUT
[junit] Started redirectors
[junit] Launched debuggee process
[junit] Accepting JDWP connection
[junit] Established transport connection
[junit] Established JDWP connection with debuggee VM
[junit] Received inital VM_INIT event
[junit] Adjusted VM-dependent type lengths
[junit] Resumed debuggee VM
[junit] [SYNC] Accepting socket connection
[junit] STDOUT> [SYNC] Attaching socket to: localhost:60097
[junit] [SYNC] Accepted socket connection
[junit] Established sync connection
[junit] ----------------------------------------
[junit] [SYNC] Waiting for message: ready
[junit] STDOUT> [SYNC] Attached socket
[junit] [SYNC] Received message: ready
[junit] STDOUT> [SYNC] Message sent: ready
[junit] STDOUT> wait for SGNL_CONTINUE to start thread
[junit] STDOUT> [SYNC] Waiting for message: continue
[junit] send HoldEvents
[junit] allow to start thread
[junit] [SYNC] Message sent: continue
[junit] STDOUT> [SYNC] Received message: continue
[junit] STDOUT> starting thread
[junit] no events were received
[junit] send ReleaseEvents
[junit] expected event received: org.apache.harmony.jpda.tests.framework.jdwp.EventPacket@408ee2ae
[junit] ----------------------------------------
[junit] [SYNC] Closed socket
[junit] Completed sync connection
[junit] Waiting for process exit
[junit] STDOUT> TestedThread: started
[junit] STDOUT> thread is finished
[junit] STDOUT> [SYNC] Closed socket
[junit] Redirector completed: STDOUT
[junit] Redirector completed: STDERR
[junit] Finished debuggee with exit code: 0
[junit] Finished process
[junit] Waiting for redirectors finish
[junit] Finished redirectors
[junit] Closed JDWP connection with debuggee VM
[junit] <<<=====================================
[junit]
[junit]
touch-failures-file:
touch-errors-file:
test-module:
build-tests:
[echo] Compiling TOOLS tests
[mkdir] Created dir: <http://hudson.zones.apache.org/hudson/job/Harmony-1.5-head-linux-x86_64-full-tests/ws/harmony/jdktools/modules/jretools/bin/test>
[hy.javac] Compiling 3 source files to <http://hudson.zones.apache.org/hudson/job/Harmony-1.5-head-linux-x86_64-full-tests/ws/harmony/jdktools/modules/jretools/bin/test>
[hy.javac] Since fork is false, ignoring memoryMaximumSize setting
prepare-exclude:
[echo] TOOLS exclude list: <http://hudson.zones.apache.org/hudson/job/Harmony-1.5-head-linux-x86_64-full-tests/ws/harmony/classlib/deploy/build/jretools.tools.exclude>
run-tests:
[echo] Running TOOLS tests
[echo] test.jre.home=<http://hudson.zones.apache.org/hudson/job/Harmony-1.5-head-linux-x86_64-full-tests/ws/harmony/target/hdk/jdk/jre>
[junit] Running org.apache.harmony.jretools.tests.keytool.GenKeyTest
[junit] Tests run: 1, Failures: 0, Errors: 0, Time elapsed: 1.464 sec
[junit] Running org.apache.harmony.jretools.tests.toolutils.KeyStoreLoaderSaverTest
[junit] Tests run: 2, Failures: 0, Errors: 0, Time elapsed: 0.01 sec
touch-failures-file:
touch-errors-file:
test-module:
prepare-exclude:
[echo] SAMSA exclude list: <http://hudson.zones.apache.org/hudson/job/Harmony-1.5-head-linux-x86_64-full-tests/ws/harmony/classlib/deploy/build/jdktools.samsa.exclude>
run-tests:
[echo] Running SAMSA tests
[echo] test.jre.home=<http://hudson.zones.apache.org/hudson/job/Harmony-1.5-head-linux-x86_64-full-tests/ws/harmony/target/hdk/jdk/jre>
[echo] Run jdk/bin/java -version in <http://hudson.zones.apache.org/hudson/job/Harmony-1.5-head-linux-x86_64-full-tests/ws/harmony/build/test_report>
[echo] Run jdk/bin/javac -version in <http://hudson.zones.apache.org/hudson/job/Harmony-1.5-head-linux-x86_64-full-tests/ws/harmony/build/test_report>
[exec] Eclipse Java Compiler 0.972_R35x, 3.5.1 release, Copyright IBM Corp 2000, 2009. All rights reserved.
[echo] Run jdk/bin/javah in <http://hudson.zones.apache.org/hudson/job/Harmony-1.5-head-linux-x86_64-full-tests/ws/harmony/build/test_report>
[exec] JNI-style header files generator.
[exec]
[exec] Usage: org.apache.harmony.tools.javah.Main [options] <class names>
[exec]
[exec] [options]
[exec] -bootclasspath <path> The given path will be prepended to
[exec] the default class path.
[exec]
[exec] -classpath <path> The given path will be appended to
[exec] the default class path.
[exec]
[exec] -o <file> All the output will be redirected into
[exec] the specified file.
[exec]
[exec] -d <directory> All the header files will be created in the specified
[exec] directory which will be created if it is necessary.
[exec]
[exec] -inner Inner classes will be processed automatically.
[exec]
[exec] -verbose Allows running commentary.
[exec]
[exec] <class names> A list of the fully qualified class names
[exec] separated by a space.
[exec] Result: 1
[echo] Run jdk/bin/javadoc in <http://hudson.zones.apache.org/hudson/job/Harmony-1.5-head-linux-x86_64-full-tests/ws/harmony/build/test_report>
[exec] JavaDoc is not implemented yet
[echo] Run jdk/bin/jarsigner in <http://hudson.zones.apache.org/hudson/job/Harmony-1.5-head-linux-x86_64-full-tests/ws/harmony/build/test_report>
[exec] JarSigner help.
[exec] Usage: jarsigner {options} JAR-file alias
[exec] jarsigner -verify {options} JAR-file
[exec]
[exec] -verify verify a signed JAR file
[exec] -keystore <keystore_path> location of the keystore
[exec] -storetype <keystore_type> type of the keystore
[exec] -storepass <keystore_password> keystore password
[exec] -keypass <key_password> private key password (if differs from <keystore_password>)
[exec] -signedjar <file_name> name of the signed JAR file
[exec] -sigfile <file_name> name of .SF and .DSA files
[exec] -verbose provide additional output
[exec] -silent provide as few output as possible
[exec] -certs display certificates (use with -verify and -verbose)
[exec] -tsa <TSA_URL> location of time-stamp authority
[exec] -tsacert <TSA_cert_alias> keystore alias of the TSA certificate
[exec] -proxy <host_address>{:<port>} proxy server host address and port, e.g. proxy.server.com:1234
[exec] -proxytype <type_name> type of the proxy server (HTTP or SOCKS)
[exec] -providerclass <class> class name of cryptographic service provider
[exec] -providername <name> provider name
[exec] -ksproviderclass <class> class name of cryptographic service provider for managing keystore
[exec] -ksprovidername <name> keystore provider name
[exec] -sigproviderclass <class> class name of cryptographic service provider for work with signatures
[exec] -sigprovidername <name> signature provider name
[exec] -certproviderclass <class> class name of cryptographic service provider for work with certificates
[exec] -certprovidername <name> certificate provider name
[exec] -mdproviderclass <class> class name of cryptographic service provider for work with message digests
[exec] -mdprovidername <name> message digest provider name
[echo] Run jdk/jre/bin/keytool -help in <http://hudson.zones.apache.org/hudson/job/Harmony-1.5-head-linux-x86_64-full-tests/ws/harmony/build/test_report>
[exec]
[exec] Keytool usage:
[exec] keytool {-<command_name>} {-<command_option>} {<option_value>}... -J<java_option>
[exec]
[exec] Known commands:
[exec] -certreq Generate certificate request
[exec] -checkcrl Check certificates revocation status
[exec] -convert Convert keystore to another format
[exec] -delete Remove entry from keystore
[exec] -export Export certificate to a file or stdout
[exec] -genkey Secret key or key pair generation
[exec] -help This help message or help on a command
[exec] -import Import a certificate (chain) or a CSR reply
[exec] -keyclone Duplicate a key entry
[exec] -keypasswd Change key password
[exec] -printcert Print to stdout a certificate from file
[exec] -selfcert Generate a self-signed certificate with existing key
[exec] -storepasswd Change keystore password
[exec] -verify Verify a certificate chain
[exec]
[exec] Help usage:
[exec] keytool -help {<command_name>}
[exec] E.g.: keytool -help genkey
[exec]
[echo] Run jdk/jre/bin/unpack200 in <http://hudson.zones.apache.org/hudson/job/Harmony-1.5-head-linux-x86_64-full-tests/ws/harmony/build/test_report>
[exec] Usage: unpack200 [-opt... | --option=value]... x.pack[.gz] y.jar
[exec] (For more information, run unpack200 --help)
[echo] Run jdk/jre/bin/pack200 in <http://hudson.zones.apache.org/hudson/job/Harmony-1.5-head-linux-x86_64-full-tests/ws/harmony/build/test_report>
[exec] Usage: pack200 [-opt... | --option=value]... x.pack[.gz] y.jar
[exec] (For more information, run pack200 --help)
test-module:
process-test-output:
-check-for-empty:
-process-empty:
process-empty:
full-report:
short-report:
gen-report:
check-test-result:
BUILD FAILED
<http://hudson.zones.apache.org/hudson/job/Harmony-1.5-head-linux-x86_64-full-tests/ws/harmony/build.xml>:983: The following error occurred while executing this line:
<http://hudson.zones.apache.org/hudson/job/Harmony-1.5-head-linux-x86_64-full-tests/ws/harmony/classlib/make/build-test.xml>:161: There were test errors.
Total time: 23 minutes 45 seconds
Archiving artifacts
Recording test results
Build failed in Hudson: Harmony-1.5-head-linux-x86_64-full-tests
#115
Posted by Apache Hudson Server <hu...@hudson.zones.apache.org>.
See <http://hudson.zones.apache.org/hudson/job/Harmony-1.5-head-linux-x86_64-full-tests/115/changes>
Changes:
[hindessm] Removing unused code/variables.
Fixing readSymbolicLink for non-linux platforms as they can attempt to use
it and the code looks quite reasonable/portable.
------------------------------------------
[...truncated 25862 lines...]
[junit] STDOUT> StopDebuggee: started
[junit] STDOUT> TestedThread: started
[junit] STDOUT> TestedThread: Wait for 'Stop' command with NullPointerException...
[junit] STDOUT> StopDebuggee: Wait for TestedThread to finish...
[junit] [SYNC] Received message: ready
[junit] testStop001: get threadID to Stop...
[junit] testStop001: ID of the tested thread to Stop = 2032
[junit] testStop001: get throwable for Stop command...
[junit] testStop001: throwable = ObjectID: 1586
[junit] testStop001: send "Stop" command
[junit] testStop001: wait for Debuggee message about test status...
[junit] [SYNC] Waiting for any messsage
[junit] STDOUT> TestedThread: Exception is caught: java.lang.NullPointerException
[junit] STDOUT> TestedThread: PASSED: It is expected Exception
[junit] STDOUT> StopDebuggee: TestedThread finished
[junit] [SYNC] Received message: PASSED
[junit] testStop001: Received from Debuggee test status = PASSED
[junit] testStop001: PASSED
[junit] ----------------------------------------
[junit] [SYNC] Closed socket
[junit] Completed sync connection
[junit] Waiting for process exit
[junit] STDOUT> [SYNC] Message sent: PASSED
[junit] STDOUT> StopDebuggee: finishing...
[junit] STDOUT> [SYNC] Closed socket
[junit] Redirector completed: STDOUT
[junit] Redirector completed: STDERR
[junit] Finished debuggee with exit code: 0
[junit] Finished process
[junit] Waiting for redirectors finish
[junit] Finished redirectors
[junit] Closed JDWP connection with debuggee VM
[junit] <<<=====================================
[junit]
[junit]
[junit] Running org.apache.harmony.jpda.tests.jdwp.VirtualMachine.HoldEventsTest
[junit] Tests run: 1, Failures: 0, Errors: 0, Time elapsed: 61.598 sec
[junit] Output:
[junit]
[junit] =====================================>>>
[junit] Run: org.apache.harmony.jpda.tests.jdwp.VirtualMachine.HoldEventsTest.testHoldEvents001
[junit] ----------------------------------------
[junit] [SYNC] Binding socket on port: 0
[junit] [SYNC] Bound socket on port: 57920
[junit] Start listening on: null
[junit] Listening on: minerva.apache.org:36341
[junit] Launch: <http://hudson.zones.apache.org/hudson/job/Harmony-1.5-head-linux-x86_64-full-tests/ws/harmony/target/hdk/jdk/jre/bin/java> -cp "<http://hudson.zones.apache.org/hudson/job/Harmony-1.5-head-linux-x86_64-full-tests/ws/harmony/jdktools/build/tests/classes>:/home/hudson/.ant/lib/junit-4.6.jar:/usr/share/ant/lib/ant-launcher.jar:/usr/share/ant/lib/ant.jar:/usr/share/ant/lib/ant-junit.jar" -agentlib:jdwp=transport=dt_socket,address=minerva.apache.org:36341,server=n,suspend=y -Djpda.settings.verbose=true -Djpda.settings.syncPort=57920 org.apache.harmony.jpda.tests.jdwp.VirtualMachine.HoldEventsDebuggee
[junit] Launch process: <http://hudson.zones.apache.org/hudson/job/Harmony-1.5-head-linux-x86_64-full-tests/ws/harmony/target/hdk/jdk/jre/bin/java> -cp "<http://hudson.zones.apache.org/hudson/job/Harmony-1.5-head-linux-x86_64-full-tests/ws/harmony/jdktools/build/tests/classes>:/home/hudson/.ant/lib/junit-4.6.jar:/usr/share/ant/lib/ant-launcher.jar:/usr/share/ant/lib/ant.jar:/usr/share/ant/lib/ant-junit.jar" -agentlib:jdwp=transport=dt_socket,address=minerva.apache.org:36341,server=n,suspend=y -Djpda.settings.verbose=true -Djpda.settings.syncPort=57920 org.apache.harmony.jpda.tests.jdwp.VirtualMachine.HoldEventsDebuggee
[junit] Splitted command line: [<http://hudson.zones.apache.org/hudson/job/Harmony-1.5-head-linux-x86_64-full-tests/ws/harmony/target/hdk/jdk/jre/bin/java,> -cp, <http://hudson.zones.apache.org/hudson/job/Harmony-1.5-head-linux-x86_64-full-tests/ws/harmony/jdktools/build/tests/classes>:/home/hudson/.ant/lib/junit-4.6.jar:/usr/share/ant/lib/ant-launcher.jar:/usr/share/ant/lib/ant.jar:/usr/share/ant/lib/ant-junit.jar, -agentlib:jdwp=transport=dt_socket,address=minerva.apache.org:36341,server=n,suspend=y, -Djpda.settings.verbose=true, -Djpda.settings.syncPort=57920, org.apache.harmony.jpda.tests.jdwp.VirtualMachine.HoldEventsDebuggee]
[junit] Launched process
[junit] Start redirectors
[junit] Redirector started: STDERR
[junit] Redirector started: STDOUT
[junit] Started redirectors
[junit] Launched debuggee process
[junit] Accepting JDWP connection
[junit] Established transport connection
[junit] Established JDWP connection with debuggee VM
[junit] Received inital VM_INIT event
[junit] Adjusted VM-dependent type lengths
[junit] Resumed debuggee VM
[junit] [SYNC] Accepting socket connection
[junit] STDOUT> [SYNC] Attaching socket to: localhost:57920
[junit] [SYNC] Accepted socket connection
[junit] Established sync connection
[junit] ----------------------------------------
[junit] [SYNC] Waiting for message: ready
[junit] [SYNC] Received message: ready
[junit] STDOUT> [SYNC] Attached socket
[junit] send HoldEvents
[junit] allow to start thread
[junit] [SYNC] Message sent: continue
[junit] STDOUT> [SYNC] Message sent: ready
[junit] STDOUT> wait for SGNL_CONTINUE to start thread
[junit] STDOUT> [SYNC] Waiting for message: continue
[junit] STDOUT> [SYNC] Received message: continue
[junit] STDOUT> starting thread
[junit] no events were received
[junit] send ReleaseEvents
[junit] expected event received: org.apache.harmony.jpda.tests.framework.jdwp.EventPacket@7182c2ae
[junit] ----------------------------------------
[junit] [SYNC] Closed socket
[junit] Completed sync connection
[junit] Waiting for process exit
[junit] STDOUT> TestedThread: started
[junit] STDOUT> thread is finished
[junit] STDOUT> [SYNC] Closed socket
[junit] Redirector completed: STDOUT
[junit] Redirector completed: STDERR
[junit] Finished debuggee with exit code: 0
[junit] Finished process
[junit] Waiting for redirectors finish
[junit] Finished redirectors
[junit] Closed JDWP connection with debuggee VM
[junit] <<<=====================================
[junit]
[junit]
touch-failures-file:
touch-errors-file:
test-module:
build-tests:
[echo] Compiling TOOLS tests
[mkdir] Created dir: <http://hudson.zones.apache.org/hudson/job/Harmony-1.5-head-linux-x86_64-full-tests/ws/harmony/jdktools/modules/jretools/bin/test>
[hy.javac] Compiling 3 source files to <http://hudson.zones.apache.org/hudson/job/Harmony-1.5-head-linux-x86_64-full-tests/ws/harmony/jdktools/modules/jretools/bin/test>
[hy.javac] Since fork is false, ignoring memoryMaximumSize setting
prepare-exclude:
[echo] TOOLS exclude list: <http://hudson.zones.apache.org/hudson/job/Harmony-1.5-head-linux-x86_64-full-tests/ws/harmony/classlib/deploy/build/jretools.tools.exclude>
run-tests:
[echo] Running TOOLS tests
[echo] test.jre.home=<http://hudson.zones.apache.org/hudson/job/Harmony-1.5-head-linux-x86_64-full-tests/ws/harmony/target/hdk/jdk/jre>
[junit] Running org.apache.harmony.jretools.tests.keytool.GenKeyTest
[junit] Tests run: 1, Failures: 0, Errors: 0, Time elapsed: 1.603 sec
[junit] Running org.apache.harmony.jretools.tests.toolutils.KeyStoreLoaderSaverTest
[junit] Tests run: 2, Failures: 0, Errors: 0, Time elapsed: 0.01 sec
touch-failures-file:
touch-errors-file:
test-module:
prepare-exclude:
[echo] SAMSA exclude list: <http://hudson.zones.apache.org/hudson/job/Harmony-1.5-head-linux-x86_64-full-tests/ws/harmony/classlib/deploy/build/jdktools.samsa.exclude>
run-tests:
[echo] Running SAMSA tests
[echo] test.jre.home=<http://hudson.zones.apache.org/hudson/job/Harmony-1.5-head-linux-x86_64-full-tests/ws/harmony/target/hdk/jdk/jre>
[echo] Run jdk/bin/java -version in <http://hudson.zones.apache.org/hudson/job/Harmony-1.5-head-linux-x86_64-full-tests/ws/harmony/build/test_report>
[echo] Run jdk/bin/javac -version in <http://hudson.zones.apache.org/hudson/job/Harmony-1.5-head-linux-x86_64-full-tests/ws/harmony/build/test_report>
[exec] Eclipse Java Compiler 0.972_R35x, 3.5.1 release, Copyright IBM Corp 2000, 2009. All rights reserved.
[echo] Run jdk/bin/javah in <http://hudson.zones.apache.org/hudson/job/Harmony-1.5-head-linux-x86_64-full-tests/ws/harmony/build/test_report>
[exec] JNI-style header files generator.
[exec]
[exec] Usage: org.apache.harmony.tools.javah.Main [options] <class names>
[exec]
[exec] [options]
[exec] -bootclasspath <path> The given path will be prepended to
[exec] the default class path.
[exec]
[exec] -classpath <path> The given path will be appended to
[exec] the default class path.
[exec]
[exec] -o <file> All the output will be redirected into
[exec] the specified file.
[exec]
[exec] -d <directory> All the header files will be created in the specified
[exec] directory which will be created if it is necessary.
[exec]
[exec] -inner Inner classes will be processed automatically.
[exec]
[exec] -verbose Allows running commentary.
[exec]
[exec] <class names> A list of the fully qualified class names
[exec] separated by a space.
[exec] Result: 1
[echo] Run jdk/bin/javadoc in <http://hudson.zones.apache.org/hudson/job/Harmony-1.5-head-linux-x86_64-full-tests/ws/harmony/build/test_report>
[exec] JavaDoc is not implemented yet
[echo] Run jdk/bin/jarsigner in <http://hudson.zones.apache.org/hudson/job/Harmony-1.5-head-linux-x86_64-full-tests/ws/harmony/build/test_report>
[exec] JarSigner help.
[exec] Usage: jarsigner {options} JAR-file alias
[exec] jarsigner -verify {options} JAR-file
[exec]
[exec] -verify verify a signed JAR file
[exec] -keystore <keystore_path> location of the keystore
[exec] -storetype <keystore_type> type of the keystore
[exec] -storepass <keystore_password> keystore password
[exec] -keypass <key_password> private key password (if differs from <keystore_password>)
[exec] -signedjar <file_name> name of the signed JAR file
[exec] -sigfile <file_name> name of .SF and .DSA files
[exec] -verbose provide additional output
[exec] -silent provide as few output as possible
[exec] -certs display certificates (use with -verify and -verbose)
[exec] -tsa <TSA_URL> location of time-stamp authority
[exec] -tsacert <TSA_cert_alias> keystore alias of the TSA certificate
[exec] -proxy <host_address>{:<port>} proxy server host address and port, e.g. proxy.server.com:1234
[exec] -proxytype <type_name> type of the proxy server (HTTP or SOCKS)
[exec] -providerclass <class> class name of cryptographic service provider
[exec] -providername <name> provider name
[exec] -ksproviderclass <class> class name of cryptographic service provider for managing keystore
[exec] -ksprovidername <name> keystore provider name
[exec] -sigproviderclass <class> class name of cryptographic service provider for work with signatures
[exec] -sigprovidername <name> signature provider name
[exec] -certproviderclass <class> class name of cryptographic service provider for work with certificates
[exec] -certprovidername <name> certificate provider name
[exec] -mdproviderclass <class> class name of cryptographic service provider for work with message digests
[exec] -mdprovidername <name> message digest provider name
[echo] Run jdk/jre/bin/keytool -help in <http://hudson.zones.apache.org/hudson/job/Harmony-1.5-head-linux-x86_64-full-tests/ws/harmony/build/test_report>
[exec]
[exec] Keytool usage:
[exec] keytool {-<command_name>} {-<command_option>} {<option_value>}... -J<java_option>
[exec]
[exec] Known commands:
[exec] -certreq Generate certificate request
[exec] -checkcrl Check certificates revocation status
[exec] -convert Convert keystore to another format
[exec] -delete Remove entry from keystore
[exec] -export Export certificate to a file or stdout
[exec] -genkey Secret key or key pair generation
[exec] -help This help message or help on a command
[exec] -import Import a certificate (chain) or a CSR reply
[exec] -keyclone Duplicate a key entry
[exec] -keypasswd Change key password
[exec] -printcert Print to stdout a certificate from file
[exec] -selfcert Generate a self-signed certificate with existing key
[exec] -storepasswd Change keystore password
[exec] -verify Verify a certificate chain
[exec]
[exec] Help usage:
[exec] keytool -help {<command_name>}
[exec] E.g.: keytool -help genkey
[exec]
[echo] Run jdk/jre/bin/unpack200 in <http://hudson.zones.apache.org/hudson/job/Harmony-1.5-head-linux-x86_64-full-tests/ws/harmony/build/test_report>
[exec] Usage: unpack200 [-opt... | --option=value]... x.pack[.gz] y.jar
[exec] (For more information, run unpack200 --help)
[echo] Run jdk/jre/bin/pack200 in <http://hudson.zones.apache.org/hudson/job/Harmony-1.5-head-linux-x86_64-full-tests/ws/harmony/build/test_report>
[exec] Usage: pack200 [-opt... | --option=value]... x.pack[.gz] y.jar
[exec] (For more information, run pack200 --help)
test-module:
process-test-output:
-check-for-empty:
-process-empty:
process-empty:
full-report:
short-report:
gen-report:
check-test-result:
BUILD FAILED
<http://hudson.zones.apache.org/hudson/job/Harmony-1.5-head-linux-x86_64-full-tests/ws/harmony/build.xml>:983: The following error occurred while executing this line:
<http://hudson.zones.apache.org/hudson/job/Harmony-1.5-head-linux-x86_64-full-tests/ws/harmony/classlib/make/build-test.xml>:161: There were test errors.
Total time: 23 minutes 29 seconds
Archiving artifacts
Recording test results
Build failed in Hudson: Harmony-1.5-head-linux-x86_64-full-tests
#114
Posted by Apache Hudson Server <hu...@hudson.zones.apache.org>.
See <http://hudson.zones.apache.org/hudson/job/Harmony-1.5-head-linux-x86_64-full-tests/114/changes>
Changes:
[hindessm] Windows version of fixes in r923823.
[hindessm] Setting svn:eol-style property to native on new files.
[iberezhn] Fix native call stack and modules list in FreeBSD crash dump
------------------------------------------
[...truncated 25865 lines...]
[junit] STDOUT> StopDebuggee: started
[junit] STDOUT> TestedThread: started
[junit] STDOUT> TestedThread: Wait for 'Stop' command with NullPointerException...
[junit] STDOUT> StopDebuggee: Wait for TestedThread to finish...
[junit] [SYNC] Received message: ready
[junit] testStop001: get threadID to Stop...
[junit] testStop001: ID of the tested thread to Stop = 2032
[junit] testStop001: get throwable for Stop command...
[junit] testStop001: throwable = ObjectID: 1586
[junit] testStop001: send "Stop" command
[junit] testStop001: wait for Debuggee message about test status...
[junit] [SYNC] Waiting for any messsage
[junit] STDOUT> TestedThread: Exception is caught: java.lang.NullPointerException
[junit] STDOUT> TestedThread: PASSED: It is expected Exception
[junit] STDOUT> StopDebuggee: TestedThread finished
[junit] [SYNC] Received message: PASSED
[junit] testStop001: Received from Debuggee test status = PASSED
[junit] testStop001: PASSED
[junit] ----------------------------------------
[junit] [SYNC] Closed socket
[junit] Completed sync connection
[junit] Waiting for process exit
[junit] STDOUT> [SYNC] Message sent: PASSED
[junit] STDOUT> StopDebuggee: finishing...
[junit] STDOUT> [SYNC] Closed socket
[junit] Redirector completed: STDOUT
[junit] Redirector completed: STDERR
[junit] Finished debuggee with exit code: 0
[junit] Finished process
[junit] Waiting for redirectors finish
[junit] Finished redirectors
[junit] Closed JDWP connection with debuggee VM
[junit] <<<=====================================
[junit]
[junit]
[junit] Running org.apache.harmony.jpda.tests.jdwp.VirtualMachine.HoldEventsTest
[junit] Tests run: 1, Failures: 0, Errors: 0, Time elapsed: 61.581 sec
[junit] Output:
[junit]
[junit] =====================================>>>
[junit] Run: org.apache.harmony.jpda.tests.jdwp.VirtualMachine.HoldEventsTest.testHoldEvents001
[junit] ----------------------------------------
[junit] [SYNC] Binding socket on port: 0
[junit] [SYNC] Bound socket on port: 52150
[junit] Start listening on: null
[junit] Listening on: minerva.apache.org:48330
[junit] Launch: <http://hudson.zones.apache.org/hudson/job/Harmony-1.5-head-linux-x86_64-full-tests/ws/harmony/target/hdk/jdk/jre/bin/java> -cp "<http://hudson.zones.apache.org/hudson/job/Harmony-1.5-head-linux-x86_64-full-tests/ws/harmony/jdktools/build/tests/classes>:/home/hudson/.ant/lib/junit-4.6.jar:/usr/share/ant/lib/ant-launcher.jar:/usr/share/ant/lib/ant.jar:/usr/share/ant/lib/ant-junit.jar" -agentlib:jdwp=transport=dt_socket,address=minerva.apache.org:48330,server=n,suspend=y -Djpda.settings.verbose=true -Djpda.settings.syncPort=52150 org.apache.harmony.jpda.tests.jdwp.VirtualMachine.HoldEventsDebuggee
[junit] Launch process: <http://hudson.zones.apache.org/hudson/job/Harmony-1.5-head-linux-x86_64-full-tests/ws/harmony/target/hdk/jdk/jre/bin/java> -cp "<http://hudson.zones.apache.org/hudson/job/Harmony-1.5-head-linux-x86_64-full-tests/ws/harmony/jdktools/build/tests/classes>:/home/hudson/.ant/lib/junit-4.6.jar:/usr/share/ant/lib/ant-launcher.jar:/usr/share/ant/lib/ant.jar:/usr/share/ant/lib/ant-junit.jar" -agentlib:jdwp=transport=dt_socket,address=minerva.apache.org:48330,server=n,suspend=y -Djpda.settings.verbose=true -Djpda.settings.syncPort=52150 org.apache.harmony.jpda.tests.jdwp.VirtualMachine.HoldEventsDebuggee
[junit] Splitted command line: [<http://hudson.zones.apache.org/hudson/job/Harmony-1.5-head-linux-x86_64-full-tests/ws/harmony/target/hdk/jdk/jre/bin/java,> -cp, <http://hudson.zones.apache.org/hudson/job/Harmony-1.5-head-linux-x86_64-full-tests/ws/harmony/jdktools/build/tests/classes>:/home/hudson/.ant/lib/junit-4.6.jar:/usr/share/ant/lib/ant-launcher.jar:/usr/share/ant/lib/ant.jar:/usr/share/ant/lib/ant-junit.jar, -agentlib:jdwp=transport=dt_socket,address=minerva.apache.org:48330,server=n,suspend=y, -Djpda.settings.verbose=true, -Djpda.settings.syncPort=52150, org.apache.harmony.jpda.tests.jdwp.VirtualMachine.HoldEventsDebuggee]
[junit] Launched process
[junit] Start redirectors
[junit] Redirector started: STDERR
[junit] Redirector started: STDOUT
[junit] Started redirectors
[junit] Launched debuggee process
[junit] Accepting JDWP connection
[junit] Established transport connection
[junit] Established JDWP connection with debuggee VM
[junit] Received inital VM_INIT event
[junit] Adjusted VM-dependent type lengths
[junit] Resumed debuggee VM
[junit] [SYNC] Accepting socket connection
[junit] STDOUT> [SYNC] Attaching socket to: localhost:52150
[junit] [SYNC] Accepted socket connection
[junit] Established sync connection
[junit] ----------------------------------------
[junit] [SYNC] Waiting for message: ready
[junit] STDOUT> [SYNC] Attached socket
[junit] [SYNC] Received message: ready
[junit] send HoldEvents
[junit] allow to start thread
[junit] [SYNC] Message sent: continue
[junit] STDOUT> [SYNC] Message sent: ready
[junit] STDOUT> wait for SGNL_CONTINUE to start thread
[junit] STDOUT> [SYNC] Waiting for message: continue
[junit] STDOUT> [SYNC] Received message: continue
[junit] STDOUT> starting thread
[junit] no events were received
[junit] send ReleaseEvents
[junit] expected event received: org.apache.harmony.jpda.tests.framework.jdwp.EventPacket@dfe702ae
[junit] ----------------------------------------
[junit] [SYNC] Closed socket
[junit] Completed sync connection
[junit] Waiting for process exit
[junit] STDOUT> TestedThread: started
[junit] STDOUT> thread is finished
[junit] STDOUT> [SYNC] Closed socket
[junit] Redirector completed: STDOUT
[junit] Redirector completed: STDERR
[junit] Finished debuggee with exit code: 0
[junit] Finished process
[junit] Waiting for redirectors finish
[junit] Finished redirectors
[junit] Closed JDWP connection with debuggee VM
[junit] <<<=====================================
[junit]
[junit]
touch-failures-file:
touch-errors-file:
test-module:
build-tests:
[echo] Compiling TOOLS tests
[mkdir] Created dir: <http://hudson.zones.apache.org/hudson/job/Harmony-1.5-head-linux-x86_64-full-tests/ws/harmony/jdktools/modules/jretools/bin/test>
[hy.javac] Compiling 3 source files to <http://hudson.zones.apache.org/hudson/job/Harmony-1.5-head-linux-x86_64-full-tests/ws/harmony/jdktools/modules/jretools/bin/test>
[hy.javac] Since fork is false, ignoring memoryMaximumSize setting
prepare-exclude:
[echo] TOOLS exclude list: <http://hudson.zones.apache.org/hudson/job/Harmony-1.5-head-linux-x86_64-full-tests/ws/harmony/classlib/deploy/build/jretools.tools.exclude>
run-tests:
[echo] Running TOOLS tests
[echo] test.jre.home=<http://hudson.zones.apache.org/hudson/job/Harmony-1.5-head-linux-x86_64-full-tests/ws/harmony/target/hdk/jdk/jre>
[junit] Running org.apache.harmony.jretools.tests.keytool.GenKeyTest
[junit] Tests run: 1, Failures: 0, Errors: 0, Time elapsed: 1.4 sec
[junit] Running org.apache.harmony.jretools.tests.toolutils.KeyStoreLoaderSaverTest
[junit] Tests run: 2, Failures: 0, Errors: 0, Time elapsed: 0.01 sec
touch-failures-file:
touch-errors-file:
test-module:
prepare-exclude:
[echo] SAMSA exclude list: <http://hudson.zones.apache.org/hudson/job/Harmony-1.5-head-linux-x86_64-full-tests/ws/harmony/classlib/deploy/build/jdktools.samsa.exclude>
run-tests:
[echo] Running SAMSA tests
[echo] test.jre.home=<http://hudson.zones.apache.org/hudson/job/Harmony-1.5-head-linux-x86_64-full-tests/ws/harmony/target/hdk/jdk/jre>
[echo] Run jdk/bin/java -version in <http://hudson.zones.apache.org/hudson/job/Harmony-1.5-head-linux-x86_64-full-tests/ws/harmony/build/test_report>
[echo] Run jdk/bin/javac -version in <http://hudson.zones.apache.org/hudson/job/Harmony-1.5-head-linux-x86_64-full-tests/ws/harmony/build/test_report>
[exec] Eclipse Java Compiler 0.972_R35x, 3.5.1 release, Copyright IBM Corp 2000, 2009. All rights reserved.
[echo] Run jdk/bin/javah in <http://hudson.zones.apache.org/hudson/job/Harmony-1.5-head-linux-x86_64-full-tests/ws/harmony/build/test_report>
[exec] JNI-style header files generator.
[exec]
[exec] Usage: org.apache.harmony.tools.javah.Main [options] <class names>
[exec]
[exec] [options]
[exec] -bootclasspath <path> The given path will be prepended to
[exec] the default class path.
[exec]
[exec] -classpath <path> The given path will be appended to
[exec] the default class path.
[exec]
[exec] -o <file> All the output will be redirected into
[exec] the specified file.
[exec]
[exec] -d <directory> All the header files will be created in the specified
[exec] directory which will be created if it is necessary.
[exec]
[exec] -inner Inner classes will be processed automatically.
[exec]
[exec] -verbose Allows running commentary.
[exec]
[exec] <class names> A list of the fully qualified class names
[exec] separated by a space.
[exec] Result: 1
[echo] Run jdk/bin/javadoc in <http://hudson.zones.apache.org/hudson/job/Harmony-1.5-head-linux-x86_64-full-tests/ws/harmony/build/test_report>
[exec] JavaDoc is not implemented yet
[echo] Run jdk/bin/jarsigner in <http://hudson.zones.apache.org/hudson/job/Harmony-1.5-head-linux-x86_64-full-tests/ws/harmony/build/test_report>
[exec] JarSigner help.
[exec] Usage: jarsigner {options} JAR-file alias
[exec] jarsigner -verify {options} JAR-file
[exec]
[exec] -verify verify a signed JAR file
[exec] -keystore <keystore_path> location of the keystore
[exec] -storetype <keystore_type> type of the keystore
[exec] -storepass <keystore_password> keystore password
[exec] -keypass <key_password> private key password (if differs from <keystore_password>)
[exec] -signedjar <file_name> name of the signed JAR file
[exec] -sigfile <file_name> name of .SF and .DSA files
[exec] -verbose provide additional output
[exec] -silent provide as few output as possible
[exec] -certs display certificates (use with -verify and -verbose)
[exec] -tsa <TSA_URL> location of time-stamp authority
[exec] -tsacert <TSA_cert_alias> keystore alias of the TSA certificate
[exec] -proxy <host_address>{:<port>} proxy server host address and port, e.g. proxy.server.com:1234
[exec] -proxytype <type_name> type of the proxy server (HTTP or SOCKS)
[exec] -providerclass <class> class name of cryptographic service provider
[exec] -providername <name> provider name
[exec] -ksproviderclass <class> class name of cryptographic service provider for managing keystore
[exec] -ksprovidername <name> keystore provider name
[exec] -sigproviderclass <class> class name of cryptographic service provider for work with signatures
[exec] -sigprovidername <name> signature provider name
[exec] -certproviderclass <class> class name of cryptographic service provider for work with certificates
[exec] -certprovidername <name> certificate provider name
[exec] -mdproviderclass <class> class name of cryptographic service provider for work with message digests
[exec] -mdprovidername <name> message digest provider name
[echo] Run jdk/jre/bin/keytool -help in <http://hudson.zones.apache.org/hudson/job/Harmony-1.5-head-linux-x86_64-full-tests/ws/harmony/build/test_report>
[exec]
[exec] Keytool usage:
[exec] keytool {-<command_name>} {-<command_option>} {<option_value>}... -J<java_option>
[exec]
[exec] Known commands:
[exec] -certreq Generate certificate request
[exec] -checkcrl Check certificates revocation status
[exec] -convert Convert keystore to another format
[exec] -delete Remove entry from keystore
[exec] -export Export certificate to a file or stdout
[exec] -genkey Secret key or key pair generation
[exec] -help This help message or help on a command
[exec] -import Import a certificate (chain) or a CSR reply
[exec] -keyclone Duplicate a key entry
[exec] -keypasswd Change key password
[exec] -printcert Print to stdout a certificate from file
[exec] -selfcert Generate a self-signed certificate with existing key
[exec] -storepasswd Change keystore password
[exec] -verify Verify a certificate chain
[exec]
[exec] Help usage:
[exec] keytool -help {<command_name>}
[exec] E.g.: keytool -help genkey
[exec]
[echo] Run jdk/jre/bin/unpack200 in <http://hudson.zones.apache.org/hudson/job/Harmony-1.5-head-linux-x86_64-full-tests/ws/harmony/build/test_report>
[exec] Usage: unpack200 [-opt... | --option=value]... x.pack[.gz] y.jar
[exec] (For more information, run unpack200 --help)
[echo] Run jdk/jre/bin/pack200 in <http://hudson.zones.apache.org/hudson/job/Harmony-1.5-head-linux-x86_64-full-tests/ws/harmony/build/test_report>
[exec] Usage: pack200 [-opt... | --option=value]... x.pack[.gz] y.jar
[exec] (For more information, run pack200 --help)
test-module:
process-test-output:
-check-for-empty:
-process-empty:
process-empty:
full-report:
short-report:
gen-report:
check-test-result:
BUILD FAILED
<http://hudson.zones.apache.org/hudson/job/Harmony-1.5-head-linux-x86_64-full-tests/ws/harmony/build.xml>:983: The following error occurred while executing this line:
<http://hudson.zones.apache.org/hudson/job/Harmony-1.5-head-linux-x86_64-full-tests/ws/harmony/classlib/make/build-test.xml>:161: There were test errors.
Total time: 23 minutes 24 seconds
Archiving artifacts
Recording test results
Build failed in Hudson: Harmony-1.5-head-linux-x86_64-full-tests
#113
Posted by Apache Hudson Server <hu...@hudson.zones.apache.org>.
See <http://hudson.zones.apache.org/hudson/job/Harmony-1.5-head-linux-x86_64-full-tests/113/changes>
Changes:
[hindessm] Fix vect memory leak in toBeReleasedBuffers failure case.
Fail fast if direct buffers are not supported and in other cases.
------------------------------------------
[...truncated 25748 lines...]
[junit] STDOUT> StopDebuggee: started
[junit] STDOUT> TestedThread: started
[junit] STDOUT> TestedThread: Wait for 'Stop' command with NullPointerException...
[junit] STDOUT> StopDebuggee: Wait for TestedThread to finish...
[junit] [SYNC] Received message: ready
[junit] testStop001: get threadID to Stop...
[junit] testStop001: ID of the tested thread to Stop = 2032
[junit] testStop001: get throwable for Stop command...
[junit] testStop001: throwable = ObjectID: 1586
[junit] testStop001: send "Stop" command
[junit] testStop001: wait for Debuggee message about test status...
[junit] [SYNC] Waiting for any messsage
[junit] STDOUT> TestedThread: Exception is caught: java.lang.NullPointerException
[junit] STDOUT> TestedThread: PASSED: It is expected Exception
[junit] STDOUT> StopDebuggee: TestedThread finished
[junit] [SYNC] Received message: PASSED
[junit] testStop001: Received from Debuggee test status = PASSED
[junit] testStop001: PASSED
[junit] ----------------------------------------
[junit] [SYNC] Closed socket
[junit] Completed sync connection
[junit] Waiting for process exit
[junit] STDOUT> [SYNC] Message sent: PASSED
[junit] STDOUT> StopDebuggee: finishing...
[junit] STDOUT> [SYNC] Closed socket
[junit] Redirector completed: STDOUT
[junit] Redirector completed: STDERR
[junit] Finished debuggee with exit code: 0
[junit] Finished process
[junit] Waiting for redirectors finish
[junit] Finished redirectors
[junit] Closed JDWP connection with debuggee VM
[junit] <<<=====================================
[junit]
[junit]
[junit] Running org.apache.harmony.jpda.tests.jdwp.VirtualMachine.HoldEventsTest
[junit] Tests run: 1, Failures: 0, Errors: 0, Time elapsed: 61.592 sec
[junit] Output:
[junit]
[junit] =====================================>>>
[junit] Run: org.apache.harmony.jpda.tests.jdwp.VirtualMachine.HoldEventsTest.testHoldEvents001
[junit] ----------------------------------------
[junit] [SYNC] Binding socket on port: 0
[junit] [SYNC] Bound socket on port: 52827
[junit] Start listening on: null
[junit] Listening on: minerva.apache.org:36856
[junit] Launch: <http://hudson.zones.apache.org/hudson/job/Harmony-1.5-head-linux-x86_64-full-tests/ws/harmony/target/hdk/jdk/jre/bin/java> -cp "<http://hudson.zones.apache.org/hudson/job/Harmony-1.5-head-linux-x86_64-full-tests/ws/harmony/jdktools/build/tests/classes>:/home/hudson/.ant/lib/junit-4.6.jar:/usr/share/ant/lib/ant-launcher.jar:/usr/share/ant/lib/ant.jar:/usr/share/ant/lib/ant-junit.jar" -agentlib:jdwp=transport=dt_socket,address=minerva.apache.org:36856,server=n,suspend=y -Djpda.settings.verbose=true -Djpda.settings.syncPort=52827 org.apache.harmony.jpda.tests.jdwp.VirtualMachine.HoldEventsDebuggee
[junit] Launch process: <http://hudson.zones.apache.org/hudson/job/Harmony-1.5-head-linux-x86_64-full-tests/ws/harmony/target/hdk/jdk/jre/bin/java> -cp "<http://hudson.zones.apache.org/hudson/job/Harmony-1.5-head-linux-x86_64-full-tests/ws/harmony/jdktools/build/tests/classes>:/home/hudson/.ant/lib/junit-4.6.jar:/usr/share/ant/lib/ant-launcher.jar:/usr/share/ant/lib/ant.jar:/usr/share/ant/lib/ant-junit.jar" -agentlib:jdwp=transport=dt_socket,address=minerva.apache.org:36856,server=n,suspend=y -Djpda.settings.verbose=true -Djpda.settings.syncPort=52827 org.apache.harmony.jpda.tests.jdwp.VirtualMachine.HoldEventsDebuggee
[junit] Splitted command line: [<http://hudson.zones.apache.org/hudson/job/Harmony-1.5-head-linux-x86_64-full-tests/ws/harmony/target/hdk/jdk/jre/bin/java,> -cp, <http://hudson.zones.apache.org/hudson/job/Harmony-1.5-head-linux-x86_64-full-tests/ws/harmony/jdktools/build/tests/classes>:/home/hudson/.ant/lib/junit-4.6.jar:/usr/share/ant/lib/ant-launcher.jar:/usr/share/ant/lib/ant.jar:/usr/share/ant/lib/ant-junit.jar, -agentlib:jdwp=transport=dt_socket,address=minerva.apache.org:36856,server=n,suspend=y, -Djpda.settings.verbose=true, -Djpda.settings.syncPort=52827, org.apache.harmony.jpda.tests.jdwp.VirtualMachine.HoldEventsDebuggee]
[junit] Launched process
[junit] Start redirectors
[junit] Redirector started: STDERR
[junit] Redirector started: STDOUT
[junit] Started redirectors
[junit] Launched debuggee process
[junit] Accepting JDWP connection
[junit] Established transport connection
[junit] Established JDWP connection with debuggee VM
[junit] Received inital VM_INIT event
[junit] Adjusted VM-dependent type lengths
[junit] Resumed debuggee VM
[junit] [SYNC] Accepting socket connection
[junit] STDOUT> [SYNC] Attaching socket to: localhost:52827
[junit] [SYNC] Accepted socket connection
[junit] Established sync connection
[junit] ----------------------------------------
[junit] [SYNC] Waiting for message: ready
[junit] STDOUT> [SYNC] Attached socket
[junit] [SYNC] Received message: ready
[junit] send HoldEvents
[junit] allow to start thread
[junit] [SYNC] Message sent: continue
[junit] STDOUT> [SYNC] Message sent: ready
[junit] STDOUT> wait for SGNL_CONTINUE to start thread
[junit] STDOUT> [SYNC] Waiting for message: continue
[junit] STDOUT> [SYNC] Received message: continue
[junit] STDOUT> starting thread
[junit] no events were received
[junit] send ReleaseEvents
[junit] expected event received: org.apache.harmony.jpda.tests.framework.jdwp.EventPacket@1b30e2ae
[junit] ----------------------------------------
[junit] [SYNC] Closed socket
[junit] Completed sync connection
[junit] Waiting for process exit
[junit] STDOUT> TestedThread: started
[junit] STDOUT> thread is finished
[junit] STDOUT> [SYNC] Closed socket
[junit] Redirector completed: STDERR
[junit] Redirector completed: STDOUT
[junit] Finished debuggee with exit code: 0
[junit] Finished process
[junit] Waiting for redirectors finish
[junit] Finished redirectors
[junit] Closed JDWP connection with debuggee VM
[junit] <<<=====================================
[junit]
[junit]
touch-failures-file:
touch-errors-file:
test-module:
build-tests:
[echo] Compiling TOOLS tests
[mkdir] Created dir: <http://hudson.zones.apache.org/hudson/job/Harmony-1.5-head-linux-x86_64-full-tests/ws/harmony/jdktools/modules/jretools/bin/test>
[hy.javac] Compiling 3 source files to <http://hudson.zones.apache.org/hudson/job/Harmony-1.5-head-linux-x86_64-full-tests/ws/harmony/jdktools/modules/jretools/bin/test>
[hy.javac] Since fork is false, ignoring memoryMaximumSize setting
prepare-exclude:
[echo] TOOLS exclude list: <http://hudson.zones.apache.org/hudson/job/Harmony-1.5-head-linux-x86_64-full-tests/ws/harmony/classlib/deploy/build/jretools.tools.exclude>
run-tests:
[echo] Running TOOLS tests
[echo] test.jre.home=<http://hudson.zones.apache.org/hudson/job/Harmony-1.5-head-linux-x86_64-full-tests/ws/harmony/target/hdk/jdk/jre>
[junit] Running org.apache.harmony.jretools.tests.keytool.GenKeyTest
[junit] Tests run: 1, Failures: 0, Errors: 0, Time elapsed: 1.665 sec
[junit] Running org.apache.harmony.jretools.tests.toolutils.KeyStoreLoaderSaverTest
[junit] Tests run: 2, Failures: 0, Errors: 0, Time elapsed: 0.01 sec
touch-failures-file:
touch-errors-file:
test-module:
prepare-exclude:
[echo] SAMSA exclude list: <http://hudson.zones.apache.org/hudson/job/Harmony-1.5-head-linux-x86_64-full-tests/ws/harmony/classlib/deploy/build/jdktools.samsa.exclude>
run-tests:
[echo] Running SAMSA tests
[echo] test.jre.home=<http://hudson.zones.apache.org/hudson/job/Harmony-1.5-head-linux-x86_64-full-tests/ws/harmony/target/hdk/jdk/jre>
[echo] Run jdk/bin/java -version in <http://hudson.zones.apache.org/hudson/job/Harmony-1.5-head-linux-x86_64-full-tests/ws/harmony/build/test_report>
[echo] Run jdk/bin/javac -version in <http://hudson.zones.apache.org/hudson/job/Harmony-1.5-head-linux-x86_64-full-tests/ws/harmony/build/test_report>
[exec] Eclipse Java Compiler 0.972_R35x, 3.5.1 release, Copyright IBM Corp 2000, 2009. All rights reserved.
[echo] Run jdk/bin/javah in <http://hudson.zones.apache.org/hudson/job/Harmony-1.5-head-linux-x86_64-full-tests/ws/harmony/build/test_report>
[exec] JNI-style header files generator.
[exec]
[exec] Usage: org.apache.harmony.tools.javah.Main [options] <class names>
[exec]
[exec] [options]
[exec] -bootclasspath <path> The given path will be prepended to
[exec] the default class path.
[exec]
[exec] -classpath <path> The given path will be appended to
[exec] the default class path.
[exec]
[exec] -o <file> All the output will be redirected into
[exec] the specified file.
[exec]
[exec] -d <directory> All the header files will be created in the specified
[exec] directory which will be created if it is necessary.
[exec]
[exec] -inner Inner classes will be processed automatically.
[exec]
[exec] -verbose Allows running commentary.
[exec]
[exec] <class names> A list of the fully qualified class names
[exec] separated by a space.
[exec] Result: 1
[echo] Run jdk/bin/javadoc in <http://hudson.zones.apache.org/hudson/job/Harmony-1.5-head-linux-x86_64-full-tests/ws/harmony/build/test_report>
[exec] JavaDoc is not implemented yet
[echo] Run jdk/bin/jarsigner in <http://hudson.zones.apache.org/hudson/job/Harmony-1.5-head-linux-x86_64-full-tests/ws/harmony/build/test_report>
[exec] JarSigner help.
[exec] Usage: jarsigner {options} JAR-file alias
[exec] jarsigner -verify {options} JAR-file
[exec]
[exec] -verify verify a signed JAR file
[exec] -keystore <keystore_path> location of the keystore
[exec] -storetype <keystore_type> type of the keystore
[exec] -storepass <keystore_password> keystore password
[exec] -keypass <key_password> private key password (if differs from <keystore_password>)
[exec] -signedjar <file_name> name of the signed JAR file
[exec] -sigfile <file_name> name of .SF and .DSA files
[exec] -verbose provide additional output
[exec] -silent provide as few output as possible
[exec] -certs display certificates (use with -verify and -verbose)
[exec] -tsa <TSA_URL> location of time-stamp authority
[exec] -tsacert <TSA_cert_alias> keystore alias of the TSA certificate
[exec] -proxy <host_address>{:<port>} proxy server host address and port, e.g. proxy.server.com:1234
[exec] -proxytype <type_name> type of the proxy server (HTTP or SOCKS)
[exec] -providerclass <class> class name of cryptographic service provider
[exec] -providername <name> provider name
[exec] -ksproviderclass <class> class name of cryptographic service provider for managing keystore
[exec] -ksprovidername <name> keystore provider name
[exec] -sigproviderclass <class> class name of cryptographic service provider for work with signatures
[exec] -sigprovidername <name> signature provider name
[exec] -certproviderclass <class> class name of cryptographic service provider for work with certificates
[exec] -certprovidername <name> certificate provider name
[exec] -mdproviderclass <class> class name of cryptographic service provider for work with message digests
[exec] -mdprovidername <name> message digest provider name
[echo] Run jdk/jre/bin/keytool -help in <http://hudson.zones.apache.org/hudson/job/Harmony-1.5-head-linux-x86_64-full-tests/ws/harmony/build/test_report>
[exec]
[exec] Keytool usage:
[exec] keytool {-<command_name>} {-<command_option>} {<option_value>}... -J<java_option>
[exec]
[exec] Known commands:
[exec] -certreq Generate certificate request
[exec] -checkcrl Check certificates revocation status
[exec] -convert Convert keystore to another format
[exec] -delete Remove entry from keystore
[exec] -export Export certificate to a file or stdout
[exec] -genkey Secret key or key pair generation
[exec] -help This help message or help on a command
[exec] -import Import a certificate (chain) or a CSR reply
[exec] -keyclone Duplicate a key entry
[exec] -keypasswd Change key password
[exec] -printcert Print to stdout a certificate from file
[exec] -selfcert Generate a self-signed certificate with existing key
[exec] -storepasswd Change keystore password
[exec] -verify Verify a certificate chain
[exec]
[exec] Help usage:
[exec] keytool -help {<command_name>}
[exec] E.g.: keytool -help genkey
[exec]
[echo] Run jdk/jre/bin/unpack200 in <http://hudson.zones.apache.org/hudson/job/Harmony-1.5-head-linux-x86_64-full-tests/ws/harmony/build/test_report>
[exec] Usage: unpack200 [-opt... | --option=value]... x.pack[.gz] y.jar
[exec] (For more information, run unpack200 --help)
[echo] Run jdk/jre/bin/pack200 in <http://hudson.zones.apache.org/hudson/job/Harmony-1.5-head-linux-x86_64-full-tests/ws/harmony/build/test_report>
[exec] Usage: pack200 [-opt... | --option=value]... x.pack[.gz] y.jar
[exec] (For more information, run pack200 --help)
test-module:
process-test-output:
-check-for-empty:
-process-empty:
process-empty:
full-report:
short-report:
gen-report:
check-test-result:
BUILD FAILED
<http://hudson.zones.apache.org/hudson/job/Harmony-1.5-head-linux-x86_64-full-tests/ws/harmony/build.xml>:983: The following error occurred while executing this line:
<http://hudson.zones.apache.org/hudson/job/Harmony-1.5-head-linux-x86_64-full-tests/ws/harmony/classlib/make/build-test.xml>:161: There were test errors.
Total time: 23 minutes 38 seconds
Archiving artifacts
Recording test results
Build failed in Hudson: Harmony-1.5-head-linux-x86_64-full-tests
#112
Posted by Apache Hudson Server <hu...@hudson.zones.apache.org>.
See <http://hudson.zones.apache.org/hudson/job/Harmony-1.5-head-linux-x86_64-full-tests/112/changes>
Changes:
[regisxu] Apply patch for HARMONY-6461: [classlib][nio_char]Remove alias cache from Charset
------------------------------------------
[...truncated 25737 lines...]
[junit] STDOUT> StopDebuggee: started
[junit] STDOUT> TestedThread: started
[junit] STDOUT> TestedThread: Wait for 'Stop' command with NullPointerException...
[junit] STDOUT> StopDebuggee: Wait for TestedThread to finish...
[junit] [SYNC] Received message: ready
[junit] testStop001: get threadID to Stop...
[junit] testStop001: ID of the tested thread to Stop = 2032
[junit] testStop001: get throwable for Stop command...
[junit] testStop001: throwable = ObjectID: 1586
[junit] testStop001: send "Stop" command
[junit] testStop001: wait for Debuggee message about test status...
[junit] [SYNC] Waiting for any messsage
[junit] STDOUT> TestedThread: Exception is caught: java.lang.NullPointerException
[junit] STDOUT> TestedThread: PASSED: It is expected Exception
[junit] STDOUT> StopDebuggee: TestedThread finished
[junit] [SYNC] Received message: PASSED
[junit] testStop001: Received from Debuggee test status = PASSED
[junit] testStop001: PASSED
[junit] ----------------------------------------
[junit] [SYNC] Closed socket
[junit] Completed sync connection
[junit] Waiting for process exit
[junit] STDOUT> [SYNC] Message sent: PASSED
[junit] STDOUT> StopDebuggee: finishing...
[junit] STDOUT> [SYNC] Closed socket
[junit] Redirector completed: STDOUT
[junit] Redirector completed: STDERR
[junit] Finished debuggee with exit code: 0
[junit] Finished process
[junit] Waiting for redirectors finish
[junit] Finished redirectors
[junit] Closed JDWP connection with debuggee VM
[junit] <<<=====================================
[junit]
[junit]
[junit] Running org.apache.harmony.jpda.tests.jdwp.VirtualMachine.HoldEventsTest
[junit] Tests run: 1, Failures: 0, Errors: 0, Time elapsed: 61.584 sec
[junit] Output:
[junit]
[junit] =====================================>>>
[junit] Run: org.apache.harmony.jpda.tests.jdwp.VirtualMachine.HoldEventsTest.testHoldEvents001
[junit] ----------------------------------------
[junit] [SYNC] Binding socket on port: 0
[junit] [SYNC] Bound socket on port: 47492
[junit] Start listening on: null
[junit] Listening on: minerva.apache.org:38486
[junit] Launch: <http://hudson.zones.apache.org/hudson/job/Harmony-1.5-head-linux-x86_64-full-tests/ws/harmony/target/hdk/jdk/jre/bin/java> -cp "<http://hudson.zones.apache.org/hudson/job/Harmony-1.5-head-linux-x86_64-full-tests/ws/harmony/jdktools/build/tests/classes>:/home/hudson/.ant/lib/junit-4.6.jar:/usr/share/ant/lib/ant-launcher.jar:/usr/share/ant/lib/ant.jar:/usr/share/ant/lib/ant-junit.jar" -agentlib:jdwp=transport=dt_socket,address=minerva.apache.org:38486,server=n,suspend=y -Djpda.settings.verbose=true -Djpda.settings.syncPort=47492 org.apache.harmony.jpda.tests.jdwp.VirtualMachine.HoldEventsDebuggee
[junit] Launch process: <http://hudson.zones.apache.org/hudson/job/Harmony-1.5-head-linux-x86_64-full-tests/ws/harmony/target/hdk/jdk/jre/bin/java> -cp "<http://hudson.zones.apache.org/hudson/job/Harmony-1.5-head-linux-x86_64-full-tests/ws/harmony/jdktools/build/tests/classes>:/home/hudson/.ant/lib/junit-4.6.jar:/usr/share/ant/lib/ant-launcher.jar:/usr/share/ant/lib/ant.jar:/usr/share/ant/lib/ant-junit.jar" -agentlib:jdwp=transport=dt_socket,address=minerva.apache.org:38486,server=n,suspend=y -Djpda.settings.verbose=true -Djpda.settings.syncPort=47492 org.apache.harmony.jpda.tests.jdwp.VirtualMachine.HoldEventsDebuggee
[junit] Splitted command line: [<http://hudson.zones.apache.org/hudson/job/Harmony-1.5-head-linux-x86_64-full-tests/ws/harmony/target/hdk/jdk/jre/bin/java,> -cp, <http://hudson.zones.apache.org/hudson/job/Harmony-1.5-head-linux-x86_64-full-tests/ws/harmony/jdktools/build/tests/classes>:/home/hudson/.ant/lib/junit-4.6.jar:/usr/share/ant/lib/ant-launcher.jar:/usr/share/ant/lib/ant.jar:/usr/share/ant/lib/ant-junit.jar, -agentlib:jdwp=transport=dt_socket,address=minerva.apache.org:38486,server=n,suspend=y, -Djpda.settings.verbose=true, -Djpda.settings.syncPort=47492, org.apache.harmony.jpda.tests.jdwp.VirtualMachine.HoldEventsDebuggee]
[junit] Launched process
[junit] Start redirectors
[junit] Redirector started: STDERR
[junit] Redirector started: STDOUT
[junit] Started redirectors
[junit] Launched debuggee process
[junit] Accepting JDWP connection
[junit] Established transport connection
[junit] Established JDWP connection with debuggee VM
[junit] Received inital VM_INIT event
[junit] Adjusted VM-dependent type lengths
[junit] Resumed debuggee VM
[junit] [SYNC] Accepting socket connection
[junit] STDOUT> [SYNC] Attaching socket to: localhost:47492
[junit] [SYNC] Accepted socket connection
[junit] Established sync connection
[junit] ----------------------------------------
[junit] [SYNC] Waiting for message: ready
[junit] STDOUT> [SYNC] Attached socket
[junit] [SYNC] Received message: ready
[junit] send HoldEvents
[junit] allow to start thread
[junit] [SYNC] Message sent: continue
[junit] STDOUT> [SYNC] Message sent: ready
[junit] STDOUT> wait for SGNL_CONTINUE to start thread
[junit] STDOUT> [SYNC] Waiting for message: continue
[junit] STDOUT> [SYNC] Received message: continue
[junit] STDOUT> starting thread
[junit] no events were received
[junit] send ReleaseEvents
[junit] expected event received: org.apache.harmony.jpda.tests.framework.jdwp.EventPacket@595442ae
[junit] ----------------------------------------
[junit] [SYNC] Closed socket
[junit] Completed sync connection
[junit] Waiting for process exit
[junit] STDOUT> TestedThread: started
[junit] STDOUT> thread is finished
[junit] STDOUT> [SYNC] Closed socket
[junit] Redirector completed: STDOUT
[junit] Redirector completed: STDERR
[junit] Finished debuggee with exit code: 0
[junit] Finished process
[junit] Waiting for redirectors finish
[junit] Finished redirectors
[junit] Closed JDWP connection with debuggee VM
[junit] <<<=====================================
[junit]
[junit]
touch-failures-file:
touch-errors-file:
test-module:
build-tests:
[echo] Compiling TOOLS tests
[mkdir] Created dir: <http://hudson.zones.apache.org/hudson/job/Harmony-1.5-head-linux-x86_64-full-tests/ws/harmony/jdktools/modules/jretools/bin/test>
[hy.javac] Compiling 3 source files to <http://hudson.zones.apache.org/hudson/job/Harmony-1.5-head-linux-x86_64-full-tests/ws/harmony/jdktools/modules/jretools/bin/test>
[hy.javac] Since fork is false, ignoring memoryMaximumSize setting
prepare-exclude:
[echo] TOOLS exclude list: <http://hudson.zones.apache.org/hudson/job/Harmony-1.5-head-linux-x86_64-full-tests/ws/harmony/classlib/deploy/build/jretools.tools.exclude>
run-tests:
[echo] Running TOOLS tests
[echo] test.jre.home=<http://hudson.zones.apache.org/hudson/job/Harmony-1.5-head-linux-x86_64-full-tests/ws/harmony/target/hdk/jdk/jre>
[junit] Running org.apache.harmony.jretools.tests.keytool.GenKeyTest
[junit] Tests run: 1, Failures: 0, Errors: 0, Time elapsed: 1.542 sec
[junit] Running org.apache.harmony.jretools.tests.toolutils.KeyStoreLoaderSaverTest
[junit] Tests run: 2, Failures: 0, Errors: 0, Time elapsed: 0.011 sec
touch-failures-file:
touch-errors-file:
test-module:
prepare-exclude:
[echo] SAMSA exclude list: <http://hudson.zones.apache.org/hudson/job/Harmony-1.5-head-linux-x86_64-full-tests/ws/harmony/classlib/deploy/build/jdktools.samsa.exclude>
run-tests:
[echo] Running SAMSA tests
[echo] test.jre.home=<http://hudson.zones.apache.org/hudson/job/Harmony-1.5-head-linux-x86_64-full-tests/ws/harmony/target/hdk/jdk/jre>
[echo] Run jdk/bin/java -version in <http://hudson.zones.apache.org/hudson/job/Harmony-1.5-head-linux-x86_64-full-tests/ws/harmony/build/test_report>
[echo] Run jdk/bin/javac -version in <http://hudson.zones.apache.org/hudson/job/Harmony-1.5-head-linux-x86_64-full-tests/ws/harmony/build/test_report>
[exec] Eclipse Java Compiler 0.972_R35x, 3.5.1 release, Copyright IBM Corp 2000, 2009. All rights reserved.
[echo] Run jdk/bin/javah in <http://hudson.zones.apache.org/hudson/job/Harmony-1.5-head-linux-x86_64-full-tests/ws/harmony/build/test_report>
[exec] JNI-style header files generator.
[exec]
[exec] Usage: org.apache.harmony.tools.javah.Main [options] <class names>
[exec]
[exec] [options]
[exec] -bootclasspath <path> The given path will be prepended to
[exec] the default class path.
[exec]
[exec] -classpath <path> The given path will be appended to
[exec] the default class path.
[exec]
[exec] -o <file> All the output will be redirected into
[exec] the specified file.
[exec]
[exec] -d <directory> All the header files will be created in the specified
[exec] directory which will be created if it is necessary.
[exec]
[exec] -inner Inner classes will be processed automatically.
[exec]
[exec] -verbose Allows running commentary.
[exec]
[exec] <class names> A list of the fully qualified class names
[exec] separated by a space.
[exec] Result: 1
[echo] Run jdk/bin/javadoc in <http://hudson.zones.apache.org/hudson/job/Harmony-1.5-head-linux-x86_64-full-tests/ws/harmony/build/test_report>
[exec] JavaDoc is not implemented yet
[echo] Run jdk/bin/jarsigner in <http://hudson.zones.apache.org/hudson/job/Harmony-1.5-head-linux-x86_64-full-tests/ws/harmony/build/test_report>
[exec] JarSigner help.
[exec] Usage: jarsigner {options} JAR-file alias
[exec] jarsigner -verify {options} JAR-file
[exec]
[exec] -verify verify a signed JAR file
[exec] -keystore <keystore_path> location of the keystore
[exec] -storetype <keystore_type> type of the keystore
[exec] -storepass <keystore_password> keystore password
[exec] -keypass <key_password> private key password (if differs from <keystore_password>)
[exec] -signedjar <file_name> name of the signed JAR file
[exec] -sigfile <file_name> name of .SF and .DSA files
[exec] -verbose provide additional output
[exec] -silent provide as few output as possible
[exec] -certs display certificates (use with -verify and -verbose)
[exec] -tsa <TSA_URL> location of time-stamp authority
[exec] -tsacert <TSA_cert_alias> keystore alias of the TSA certificate
[exec] -proxy <host_address>{:<port>} proxy server host address and port, e.g. proxy.server.com:1234
[exec] -proxytype <type_name> type of the proxy server (HTTP or SOCKS)
[exec] -providerclass <class> class name of cryptographic service provider
[exec] -providername <name> provider name
[exec] -ksproviderclass <class> class name of cryptographic service provider for managing keystore
[exec] -ksprovidername <name> keystore provider name
[exec] -sigproviderclass <class> class name of cryptographic service provider for work with signatures
[exec] -sigprovidername <name> signature provider name
[exec] -certproviderclass <class> class name of cryptographic service provider for work with certificates
[exec] -certprovidername <name> certificate provider name
[exec] -mdproviderclass <class> class name of cryptographic service provider for work with message digests
[exec] -mdprovidername <name> message digest provider name
[echo] Run jdk/jre/bin/keytool -help in <http://hudson.zones.apache.org/hudson/job/Harmony-1.5-head-linux-x86_64-full-tests/ws/harmony/build/test_report>
[exec]
[exec] Keytool usage:
[exec] keytool {-<command_name>} {-<command_option>} {<option_value>}... -J<java_option>
[exec]
[exec] Known commands:
[exec] -certreq Generate certificate request
[exec] -checkcrl Check certificates revocation status
[exec] -convert Convert keystore to another format
[exec] -delete Remove entry from keystore
[exec] -export Export certificate to a file or stdout
[exec] -genkey Secret key or key pair generation
[exec] -help This help message or help on a command
[exec] -import Import a certificate (chain) or a CSR reply
[exec] -keyclone Duplicate a key entry
[exec] -keypasswd Change key password
[exec] -printcert Print to stdout a certificate from file
[exec] -selfcert Generate a self-signed certificate with existing key
[exec] -storepasswd Change keystore password
[exec] -verify Verify a certificate chain
[exec]
[exec] Help usage:
[exec] keytool -help {<command_name>}
[exec] E.g.: keytool -help genkey
[exec]
[echo] Run jdk/jre/bin/unpack200 in <http://hudson.zones.apache.org/hudson/job/Harmony-1.5-head-linux-x86_64-full-tests/ws/harmony/build/test_report>
[exec] Usage: unpack200 [-opt... | --option=value]... x.pack[.gz] y.jar
[exec] (For more information, run unpack200 --help)
[echo] Run jdk/jre/bin/pack200 in <http://hudson.zones.apache.org/hudson/job/Harmony-1.5-head-linux-x86_64-full-tests/ws/harmony/build/test_report>
[exec] Usage: pack200 [-opt... | --option=value]... x.pack[.gz] y.jar
[exec] (For more information, run pack200 --help)
test-module:
process-test-output:
-check-for-empty:
-process-empty:
process-empty:
full-report:
short-report:
gen-report:
check-test-result:
BUILD FAILED
<http://hudson.zones.apache.org/hudson/job/Harmony-1.5-head-linux-x86_64-full-tests/ws/harmony/build.xml>:983: The following error occurred while executing this line:
<http://hudson.zones.apache.org/hudson/job/Harmony-1.5-head-linux-x86_64-full-tests/ws/harmony/classlib/make/build-test.xml>:161: There were test errors.
Total time: 23 minutes 38 seconds
Archiving artifacts
Recording test results
Build failed in Hudson: Harmony-1.5-head-linux-x86_64-full-tests
#111
Posted by Apache Hudson Server <hu...@hudson.zones.apache.org>.
See <http://hudson.zones.apache.org/hudson/job/Harmony-1.5-head-linux-x86_64-full-tests/111/changes>
Changes:
[regisxu] Apply patch for HARMONY-6472: [classlib][nio]ServerSocketChannelImpl's field status is unread.
------------------------------------------
[...truncated 25796 lines...]
[junit] STDOUT> StopDebuggee: started
[junit] STDOUT> TestedThread: started
[junit] STDOUT> TestedThread: Wait for 'Stop' command with NullPointerException...
[junit] STDOUT> StopDebuggee: Wait for TestedThread to finish...
[junit] [SYNC] Received message: ready
[junit] testStop001: get threadID to Stop...
[junit] testStop001: ID of the tested thread to Stop = 2032
[junit] testStop001: get throwable for Stop command...
[junit] testStop001: throwable = ObjectID: 1598
[junit] testStop001: send "Stop" command
[junit] testStop001: wait for Debuggee message about test status...
[junit] [SYNC] Waiting for any messsage
[junit] STDOUT> TestedThread: Exception is caught: java.lang.NullPointerException
[junit] STDOUT> TestedThread: PASSED: It is expected Exception
[junit] STDOUT> StopDebuggee: TestedThread finished
[junit] [SYNC] Received message: PASSED
[junit] testStop001: Received from Debuggee test status = PASSED
[junit] testStop001: PASSED
[junit] ----------------------------------------
[junit] [SYNC] Closed socket
[junit] Completed sync connection
[junit] Waiting for process exit
[junit] STDOUT> [SYNC] Message sent: PASSED
[junit] STDOUT> StopDebuggee: finishing...
[junit] STDOUT> [SYNC] Closed socket
[junit] Redirector completed: STDOUT
[junit] Redirector completed: STDERR
[junit] Finished debuggee with exit code: 0
[junit] Finished process
[junit] Waiting for redirectors finish
[junit] Finished redirectors
[junit] Closed JDWP connection with debuggee VM
[junit] <<<=====================================
[junit]
[junit]
[junit] Running org.apache.harmony.jpda.tests.jdwp.VirtualMachine.HoldEventsTest
[junit] Tests run: 1, Failures: 0, Errors: 0, Time elapsed: 61.585 sec
[junit] Output:
[junit]
[junit] =====================================>>>
[junit] Run: org.apache.harmony.jpda.tests.jdwp.VirtualMachine.HoldEventsTest.testHoldEvents001
[junit] ----------------------------------------
[junit] [SYNC] Binding socket on port: 0
[junit] [SYNC] Bound socket on port: 57666
[junit] Start listening on: null
[junit] Listening on: minerva.apache.org:47275
[junit] Launch: <http://hudson.zones.apache.org/hudson/job/Harmony-1.5-head-linux-x86_64-full-tests/ws/harmony/target/hdk/jdk/jre/bin/java> -cp "<http://hudson.zones.apache.org/hudson/job/Harmony-1.5-head-linux-x86_64-full-tests/ws/harmony/jdktools/build/tests/classes>:/home/hudson/.ant/lib/junit-4.6.jar:/usr/share/ant/lib/ant-launcher.jar:/usr/share/ant/lib/ant.jar:/usr/share/ant/lib/ant-junit.jar" -agentlib:jdwp=transport=dt_socket,address=minerva.apache.org:47275,server=n,suspend=y -Djpda.settings.verbose=true -Djpda.settings.syncPort=57666 org.apache.harmony.jpda.tests.jdwp.VirtualMachine.HoldEventsDebuggee
[junit] Launch process: <http://hudson.zones.apache.org/hudson/job/Harmony-1.5-head-linux-x86_64-full-tests/ws/harmony/target/hdk/jdk/jre/bin/java> -cp "<http://hudson.zones.apache.org/hudson/job/Harmony-1.5-head-linux-x86_64-full-tests/ws/harmony/jdktools/build/tests/classes>:/home/hudson/.ant/lib/junit-4.6.jar:/usr/share/ant/lib/ant-launcher.jar:/usr/share/ant/lib/ant.jar:/usr/share/ant/lib/ant-junit.jar" -agentlib:jdwp=transport=dt_socket,address=minerva.apache.org:47275,server=n,suspend=y -Djpda.settings.verbose=true -Djpda.settings.syncPort=57666 org.apache.harmony.jpda.tests.jdwp.VirtualMachine.HoldEventsDebuggee
[junit] Splitted command line: [<http://hudson.zones.apache.org/hudson/job/Harmony-1.5-head-linux-x86_64-full-tests/ws/harmony/target/hdk/jdk/jre/bin/java,> -cp, <http://hudson.zones.apache.org/hudson/job/Harmony-1.5-head-linux-x86_64-full-tests/ws/harmony/jdktools/build/tests/classes>:/home/hudson/.ant/lib/junit-4.6.jar:/usr/share/ant/lib/ant-launcher.jar:/usr/share/ant/lib/ant.jar:/usr/share/ant/lib/ant-junit.jar, -agentlib:jdwp=transport=dt_socket,address=minerva.apache.org:47275,server=n,suspend=y, -Djpda.settings.verbose=true, -Djpda.settings.syncPort=57666, org.apache.harmony.jpda.tests.jdwp.VirtualMachine.HoldEventsDebuggee]
[junit] Launched process
[junit] Start redirectors
[junit] Redirector started: STDERR
[junit] Redirector started: STDOUT
[junit] Started redirectors
[junit] Launched debuggee process
[junit] Accepting JDWP connection
[junit] Established transport connection
[junit] Established JDWP connection with debuggee VM
[junit] Received inital VM_INIT event
[junit] Adjusted VM-dependent type lengths
[junit] Resumed debuggee VM
[junit] [SYNC] Accepting socket connection
[junit] STDOUT> [SYNC] Attaching socket to: localhost:57666
[junit] [SYNC] Accepted socket connection
[junit] Established sync connection
[junit] ----------------------------------------
[junit] [SYNC] Waiting for message: ready
[junit] STDOUT> [SYNC] Attached socket
[junit] [SYNC] Received message: ready
[junit] send HoldEvents
[junit] allow to start thread
[junit] [SYNC] Message sent: continue
[junit] STDOUT> [SYNC] Message sent: ready
[junit] STDOUT> wait for SGNL_CONTINUE to start thread
[junit] STDOUT> [SYNC] Waiting for message: continue
[junit] STDOUT> [SYNC] Received message: continue
[junit] STDOUT> starting thread
[junit] no events were received
[junit] send ReleaseEvents
[junit] expected event received: org.apache.harmony.jpda.tests.framework.jdwp.EventPacket@201442ae
[junit] ----------------------------------------
[junit] [SYNC] Closed socket
[junit] Completed sync connection
[junit] Waiting for process exit
[junit] STDOUT> TestedThread: started
[junit] STDOUT> thread is finished
[junit] STDOUT> [SYNC] Closed socket
[junit] Redirector completed: STDOUT
[junit] Redirector completed: STDERR
[junit] Finished debuggee with exit code: 0
[junit] Finished process
[junit] Waiting for redirectors finish
[junit] Finished redirectors
[junit] Closed JDWP connection with debuggee VM
[junit] <<<=====================================
[junit]
[junit]
touch-failures-file:
touch-errors-file:
test-module:
build-tests:
[echo] Compiling TOOLS tests
[mkdir] Created dir: <http://hudson.zones.apache.org/hudson/job/Harmony-1.5-head-linux-x86_64-full-tests/ws/harmony/jdktools/modules/jretools/bin/test>
[hy.javac] Compiling 3 source files to <http://hudson.zones.apache.org/hudson/job/Harmony-1.5-head-linux-x86_64-full-tests/ws/harmony/jdktools/modules/jretools/bin/test>
[hy.javac] Since fork is false, ignoring memoryMaximumSize setting
prepare-exclude:
[echo] TOOLS exclude list: <http://hudson.zones.apache.org/hudson/job/Harmony-1.5-head-linux-x86_64-full-tests/ws/harmony/classlib/deploy/build/jretools.tools.exclude>
run-tests:
[echo] Running TOOLS tests
[echo] test.jre.home=<http://hudson.zones.apache.org/hudson/job/Harmony-1.5-head-linux-x86_64-full-tests/ws/harmony/target/hdk/jdk/jre>
[junit] Running org.apache.harmony.jretools.tests.keytool.GenKeyTest
[junit] Tests run: 1, Failures: 0, Errors: 0, Time elapsed: 1.403 sec
[junit] Running org.apache.harmony.jretools.tests.toolutils.KeyStoreLoaderSaverTest
[junit] Tests run: 2, Failures: 0, Errors: 0, Time elapsed: 0.01 sec
touch-failures-file:
touch-errors-file:
test-module:
prepare-exclude:
[echo] SAMSA exclude list: <http://hudson.zones.apache.org/hudson/job/Harmony-1.5-head-linux-x86_64-full-tests/ws/harmony/classlib/deploy/build/jdktools.samsa.exclude>
run-tests:
[echo] Running SAMSA tests
[echo] test.jre.home=<http://hudson.zones.apache.org/hudson/job/Harmony-1.5-head-linux-x86_64-full-tests/ws/harmony/target/hdk/jdk/jre>
[echo] Run jdk/bin/java -version in <http://hudson.zones.apache.org/hudson/job/Harmony-1.5-head-linux-x86_64-full-tests/ws/harmony/build/test_report>
[echo] Run jdk/bin/javac -version in <http://hudson.zones.apache.org/hudson/job/Harmony-1.5-head-linux-x86_64-full-tests/ws/harmony/build/test_report>
[exec] Eclipse Java Compiler 0.972_R35x, 3.5.1 release, Copyright IBM Corp 2000, 2009. All rights reserved.
[echo] Run jdk/bin/javah in <http://hudson.zones.apache.org/hudson/job/Harmony-1.5-head-linux-x86_64-full-tests/ws/harmony/build/test_report>
[exec] JNI-style header files generator.
[exec]
[exec] Usage: org.apache.harmony.tools.javah.Main [options] <class names>
[exec]
[exec] [options]
[exec] -bootclasspath <path> The given path will be prepended to
[exec] the default class path.
[exec]
[exec] -classpath <path> The given path will be appended to
[exec] the default class path.
[exec]
[exec] -o <file> All the output will be redirected into
[exec] the specified file.
[exec]
[exec] -d <directory> All the header files will be created in the specified
[exec] directory which will be created if it is necessary.
[exec]
[exec] -inner Inner classes will be processed automatically.
[exec]
[exec] -verbose Allows running commentary.
[exec]
[exec] <class names> A list of the fully qualified class names
[exec] separated by a space.
[exec] Result: 1
[echo] Run jdk/bin/javadoc in <http://hudson.zones.apache.org/hudson/job/Harmony-1.5-head-linux-x86_64-full-tests/ws/harmony/build/test_report>
[exec] JavaDoc is not implemented yet
[echo] Run jdk/bin/jarsigner in <http://hudson.zones.apache.org/hudson/job/Harmony-1.5-head-linux-x86_64-full-tests/ws/harmony/build/test_report>
[exec] JarSigner help.
[exec] Usage: jarsigner {options} JAR-file alias
[exec] jarsigner -verify {options} JAR-file
[exec]
[exec] -verify verify a signed JAR file
[exec] -keystore <keystore_path> location of the keystore
[exec] -storetype <keystore_type> type of the keystore
[exec] -storepass <keystore_password> keystore password
[exec] -keypass <key_password> private key password (if differs from <keystore_password>)
[exec] -signedjar <file_name> name of the signed JAR file
[exec] -sigfile <file_name> name of .SF and .DSA files
[exec] -verbose provide additional output
[exec] -silent provide as few output as possible
[exec] -certs display certificates (use with -verify and -verbose)
[exec] -tsa <TSA_URL> location of time-stamp authority
[exec] -tsacert <TSA_cert_alias> keystore alias of the TSA certificate
[exec] -proxy <host_address>{:<port>} proxy server host address and port, e.g. proxy.server.com:1234
[exec] -proxytype <type_name> type of the proxy server (HTTP or SOCKS)
[exec] -providerclass <class> class name of cryptographic service provider
[exec] -providername <name> provider name
[exec] -ksproviderclass <class> class name of cryptographic service provider for managing keystore
[exec] -ksprovidername <name> keystore provider name
[exec] -sigproviderclass <class> class name of cryptographic service provider for work with signatures
[exec] -sigprovidername <name> signature provider name
[exec] -certproviderclass <class> class name of cryptographic service provider for work with certificates
[exec] -certprovidername <name> certificate provider name
[exec] -mdproviderclass <class> class name of cryptographic service provider for work with message digests
[exec] -mdprovidername <name> message digest provider name
[echo] Run jdk/jre/bin/keytool -help in <http://hudson.zones.apache.org/hudson/job/Harmony-1.5-head-linux-x86_64-full-tests/ws/harmony/build/test_report>
[exec]
[exec] Keytool usage:
[exec] keytool {-<command_name>} {-<command_option>} {<option_value>}... -J<java_option>
[exec]
[exec] Known commands:
[exec] -certreq Generate certificate request
[exec] -checkcrl Check certificates revocation status
[exec] -convert Convert keystore to another format
[exec] -delete Remove entry from keystore
[exec] -export Export certificate to a file or stdout
[exec] -genkey Secret key or key pair generation
[exec] -help This help message or help on a command
[exec] -import Import a certificate (chain) or a CSR reply
[exec] -keyclone Duplicate a key entry
[exec] -keypasswd Change key password
[exec] -printcert Print to stdout a certificate from file
[exec] -selfcert Generate a self-signed certificate with existing key
[exec] -storepasswd Change keystore password
[exec] -verify Verify a certificate chain
[exec]
[exec] Help usage:
[exec] keytool -help {<command_name>}
[exec] E.g.: keytool -help genkey
[exec]
[echo] Run jdk/jre/bin/unpack200 in <http://hudson.zones.apache.org/hudson/job/Harmony-1.5-head-linux-x86_64-full-tests/ws/harmony/build/test_report>
[exec] Usage: unpack200 [-opt... | --option=value]... x.pack[.gz] y.jar
[exec] (For more information, run unpack200 --help)
[echo] Run jdk/jre/bin/pack200 in <http://hudson.zones.apache.org/hudson/job/Harmony-1.5-head-linux-x86_64-full-tests/ws/harmony/build/test_report>
[exec] Usage: pack200 [-opt... | --option=value]... x.pack[.gz] y.jar
[exec] (For more information, run pack200 --help)
test-module:
process-test-output:
-check-for-empty:
-process-empty:
process-empty:
full-report:
short-report:
gen-report:
check-test-result:
BUILD FAILED
<http://hudson.zones.apache.org/hudson/job/Harmony-1.5-head-linux-x86_64-full-tests/ws/harmony/build.xml>:983: The following error occurred while executing this line:
<http://hudson.zones.apache.org/hudson/job/Harmony-1.5-head-linux-x86_64-full-tests/ws/harmony/classlib/make/build-test.xml>:161: There were test errors.
Total time: 23 minutes 51 seconds
Archiving artifacts
Recording test results
Build failed in Hudson: Harmony-1.5-head-linux-x86_64-full-tests
#110
Posted by Apache Hudson Server <hu...@hudson.zones.apache.org>.
See <http://hudson.zones.apache.org/hudson/job/Harmony-1.5-head-linux-x86_64-full-tests/110/>
------------------------------------------
[...truncated 34434 lines...]
[junit] STDOUT> StopDebuggee: started
[junit] STDOUT> TestedThread: started
[junit] STDOUT> TestedThread: Wait for 'Stop' command with NullPointerException...
[junit] STDOUT> StopDebuggee: Wait for TestedThread to finish...
[junit] [SYNC] Received message: ready
[junit] testStop001: get threadID to Stop...
[junit] testStop001: ID of the tested thread to Stop = 2032
[junit] testStop001: get throwable for Stop command...
[junit] testStop001: throwable = ObjectID: 1598
[junit] testStop001: send "Stop" command
[junit] testStop001: wait for Debuggee message about test status...
[junit] [SYNC] Waiting for any messsage
[junit] STDOUT> TestedThread: Exception is caught: java.lang.NullPointerException
[junit] STDOUT> TestedThread: PASSED: It is expected Exception
[junit] STDOUT> StopDebuggee: TestedThread finished
[junit] [SYNC] Received message: PASSED
[junit] testStop001: Received from Debuggee test status = PASSED
[junit] testStop001: PASSED
[junit] ----------------------------------------
[junit] STDOUT> [SYNC] Message sent: PASSED
[junit] [SYNC] Closed socket
[junit] Completed sync connection
[junit] STDOUT> StopDebuggee: finishing...
[junit] Waiting for process exit
[junit] STDOUT> [SYNC] Closed socket
[junit] Redirector completed: STDOUT
[junit] Redirector completed: STDERR
[junit] Finished debuggee with exit code: 0
[junit] Finished process
[junit] Waiting for redirectors finish
[junit] Finished redirectors
[junit] Closed JDWP connection with debuggee VM
[junit] <<<=====================================
[junit]
[junit]
[junit] Running org.apache.harmony.jpda.tests.jdwp.VirtualMachine.HoldEventsTest
[junit] Tests run: 1, Failures: 0, Errors: 0, Time elapsed: 61.585 sec
[junit] Output:
[junit]
[junit] =====================================>>>
[junit] Run: org.apache.harmony.jpda.tests.jdwp.VirtualMachine.HoldEventsTest.testHoldEvents001
[junit] ----------------------------------------
[junit] [SYNC] Binding socket on port: 0
[junit] [SYNC] Bound socket on port: 47422
[junit] Start listening on: null
[junit] Listening on: minerva.apache.org:55307
[junit] Launch: <http://hudson.zones.apache.org/hudson/job/Harmony-1.5-head-linux-x86_64-full-tests/ws/harmony/target/hdk/jdk/jre/bin/java> -cp "<http://hudson.zones.apache.org/hudson/job/Harmony-1.5-head-linux-x86_64-full-tests/ws/harmony/jdktools/build/tests/classes>:/home/hudson/.ant/lib/junit-4.6.jar:/usr/share/ant/lib/ant-launcher.jar:/usr/share/ant/lib/ant.jar:/usr/share/ant/lib/ant-junit.jar" -agentlib:jdwp=transport=dt_socket,address=minerva.apache.org:55307,server=n,suspend=y -Djpda.settings.verbose=true -Djpda.settings.syncPort=47422 org.apache.harmony.jpda.tests.jdwp.VirtualMachine.HoldEventsDebuggee
[junit] Launch process: <http://hudson.zones.apache.org/hudson/job/Harmony-1.5-head-linux-x86_64-full-tests/ws/harmony/target/hdk/jdk/jre/bin/java> -cp "<http://hudson.zones.apache.org/hudson/job/Harmony-1.5-head-linux-x86_64-full-tests/ws/harmony/jdktools/build/tests/classes>:/home/hudson/.ant/lib/junit-4.6.jar:/usr/share/ant/lib/ant-launcher.jar:/usr/share/ant/lib/ant.jar:/usr/share/ant/lib/ant-junit.jar" -agentlib:jdwp=transport=dt_socket,address=minerva.apache.org:55307,server=n,suspend=y -Djpda.settings.verbose=true -Djpda.settings.syncPort=47422 org.apache.harmony.jpda.tests.jdwp.VirtualMachine.HoldEventsDebuggee
[junit] Splitted command line: [<http://hudson.zones.apache.org/hudson/job/Harmony-1.5-head-linux-x86_64-full-tests/ws/harmony/target/hdk/jdk/jre/bin/java,> -cp, <http://hudson.zones.apache.org/hudson/job/Harmony-1.5-head-linux-x86_64-full-tests/ws/harmony/jdktools/build/tests/classes>:/home/hudson/.ant/lib/junit-4.6.jar:/usr/share/ant/lib/ant-launcher.jar:/usr/share/ant/lib/ant.jar:/usr/share/ant/lib/ant-junit.jar, -agentlib:jdwp=transport=dt_socket,address=minerva.apache.org:55307,server=n,suspend=y, -Djpda.settings.verbose=true, -Djpda.settings.syncPort=47422, org.apache.harmony.jpda.tests.jdwp.VirtualMachine.HoldEventsDebuggee]
[junit] Launched process
[junit] Start redirectors
[junit] Redirector started: STDERR
[junit] Redirector started: STDOUT
[junit] Started redirectors
[junit] Launched debuggee process
[junit] Accepting JDWP connection
[junit] Established transport connection
[junit] Established JDWP connection with debuggee VM
[junit] Received inital VM_INIT event
[junit] Adjusted VM-dependent type lengths
[junit] Resumed debuggee VM
[junit] [SYNC] Accepting socket connection
[junit] STDOUT> [SYNC] Attaching socket to: localhost:47422
[junit] [SYNC] Accepted socket connection
[junit] Established sync connection
[junit] ----------------------------------------
[junit] [SYNC] Waiting for message: ready
[junit] STDOUT> [SYNC] Attached socket
[junit] [SYNC] Received message: ready
[junit] send HoldEvents
[junit] allow to start thread
[junit] [SYNC] Message sent: continue
[junit] STDOUT> [SYNC] Message sent: ready
[junit] STDOUT> wait for SGNL_CONTINUE to start thread
[junit] STDOUT> [SYNC] Waiting for message: continue
[junit] STDOUT> [SYNC] Received message: continue
[junit] STDOUT> starting thread
[junit] no events were received
[junit] send ReleaseEvents
[junit] expected event received: org.apache.harmony.jpda.tests.framework.jdwp.EventPacket@ff6862ae
[junit] ----------------------------------------
[junit] [SYNC] Closed socket
[junit] Completed sync connection
[junit] Waiting for process exit
[junit] STDOUT> TestedThread: started
[junit] STDOUT> thread is finished
[junit] STDOUT> [SYNC] Closed socket
[junit] Redirector completed: STDOUT
[junit] Redirector completed: STDERR
[junit] Finished debuggee with exit code: 0
[junit] Finished process
[junit] Waiting for redirectors finish
[junit] Finished redirectors
[junit] Closed JDWP connection with debuggee VM
[junit] <<<=====================================
[junit]
[junit]
touch-failures-file:
touch-errors-file:
test-module:
build-tests:
[echo] Compiling TOOLS tests
[mkdir] Created dir: <http://hudson.zones.apache.org/hudson/job/Harmony-1.5-head-linux-x86_64-full-tests/ws/harmony/jdktools/modules/jretools/bin/test>
[hy.javac] Compiling 3 source files to <http://hudson.zones.apache.org/hudson/job/Harmony-1.5-head-linux-x86_64-full-tests/ws/harmony/jdktools/modules/jretools/bin/test>
[hy.javac] Since fork is false, ignoring memoryMaximumSize setting
prepare-exclude:
[echo] TOOLS exclude list: <http://hudson.zones.apache.org/hudson/job/Harmony-1.5-head-linux-x86_64-full-tests/ws/harmony/classlib/deploy/build/jretools.tools.exclude>
run-tests:
[echo] Running TOOLS tests
[echo] test.jre.home=<http://hudson.zones.apache.org/hudson/job/Harmony-1.5-head-linux-x86_64-full-tests/ws/harmony/target/hdk/jdk/jre>
[junit] Running org.apache.harmony.jretools.tests.keytool.GenKeyTest
[junit] Tests run: 1, Failures: 0, Errors: 0, Time elapsed: 1.435 sec
[junit] Running org.apache.harmony.jretools.tests.toolutils.KeyStoreLoaderSaverTest
[junit] Tests run: 2, Failures: 0, Errors: 0, Time elapsed: 0.01 sec
touch-failures-file:
touch-errors-file:
test-module:
prepare-exclude:
[echo] SAMSA exclude list: <http://hudson.zones.apache.org/hudson/job/Harmony-1.5-head-linux-x86_64-full-tests/ws/harmony/classlib/deploy/build/jdktools.samsa.exclude>
run-tests:
[echo] Running SAMSA tests
[echo] test.jre.home=<http://hudson.zones.apache.org/hudson/job/Harmony-1.5-head-linux-x86_64-full-tests/ws/harmony/target/hdk/jdk/jre>
[echo] Run jdk/bin/java -version in <http://hudson.zones.apache.org/hudson/job/Harmony-1.5-head-linux-x86_64-full-tests/ws/harmony/build/test_report>
[echo] Run jdk/bin/javac -version in <http://hudson.zones.apache.org/hudson/job/Harmony-1.5-head-linux-x86_64-full-tests/ws/harmony/build/test_report>
[exec] Eclipse Java Compiler 0.972_R35x, 3.5.1 release, Copyright IBM Corp 2000, 2009. All rights reserved.
[echo] Run jdk/bin/javah in <http://hudson.zones.apache.org/hudson/job/Harmony-1.5-head-linux-x86_64-full-tests/ws/harmony/build/test_report>
[exec] JNI-style header files generator.
[exec]
[exec] Usage: org.apache.harmony.tools.javah.Main [options] <class names>
[exec]
[exec] [options]
[exec] -bootclasspath <path> The given path will be prepended to
[exec] the default class path.
[exec]
[exec] -classpath <path> The given path will be appended to
[exec] the default class path.
[exec]
[exec] -o <file> All the output will be redirected into
[exec] the specified file.
[exec]
[exec] -d <directory> All the header files will be created in the specified
[exec] directory which will be created if it is necessary.
[exec]
[exec] -inner Inner classes will be processed automatically.
[exec]
[exec] -verbose Allows running commentary.
[exec]
[exec] <class names> A list of the fully qualified class names
[exec] separated by a space.
[exec] Result: 1
[echo] Run jdk/bin/javadoc in <http://hudson.zones.apache.org/hudson/job/Harmony-1.5-head-linux-x86_64-full-tests/ws/harmony/build/test_report>
[exec] JavaDoc is not implemented yet
[echo] Run jdk/bin/jarsigner in <http://hudson.zones.apache.org/hudson/job/Harmony-1.5-head-linux-x86_64-full-tests/ws/harmony/build/test_report>
[exec] JarSigner help.
[exec] Usage: jarsigner {options} JAR-file alias
[exec] jarsigner -verify {options} JAR-file
[exec]
[exec] -verify verify a signed JAR file
[exec] -keystore <keystore_path> location of the keystore
[exec] -storetype <keystore_type> type of the keystore
[exec] -storepass <keystore_password> keystore password
[exec] -keypass <key_password> private key password (if differs from <keystore_password>)
[exec] -signedjar <file_name> name of the signed JAR file
[exec] -sigfile <file_name> name of .SF and .DSA files
[exec] -verbose provide additional output
[exec] -silent provide as few output as possible
[exec] -certs display certificates (use with -verify and -verbose)
[exec] -tsa <TSA_URL> location of time-stamp authority
[exec] -tsacert <TSA_cert_alias> keystore alias of the TSA certificate
[exec] -proxy <host_address>{:<port>} proxy server host address and port, e.g. proxy.server.com:1234
[exec] -proxytype <type_name> type of the proxy server (HTTP or SOCKS)
[exec] -providerclass <class> class name of cryptographic service provider
[exec] -providername <name> provider name
[exec] -ksproviderclass <class> class name of cryptographic service provider for managing keystore
[exec] -ksprovidername <name> keystore provider name
[exec] -sigproviderclass <class> class name of cryptographic service provider for work with signatures
[exec] -sigprovidername <name> signature provider name
[exec] -certproviderclass <class> class name of cryptographic service provider for work with certificates
[exec] -certprovidername <name> certificate provider name
[exec] -mdproviderclass <class> class name of cryptographic service provider for work with message digests
[exec] -mdprovidername <name> message digest provider name
[echo] Run jdk/jre/bin/keytool -help in <http://hudson.zones.apache.org/hudson/job/Harmony-1.5-head-linux-x86_64-full-tests/ws/harmony/build/test_report>
[exec]
[exec] Keytool usage:
[exec] keytool {-<command_name>} {-<command_option>} {<option_value>}... -J<java_option>
[exec]
[exec] Known commands:
[exec] -certreq Generate certificate request
[exec] -checkcrl Check certificates revocation status
[exec] -convert Convert keystore to another format
[exec] -delete Remove entry from keystore
[exec] -export Export certificate to a file or stdout
[exec] -genkey Secret key or key pair generation
[exec] -help This help message or help on a command
[exec] -import Import a certificate (chain) or a CSR reply
[exec] -keyclone Duplicate a key entry
[exec] -keypasswd Change key password
[exec] -printcert Print to stdout a certificate from file
[exec] -selfcert Generate a self-signed certificate with existing key
[exec] -storepasswd Change keystore password
[exec] -verify Verify a certificate chain
[exec]
[exec] Help usage:
[exec] keytool -help {<command_name>}
[exec] E.g.: keytool -help genkey
[exec]
[echo] Run jdk/jre/bin/unpack200 in <http://hudson.zones.apache.org/hudson/job/Harmony-1.5-head-linux-x86_64-full-tests/ws/harmony/build/test_report>
[exec] Usage: unpack200 [-opt... | --option=value]... x.pack[.gz] y.jar
[exec] (For more information, run unpack200 --help)
[echo] Run jdk/jre/bin/pack200 in <http://hudson.zones.apache.org/hudson/job/Harmony-1.5-head-linux-x86_64-full-tests/ws/harmony/build/test_report>
[exec] Usage: pack200 [-opt... | --option=value]... x.pack[.gz] y.jar
[exec] (For more information, run pack200 --help)
test-module:
process-test-output:
-check-for-empty:
-process-empty:
process-empty:
full-report:
short-report:
gen-report:
check-test-result:
BUILD FAILED
<http://hudson.zones.apache.org/hudson/job/Harmony-1.5-head-linux-x86_64-full-tests/ws/harmony/build.xml>:983: The following error occurred while executing this line:
<http://hudson.zones.apache.org/hudson/job/Harmony-1.5-head-linux-x86_64-full-tests/ws/harmony/classlib/make/build-test.xml>:161: There were test errors.
Total time: 23 minutes 32 seconds
Archiving artifacts
Recording test results
Build failed in Hudson: Harmony-1.5-head-linux-x86_64-full-tests
#109
Posted by Apache Hudson Server <hu...@hudson.zones.apache.org>.
See <http://hudson.zones.apache.org/hudson/job/Harmony-1.5-head-linux-x86_64-full-tests/109/>
------------------------------------------
[...truncated 6276 lines...]
[exec] A modules/nio_char/src/main/java/org/apache/harmony/niochar/charset/additional/IBM918.java
[exec] A modules/nio_char/src/main/java/org/apache/harmony/niochar/charset/additional/IBM865.java
[exec] A modules/nio_char/src/main/java/org/apache/harmony/niochar/charset/additional/IBM857.java
[exec] A modules/nio_char/src/main/java/org/apache/harmony/niochar/charset/additional/IBM00858.java
[exec] A modules/nio_char/src/main/java/org/apache/harmony/niochar/charset/additional/IBM869.java
[exec] A modules/nio_char/src/main/java/org/apache/harmony/niochar/charset/additional/ISO_8859_8.java
[exec] A modules/nio_char/src/main/java/org/apache/harmony/niochar/charset/additional/x_IBM1097.java
[exec] A modules/nio_char/src/main/java/org/apache/harmony/niochar/charset/additional/Big5_HKSCS.java
[exec] A modules/nio_char/src/main/java/org/apache/harmony/niochar/charset/additional/IBM01140.java
[exec] A modules/nio_char/src/main/java/org/apache/harmony/niochar/charset/additional/x_MS950_HKSCS.java
[exec] A modules/nio_char/src/main/java/org/apache/harmony/niochar/charset/additional/x_IBM737.java
[exec] A modules/nio_char/src/main/java/org/apache/harmony/niochar/charset/additional/x_IBM874.java
[exec] A modules/nio_char/src/main/java/org/apache/harmony/niochar/charset/additional/IBM280.java
[exec] A modules/nio_char/src/main/java/org/apache/harmony/niochar/charset/additional/IBM01144.java
[exec] A modules/nio_char/src/main/java/org/apache/harmony/niochar/charset/additional/IBM850.java
[exec] A modules/nio_char/src/main/java/org/apache/harmony/niochar/charset/additional/x_MacGreek.java
[exec] A modules/nio_char/src/main/java/org/apache/harmony/niochar/charset/additional/IBM284.java
[exec] A modules/nio_char/src/main/java/org/apache/harmony/niochar/charset/additional/IBM01148.java
[exec] A modules/nio_char/src/main/java/org/apache/harmony/niochar/charset/additional/x_IBM1006.java
[exec] A modules/nio_char/src/main/java/org/apache/harmony/niochar/charset/additional/x_IBM1123.java
[exec] A modules/nio_char/src/main/java/org/apache/harmony/niochar/charset/additional/IBM870.java
[exec] A modules/nio_char/src/main/java/org/apache/harmony/niochar/charset/additional/IBM862.java
[exec] A modules/nio_char/src/main/java/org/apache/harmony/niochar/charset/additional/windows_31j.java
[exec] A modules/nio_char/src/main/java/org/apache/harmony/niochar/charset/additional/x_IBM1098.java
[exec] A modules/nio_char/src/main/java/org/apache/harmony/niochar/charset/additional/x_MacCyrillic.java
[exec] A modules/nio_char/src/main/java/org/apache/harmony/niochar/charset/additional/x_windows_949.java
[exec] A modules/nio_char/src/main/java/org/apache/harmony/niochar/charset/additional/TIS_620.java
[exec] A modules/nio_char/src/main/java/org/apache/harmony/niochar/charset/additional/IBM500.java
[exec] A modules/nio_char/src/main/java/org/apache/harmony/niochar/charset/additional/IBM01141.java
[exec] A modules/nio_char/src/main/java/org/apache/harmony/niochar/charset/additional/x_IBM875.java
[exec] A modules/nio_char/src/main/java/org/apache/harmony/niochar/charset/additional/IBM01145.java
[exec] A modules/nio_char/src/main/java/org/apache/harmony/niochar/charset/additional/IBM273.java
[exec] A modules/nio_char/src/main/java/org/apache/harmony/niochar/charset/additional/GBK.java
[exec] A modules/nio_char/src/main/java/org/apache/harmony/niochar/charset/additional/x_IBM1112.java
[exec] A modules/nio_char/src/main/java/org/apache/harmony/niochar/charset/additional/IBM285.java
[exec] A modules/nio_char/src/main/java/org/apache/harmony/niochar/charset/additional/IBM01149.java
[exec] A modules/nio_char/src/main/java/org/apache/harmony/niochar/charset/additional/x_IBM1124.java
[exec] A modules/nio_char/src/main/java/org/apache/harmony/niochar/charset/additional/IBM871.java
[exec] A modules/nio_char/src/main/java/org/apache/harmony/niochar/charset/additional/IBM277.java
[exec] A modules/nio_char/src/main/java/org/apache/harmony/niochar/charset/additional/IBM863.java
[exec] A modules/nio_char/src/main/java/org/apache/harmony/niochar/charset/additional/EUC_KR.java
[exec] A modules/nio_char/src/main/java/org/apache/harmony/niochar/charset/additional/IBM855.java
[exec] A modules/nio_char/src/main/java/org/apache/harmony/niochar/charset/additional/IBM297.java
[exec] A modules/nio_char/src/main/java/org/apache/harmony/niochar/charset/additional/ISO_8859_6.java
[exec] A modules/nio_char/src/main/java/org/apache/harmony/niochar/charset/additional/JIS_X0201.java
[exec] A modules/nio_char/src/main/java/org/apache/harmony/niochar/charset/additional/IBM1026.java
[exec] A modules/nio_char/src/main/java/org/apache/harmony/niochar/charset/additional/IBM420.java
[exec] A modules/nio_char/src/main/java/org/apache/harmony/niochar/charset/ISO_8859_13.java
[exec] A modules/nio_char/src/main/java/org/apache/harmony/niochar/charset/KOI8_R.java
[exec] A modules/nio_char/src/main/java/org/apache/harmony/niochar/charset/ISO_8859_15.java
[exec] A modules/nio_char/src/main/java/org/apache/harmony/niochar/internal
[exec] A modules/nio_char/src/main/java/org/apache/harmony/niochar/internal/nls
[exec] A modules/nio_char/src/main/java/org/apache/harmony/niochar/internal/nls/messages.properties
[exec] A modules/nio_char/src/main/java/org/apache/harmony/niochar/internal/nls/Messages.java
[exec] A modules/nio_char/src/main/native
[exec] A modules/nio_char/src/main/native/niochar
[exec] A modules/nio_char/src/main/native/niochar/unix
[exec] A modules/nio_char/src/main/native/niochar/unix/exports.txt
[exec] A modules/nio_char/src/main/native/niochar/unix/makefile
[exec] A modules/nio_char/src/main/native/niochar/shared
[exec] A modules/nio_char/src/main/native/niochar/shared/ISO_8859_13.h
[exec] A modules/nio_char/src/main/native/niochar/shared/US_ASCII.c
[exec] A modules/nio_char/src/main/native/niochar/shared/KOI8_R.h
[exec] A modules/nio_char/src/main/native/niochar/shared/ISO_8859_15.h
[exec] A modules/nio_char/src/main/native/niochar/shared/US_ASCII.h
[exec] A modules/nio_char/src/main/native/niochar/shared/ISO_8859_1.c
[exec] A modules/nio_char/src/main/native/niochar/shared/ISO_8859_2.c
[exec] A modules/nio_char/src/main/native/niochar/shared/CP_1250.c
[exec] A modules/nio_char/src/main/native/niochar/shared/ISO_8859_4.c
[exec] A modules/nio_char/src/main/native/niochar/shared/CP_1251.c
[exec] A modules/nio_char/src/main/native/niochar/shared/ISO_8859_5.c
[exec] A modules/nio_char/src/main/native/niochar/shared/CP_1252.c
[exec] A modules/nio_char/src/main/native/niochar/shared/IBM866.c
[exec] A modules/nio_char/src/main/native/niochar/shared/CP_1253.c
[exec] A modules/nio_char/src/main/native/niochar/shared/ISO_8859_1.h
[exec] A modules/nio_char/src/main/native/niochar/shared/CP_1254.c
[exec] A modules/nio_char/src/main/native/niochar/shared/ISO_8859_2.h
[exec] A modules/nio_char/src/main/native/niochar/shared/ISO_8859_7.c
[exec] A modules/nio_char/src/main/native/niochar/shared/CP_1250.h
[exec] A modules/nio_char/src/main/native/niochar/shared/CP_1251.h
[exec] A modules/nio_char/src/main/native/niochar/shared/ISO_8859_4.h
[exec] A modules/nio_char/src/main/native/niochar/shared/ISO_8859_9.c
[exec] A modules/nio_char/src/main/native/niochar/shared/IBM866.h
[exec] A modules/nio_char/src/main/native/niochar/shared/CP_1257.c
[exec] A modules/nio_char/src/main/native/niochar/shared/CP_1252.h
[exec] A modules/nio_char/src/main/native/niochar/shared/ISO_8859_5.h
[exec] A modules/nio_char/src/main/native/niochar/shared/CP_1253.h
[exec] A modules/nio_char/src/main/native/niochar/shared/CP_1254.h
[exec] A modules/nio_char/src/main/native/niochar/shared/ISO_8859_7.h
[exec] A modules/nio_char/src/main/native/niochar/shared/ISO_8859_9.h
[exec] A modules/nio_char/src/main/native/niochar/shared/CP_1257.h
[exec] A modules/nio_char/src/main/native/niochar/shared/additional
[exec] A modules/nio_char/src/main/native/niochar/shared/additional/IBM01143.c
[exec] A modules/nio_char/src/main/native/niochar/shared/additional/IBM424.c
[exec] A modules/nio_char/src/main/native/niochar/shared/additional/IBM420.h
[exec] A modules/nio_char/src/main/native/niochar/shared/additional/x_IBM875.c
[exec] A modules/nio_char/src/main/native/niochar/shared/additional/IBM01147.c
[exec] A modules/nio_char/src/main/native/niochar/shared/additional/IBM01143.h
[exec] A modules/nio_char/src/main/native/niochar/shared/additional/x_IBM1124.c
[exec] A modules/nio_char/src/main/native/niochar/shared/additional/IBM424.h
[exec] A modules/nio_char/src/main/native/niochar/shared/additional/IBM862.c
[exec] A modules/nio_char/src/main/native/niochar/shared/additional/x_IBM875.h
[exec] A modules/nio_char/src/main/native/niochar/shared/additional/ISO_8859_3.c
[exec] A modules/nio_char/src/main/native/niochar/shared/additional/IBM01147.h
[exec] A modules/nio_char/src/main/native/niochar/shared/additional/x_IBM1124.h
[exec] A modules/nio_char/src/main/native/niochar/shared/additional/IBM862.h
[exec] A modules/nio_char/src/main/native/niochar/shared/additional/ISO_8859_3.h
[exec] A modules/nio_char/src/main/native/niochar/shared/additional/IBM037.c
[exec] A modules/nio_char/src/main/native/niochar/shared/additional/GBK.c
[exec] A modules/nio_char/src/main/native/niochar/shared/additional/x_IBM1112.c
[exec] A modules/nio_char/src/main/native/niochar/shared/additional/IBM850.c
[exec] A modules/nio_char/src/main/native/niochar/shared/additional/IBM437.c
[exec] A modules/nio_char/src/main/native/niochar/shared/additional/IBM037.h
[exec] A modules/nio_char/src/main/native/niochar/shared/additional/windows_1255.c
[exec] A modules/nio_char/src/main/native/niochar/shared/additional/IBM871.c
[exec] A modules/nio_char/src/main/native/niochar/shared/additional/GBK.h
[exec] A modules/nio_char/src/main/native/niochar/shared/additional/x_IBM1112.h
[exec] A modules/nio_char/src/main/native/niochar/shared/additional/IBM850.h
[exec] A modules/nio_char/src/main/native/niochar/shared/additional/IBM918.c
[exec] A modules/nio_char/src/main/native/niochar/shared/additional/IBM437.h
[exec] A modules/nio_char/src/main/native/niochar/shared/additional/windows_1255.h
[exec] A modules/nio_char/src/main/native/niochar/shared/additional/IBM871.h
[exec] A modules/nio_char/src/main/native/niochar/shared/additional/IBM918.h
[exec] A modules/nio_char/src/main/native/niochar/shared/additional/x_IBM1098.c
[exec] A modules/nio_char/src/main/native/niochar/shared/additional/x_IBM1098.h
[exec] A modules/nio_char/src/main/native/niochar/shared/additional/Big5.c
[exec] A modules/nio_char/src/main/native/niochar/shared/additional/Big5.h
[exec] A modules/nio_char/src/main/native/niochar/shared/additional/IBM01140.c
[exec] A modules/nio_char/src/main/native/niochar/shared/additional/IBM01144.c
[exec] A modules/nio_char/src/main/native/niochar/shared/additional/IBM280.c
[exec] A modules/nio_char/src/main/native/niochar/shared/additional/IBM01140.h
[exec] A modules/nio_char/src/main/native/niochar/shared/additional/x_IBM1006.c
[exec] A modules/nio_char/src/main/native/niochar/shared/additional/IBM01148.c
[exec] A modules/nio_char/src/main/native/niochar/shared/additional/IBM284.c
[exec] A modules/nio_char/src/main/native/niochar/shared/additional/IBM01144.h
[exec] A modules/nio_char/src/main/native/niochar/shared/additional/IBM280.h
[exec] A modules/nio_char/src/main/native/niochar/shared/additional/IBM863.c
[exec] A modules/nio_char/src/main/native/niochar/shared/additional/EUC_KR.c
[exec] A modules/nio_char/src/main/native/niochar/shared/additional/x_IBM1006.h
[exec] A modules/nio_char/src/main/native/niochar/shared/additional/IBM01148.h
[exec] A modules/nio_char/src/main/native/niochar/shared/additional/IBM284.h
[exec] A modules/nio_char/src/main/native/niochar/shared/additional/IBM863.h
[exec] A modules/nio_char/src/main/native/niochar/shared/additional/EUC_KR.h
[exec] A modules/nio_char/src/main/native/niochar/shared/additional/ISO_8859_8.c
[exec] A modules/nio_char/src/main/native/niochar/shared/additional/IBM1026.c
[exec] A modules/nio_char/src/main/native/niochar/shared/additional/ISO_8859_8.h
[exec] A modules/nio_char/src/main/native/niochar/shared/additional/IBM1047.c
[exec] A modules/nio_char/src/main/native/niochar/shared/additional/IBM1026.h
[exec] A modules/nio_char/src/main/native/niochar/shared/additional/IBM1047.h
[exec] A modules/nio_char/src/main/native/niochar/shared/additional/windows_1256.c
[exec] A modules/nio_char/src/main/native/niochar/shared/additional/IBM855.c
[exec] A modules/nio_char/src/main/native/niochar/shared/additional/IBM297.c
[exec] A modules/nio_char/src/main/native/niochar/shared/additional/windows_1256.h
[exec] A modules/nio_char/src/main/native/niochar/shared/additional/IBM855.h
[exec] A modules/nio_char/src/main/native/niochar/shared/additional/IBM297.h
[exec] A modules/nio_char/src/main/native/niochar/shared/additional/GB18030.c
[exec] A modules/nio_char/src/main/native/niochar/shared/additional/x_windows_949.c
[exec] A modules/nio_char/src/main/native/niochar/shared/additional/TIS_620.c
[exec] A modules/nio_char/src/main/native/niochar/shared/additional/GB18030.h
[exec] A modules/nio_char/src/main/native/niochar/shared/additional/x_windows_949.h
[exec] A modules/nio_char/src/main/native/niochar/shared/additional/TIS_620.h
[exec] A modules/nio_char/src/main/native/niochar/shared/additional/IBM01141.c
[exec] A modules/nio_char/src/main/native/niochar/shared/additional/x_MS950_HKSCS.c
[exec] A modules/nio_char/src/main/native/niochar/shared/additional/x_IBM737.c
[exec] A modules/nio_char/src/main/native/niochar/shared/additional/x_MacTurkish.c
[exec] A modules/nio_char/src/main/native/niochar/shared/additional/x_IBM856.c
[exec] A modules/nio_char/src/main/native/niochar/shared/additional/IBM01145.c
[exec] A modules/nio_char/src/main/native/niochar/shared/additional/IBM01141.h
[exec] A modules/nio_char/src/main/native/niochar/shared/additional/x_MS950_HKSCS.h
[exec] A modules/nio_char/src/main/native/niochar/shared/additional/x_IBM737.h
[exec] A modules/nio_char/src/main/native/niochar/shared/additional/x_IBM1122.c
[exec] A modules/nio_char/src/main/native/niochar/shared/additional/IBM860.c
[exec] A modules/nio_char/src/main/native/niochar/shared/additional/x_MacTurkish.h
[exec] A modules/nio_char/src/main/native/niochar/shared/additional/x_IBM856.h
[exec] A modules/nio_char/src/main/native/niochar/shared/additional/IBM285.c
[exec] A modules/nio_char/src/main/native/niochar/shared/additional/IBM01149.c
[exec] A modules/nio_char/src/main/native/niochar/shared/additional/IBM01145.h
[exec] A modules/nio_char/src/main/native/niochar/shared/additional/windows_31j.c
[exec] A modules/nio_char/src/main/native/niochar/shared/additional/IBM864.c
[exec] A modules/nio_char/src/main/native/niochar/shared/additional/x_IBM1122.h
[exec] A modules/nio_char/src/main/native/niochar/shared/additional/IBM860.h
[exec] A modules/nio_char/src/main/native/niochar/shared/additional/IBM285.h
[exec] A modules/nio_char/src/main/native/niochar/shared/additional/IBM01149.h
[exec] A modules/nio_char/src/main/native/niochar/shared/additional/IBM00858.c
[exec] A modules/nio_char/src/main/native/niochar/shared/additional/windows_31j.h
[exec] A modules/nio_char/src/main/native/niochar/shared/additional/IBM868.c
[exec] A modules/nio_char/src/main/native/niochar/shared/additional/IBM864.h
[exec] A modules/nio_char/src/main/native/niochar/shared/additional/IBM00858.h
[exec] A modules/nio_char/src/main/native/niochar/shared/additional/IBM868.h
[exec] A modules/nio_char/src/main/native/niochar/shared/additional/IBM273.c
[exec] A modules/nio_char/src/main/native/niochar/shared/additional/IBM852.c
[exec] A modules/nio_char/src/main/native/niochar/shared/additional/IBM277.c
[exec] A modules/nio_char/src/main/native/niochar/shared/additional/IBM273.h
[exec] A modules/nio_char/src/main/native/niochar/shared/additional/IBM775.c
[exec] A modules/nio_char/src/main/native/niochar/shared/additional/IBM852.h
[exec] A modules/nio_char/src/main/native/niochar/shared/additional/IBM277.h
[exec] A modules/nio_char/src/main/native/niochar/shared/additional/IBM775.h
[exec] A modules/nio_char/src/main/native/niochar/shared/additional/JIS_X0201.c
[exec] A modules/nio_char/src/main/native/niochar/shared/additional/Big5_HKSCS.c
[exec] A modules/nio_char/src/main/native/niochar/shared/additional/JIS_X0201.h
[exec] A modules/nio_char/src/main/native/niochar/shared/additional/Big5_HKSCS.h
[exec] A modules/nio_char/src/main/native/niochar/shared/additional/IBM500.c
[exec] A modules/nio_char/src/main/native/niochar/shared/additional/IBM01142.c
[exec] A modules/nio_char/src/main/native/niochar/shared/additional/x_IBM874.c
[exec] A modules/nio_char/src/main/native/niochar/shared/additional/IBM500.h
[exec] A modules/nio_char/src/main/native/niochar/shared/additional/IBM01146.c
[exec] A modules/nio_char/src/main/native/niochar/shared/additional/IBM01142.h
[exec] A modules/nio_char/src/main/native/niochar/shared/additional/x_MacGreek.c
[exec] A modules/nio_char/src/main/native/niochar/shared/additional/x_IBM1123.c
[exec] A modules/nio_char/src/main/native/niochar/shared/additional/x_IBM874.h
[exec] A modules/nio_char/src/main/native/niochar/shared/additional/IBM861.c
[exec] A modules/nio_char/src/main/native/niochar/shared/additional/x_IBM1025.c
[exec] A modules/nio_char/src/main/native/niochar/shared/additional/IBM01146.h
[exec] A modules/nio_char/src/main/native/niochar/shared/additional/x_MacGreek.h
[exec] A modules/nio_char/src/main/native/niochar/shared/additional/IBM865.c
[exec] A modules/nio_char/src/main/native/niochar/shared/additional/x_IBM1123.h
[exec] A modules/nio_char/src/main/native/niochar/shared/additional/IBM861.h
[exec] A modules/nio_char/src/main/native/niochar/shared/additional/x_IBM1025.h
[exec] A modules/nio_char/src/main/native/niochar/shared/additional/ISO_8859_6.c
[exec] A modules/nio_char/src/main/native/niochar/shared/additional/IBM869.c
[exec] A modules/nio_char/src/main/native/niochar/shared/additional/IBM865.h
[exec] A modules/nio_char/src/main/native/niochar/shared/additional/ISO_8859_6.h
[exec] A modules/nio_char/src/main/native/niochar/shared/additional/IBM869.h
[exec] A modules/nio_char/src/main/native/niochar/shared/additional/x_IBM922.c
[exec] A modules/nio_char/src/main/native/niochar/shared/additional/GB2312.c
[exec] A modules/nio_char/src/main/native/niochar/shared/additional/x_IBM922.h
[exec] A modules/nio_char/src/main/native/niochar/shared/additional/GB2312.h
[exec] A modules/nio_char/src/main/native/niochar/shared/additional/IBM870.c
[exec] A modules/nio_char/src/main/native/niochar/shared/additional/IBM278.c
[exec] A modules/nio_char/src/main/native/niochar/shared/additional/IBM870.h
[exec] A modules/nio_char/src/main/native/niochar/shared/additional/IBM857.c
[exec] A modules/nio_char/src/main/native/niochar/shared/additional/IBM_Thai.c
[exec] A modules/nio_char/src/main/native/niochar/shared/additional/IBM278.h
[exec] A modules/nio_char/src/main/native/niochar/shared/additional/x_IBM1097.c
[exec] A modules/nio_char/src/main/native/niochar/shared/additional/IBM857.h
[exec] A modules/nio_char/src/main/native/niochar/shared/additional/IBM_Thai.h
[exec] A modules/nio_char/src/main/native/niochar/shared/additional/x_MacCyrillic.c
[exec] A modules/nio_char/src/main/native/niochar/shared/additional/x_IBM1097.h
[exec] A modules/nio_char/src/main/native/niochar/shared/additional/x_MacCyrillic.h
[exec] A modules/nio_char/src/main/native/niochar/shared/additional/IBM420.c
[exec] A modules/nio_char/src/main/native/niochar/shared/ISO_8859_13.c
[exec] svn: REPORT of '/repos/asf/!svn/vcc/default': Could not read chunk size: connection was closed by server (http://svn.apache.org)
BUILD FAILED
<http://hudson.zones.apache.org/hudson/job/Harmony-1.5-head-linux-x86_64-full-tests/ws/harmony/build.xml>:680: exec returned: 1
Total time: 21 seconds
Archiving artifacts
Recording test results
Build failed in Hudson: Harmony-1.5-head-linux-x86_64-full-tests
#108
Posted by Apache Hudson Server <hu...@hudson.zones.apache.org>.
See <http://hudson.zones.apache.org/hudson/job/Harmony-1.5-head-linux-x86_64-full-tests/108/>
------------------------------------------
[...truncated 14434 lines...]
AU src/test/regression/H1802/run.test.xml
AU src/test/regression/H1802/UnresolvedHandlerTest.java
AU src/test/regression/H1802/UnresolvedParamTest.java
A src/test/regression/H4511
AU src/test/regression/H4511/run.test.xml
AU src/test/regression/H4511/GCTagged.java
AU src/test/regression/H4511/GCTagged.cpp
A src/test/regression/H3225
AU src/test/regression/H3225/MergeEmptyStackNegativeTest.j
AU src/test/regression/H3225/MergeStackNegativeTest.j
AU src/test/regression/H3225/NegativeJsrTest.java
AU src/test/regression/H3225/RetOrderNegativeTest.j
AU src/test/regression/H3225/run.test.xml
AU src/test/regression/H3225/J9CompatibleJsrTest.j
AU src/test/regression/H3225/PositiveJsrTest.j
AU src/test/regression/H3225/MergeIntFloatNegativeTest.j
AU src/test/regression/H3225/PerfTest.java
AU src/test/regression/H3225/MergeExecutionNegativeTest.j
A src/test/regression/H3027
AU src/test/regression/H3027/run.test.xml
AU src/test/regression/H3027/AgentLibTest.java
AU src/test/regression/H3027/AgentLib.cpp
A src/test/regression/H4512
AU src/test/regression/H4512/GetCurrentThreadCpuTime.java
AU src/test/regression/H4512/run.test.xml
AU src/test/regression/H4512/GetCurrentThreadCpuTime.cpp
A src/test/regression/H3505
AU src/test/regression/H3505/run.test.xml
AU src/test/regression/H3505/GetFieldModifiersTest.java
AU src/test/regression/H3505/GetFieldModifiersTest.cpp
A src/test/regression/H1840
AU src/test/regression/H1840/run.test.xml
AU src/test/regression/H1840/SimplestTest.j
A src/test/regression/H2092
AU src/test/regression/H2092/Test.java
AU src/test/regression/H2092/run.test.xml
A src/test/regression/H2335
AU src/test/regression/H2335/run.test.xml
AU src/test/regression/H2335/SimplestLibraryPathTest.java
AU src/test/regression/H2335/readme.txt
A src/test/regression/H5206
AU src/test/regression/H5206/VolatileLongTest.java
AU src/test/regression/H5206/run.test.xml
A src/test/regression/H3380
AU src/test/regression/H3380/run.test.xml
AU src/test/regression/H3380/LongToBitsTest.java
A src/test/regression/H2057
AU src/test/regression/H2057/run.test.xml
AU src/test/regression/H2057/SyncTest.java
A src/test/regression/H4073
AU src/test/regression/H4073/Test.java
AU src/test/regression/H4073/run.test.xml
A src/test/regression/H4514
AU src/test/regression/H4514/Test.java
AU src/test/regression/H4514/run.test.xml
A src/test/regression/H3228
AU src/test/regression/H3228/run.test.xml
AU src/test/regression/H3228/H3228.java
A src/test/regression/H3822
AU src/test/regression/H3822/Test.java
A src/test/regression/H5127
AU src/test/regression/H5127/Test.java
AU src/test/regression/H5127/run.test.xml
A src/test/regression/H3382
AU src/test/regression/H3382/run.test.xml
AU src/test/regression/H3382/Test.j
AU src/test/regression/H3382/TestX.java
A src/test/regression/H3067
AU src/test/regression/H3067/Test.java
AU src/test/regression/H3067/WideGoto.j
A src/test/regression/H4751
AU src/test/regression/H4751/Test.java
AU src/test/regression/H4751/run.test.xml
A src/test/regression/H5480
AU src/test/regression/H5480/run.test.xml
AU src/test/regression/H5480/LooseMathTest.java
A src/test/regression/H3582
AU src/test/regression/H3582/Test.java
A src/test/regression/H2259
AU src/test/regression/H2259/run.test.xml
AU src/test/regression/H2259/H2259.java
A src/test/regression/H2773
AU src/test/regression/H2773/run.test.xml
AU src/test/regression/H2773/InfinityTest.java
A src/test/regression/H3862
AU src/test/regression/H3862/neg.j
AU src/test/regression/H3862/run.test.xml
AU src/test/regression/H3862/neg2.j
AU src/test/regression/H3862/neg3.j
AU src/test/regression/H3862/SubrBounds.java
AU src/test/regression/H3862/pos.j
AU src/test/regression/H3862/pos2.j
A src/test/regression/H3908
AU src/test/regression/H3908/InvokeTest.java
A src/test/regression/H3909
AU src/test/regression/H3909/run.test.xml
AU src/test/regression/H3909/FinalizerThreadGroup.java
AU src/test/regression/H3909/FinalizerThreadGroup.cpp
A src/test/regression/H3784
AU src/test/regression/H3784/Test.java
AU src/test/regression/H3784/run.test.xml
AU src/test/regression/H3784/check.cpp
A src/test/regression/H3982
AU src/test/regression/H3982/run.test.xml
AU src/test/regression/H3982/EmptyStackTrace.java
AU src/test/regression/H3982/EmptyStackTrace.cpp
A src/test/regression/H4675
AU src/test/regression/H4675/run.test.xml
AU src/test/regression/H4675/DivLongTest.java
A src/test/regression/H4595
AU src/test/regression/H4595/Test.java
AU src/test/regression/H4595/run.test.xml
A src/test/regression/H4874
AU src/test/regression/H4874/Test.java
AU src/test/regression/H4874/run.test.xml
A src/test/harmony-1800
AU src/test/harmony-1800/testExec1.java
A src/test/microbenchmark
A src/test/microbenchmark/harmony-2012
AU src/test/microbenchmark/harmony-2012/test2012.java
A src/test/microbenchmark/harmony-2874
AU src/test/microbenchmark/harmony-2874/test0.java
AU src/test/microbenchmark/harmony-2874/test1.java
AU src/test/microbenchmark/harmony-2874/test2.java
A src/test/microbenchmark/harmony-2223
AU src/test/microbenchmark/harmony-2223/test_longmuldiv_speed.java
A src/test/microbenchmark/harmony-3243
AU src/test/microbenchmark/harmony-3243/ArrayFillPerf.java
A src/test/microbenchmark/harmony-3630
A src/test/microbenchmark/harmony-3630/abstractCall
AU src/test/microbenchmark/harmony-3630/abstractCall/test.java
A src/test/microbenchmark/harmony-3630/virtualCall
AU src/test/microbenchmark/harmony-3630/virtualCall/test.java
A src/test/microbenchmark/harmony-3630/virtualIndirectCall
AU src/test/microbenchmark/harmony-3630/virtualIndirectCall/test.java
A src/test/microbenchmark/harmony-3630/directCall
AU src/test/microbenchmark/harmony-3630/directCall/test.java
A src/test/microbenchmark/harmony-3630/interfaceCall
AU src/test/microbenchmark/harmony-3630/interfaceCall/test.java
A src/test/microbenchmark/harmony-2345
AU src/test/microbenchmark/harmony-2345/test_f2i_speed.java
A src/test/microbenchmark/harmony-2247
AU src/test/microbenchmark/harmony-2247/ArraycopyTest.java
A src/test/microbenchmark/harmony-2815
AU src/test/microbenchmark/harmony-2815/SecurityPerfTest.java
A src/test/microbenchmark/harmony-5480
AU src/test/microbenchmark/harmony-5480/MathTest.java
A src/test/harmony-1417
AU src/test/harmony-1417/Test2_LE.java
A src/test/final_method_test
AU src/test/final_method_test/FinalMethodTest.java
A src/test/final_method_test/finalmethodtest
AU src/test/final_method_test/finalmethodtest/A.java
A src/test/verifier_aastore
A src/test/verifier_aastore/src
AU src/test/verifier_aastore/src/Test.java
AU src/test/verifier_aastore/src/TestInterface.java
AU src/test/verifier_aastore/src/TestAastore2.j
AU src/test/verifier_aastore/src/TestAastore.java
AU src/test/verifier_aastore/HowTo.txt
A src/test/invokespecial_super
A src/test/invokespecial_super/src
AU src/test/invokespecial_super/src/Test.java
AU src/test/invokespecial_super/src/TestInvokeSpecial.j
AU src/test/invokespecial_super/src/Super.j
AU src/test/invokespecial_super/HowTo.txt
A src/test/negative_array_size
AU src/test/negative_array_size/NegativeArray.java
A src/test/array_method_limit
A src/test/array_method_limit/src
AU src/test/array_method_limit/src/Test.java
AU src/test/array_method_limit/src/TestStatic.j
AU src/test/array_method_limit/src/Invoke.j
AU src/test/array_method_limit/src/InvokeInterface.j
AU src/test/array_method_limit/src/TestArray.j
AU src/test/array_method_limit/src/TestInterface.j
AU src/test/array_method_limit/src/TestSpecial.j
AU src/test/array_method_limit/src/TestVirtual.j
AU src/test/array_method_limit/HowTo.txt
A src/test/verifier_empty_init
A src/test/verifier_empty_init/src
AU src/test/verifier_empty_init/src/Test.java
AU src/test/verifier_empty_init/src/TestEmptyInit.j
AU src/test/verifier_empty_init/HowTo.txt
A src/test/package_tests
AU src/test/package_tests/Test1.java
AU src/test/package_tests/Test2.java
AU src/test/package_tests/Test3.java
A src/test/harmony-1694
AU src/test/harmony-1694/StressTest01.java
AU README.txt
A make
AU make/depends.xml
AU make/build-native.xml
A make/tests
AU make/tests/ehwa-test.xml
AU make/tests/test-common.xml
AU make/tests/jvmti-test.xml
AU make/tests/reg-test.xml
AU make/tests/smoke-test.xml
AU make/tests/lazy-test.xml
AU make/tests/reg-test-run.xml
AU make/tests/kernel-test.xml
AU make/tests/cunit-test.xml
A make/vm
AU make/vm/kernel.xml
AU make/vm/em.xml
AU make/vm/gc_gen.xml
AU make/vm/interpreter.xml
AU make/vm/port.xml
AU make/vm/common-vm.xml
AU make/vm/verifier-ext.xml
AU make/vm/verifier.xml
AU make/vm/vmcore.xml
AU make/vm/vmi.xml
AU make/vm/hythr.xml
AU make/vm/jitrino.xml
AU make/vm/port_ch.xml
AU make/vm/encoder.xml
A make/extra
AU make/extra/apr.xml
A make/classlib.override.file.patterns
A make/resources
A make/resources/patches
AU make/resources/harmonyvm.properties
AU make/resources/readme.txt
AU make/test.properties
AU make/properties.xml
AU make/build-java.xml
AU make/depends.properties
AU build.xml
U .
At revision 922686
no change for http://svn.apache.org/repos/asf/harmony/enhanced/trunk since the previous build
no change for http://svn.apache.org/repos/asf/harmony/enhanced/classlib/trunk since the previous build
no change for http://svn.apache.org/repos/asf/harmony/enhanced/jdktools/trunk since the previous build
no change for http://svn.apache.org/repos/asf/harmony/enhanced/drlvm/trunk since the previous build
[harmony] $ ant -Duse.libstdc++6=true fetch-depends rebuild bundle-hdk
Buildfile: build.xml
fetch-classlib-libs:
BUILD FAILED
<http://hudson.zones.apache.org/hudson/job/Harmony-1.5-head-linux-x86_64-full-tests/ws/harmony/build.xml>:508: The following error occurred while executing this line:
java.io.FileNotFoundException: <http://hudson.zones.apache.org/hudson/job/Harmony-1.5-head-linux-x86_64-full-tests/ws/harmony/classlib/build.xml> (No such file or directory)
Total time: 0 seconds
Archiving artifacts
Recording test results
Build failed in Hudson: Harmony-1.5-head-linux-x86_64-full-tests
#107
Posted by Apache Hudson Server <hu...@hudson.zones.apache.org>.
See <http://hudson.zones.apache.org/hudson/job/Harmony-1.5-head-linux-x86_64-full-tests/107/>
------------------------------------------
Started by user hindessm
Building remotely on minerva.apache.org (Ubuntu)
Updating http://svn.apache.org/repos/asf/harmony/enhanced/trunk
At revision 922682
Updating http://svn.apache.org/repos/asf/harmony/enhanced/classlib/trunk
At revision 922682
Updating http://svn.apache.org/repos/asf/harmony/enhanced/jdktools/trunk
At revision 922682
Updating http://svn.apache.org/repos/asf/harmony/enhanced/drlvm/trunk
At revision 922682
no change for http://svn.apache.org/repos/asf/harmony/enhanced/trunk since the previous build
no change for http://svn.apache.org/repos/asf/harmony/enhanced/classlib/trunk since the previous build
no change for http://svn.apache.org/repos/asf/harmony/enhanced/jdktools/trunk since the previous build
no change for http://svn.apache.org/repos/asf/harmony/enhanced/drlvm/trunk since the previous build
[harmony] $ ant -Duse.libstdc++6=true fetch-depends rebuild bundle-hdk
Buildfile: build.xml
fetch-classlib-libs:
BUILD FAILED
<http://hudson.zones.apache.org/hudson/job/Harmony-1.5-head-linux-x86_64-full-tests/ws/harmony/build.xml>:508: The following error occurred while executing this line:
java.io.FileNotFoundException: <http://hudson.zones.apache.org/hudson/job/Harmony-1.5-head-linux-x86_64-full-tests/ws/harmony/classlib/build.xml> (No such file or directory)
Total time: 0 seconds
Archiving artifacts
Recording test results
Build failed in Hudson: Harmony-1.5-head-linux-x86_64-full-tests
#106
Posted by Apache Hudson Server <hu...@hudson.zones.apache.org>.
See <http://hudson.zones.apache.org/hudson/job/Harmony-1.5-head-linux-x86_64-full-tests/106/>
------------------------------------------
Started by user hindessm
Building remotely on minerva.apache.org (Ubuntu)
Updating http://svn.apache.org/repos/asf/harmony/enhanced/trunk
At revision 922682
Updating http://svn.apache.org/repos/asf/harmony/enhanced/classlib/trunk
At revision 922682
Updating http://svn.apache.org/repos/asf/harmony/enhanced/jdktools/trunk
At revision 922682
Updating http://svn.apache.org/repos/asf/harmony/enhanced/drlvm/trunk
At revision 922682
no change for http://svn.apache.org/repos/asf/harmony/enhanced/trunk since the previous build
no change for http://svn.apache.org/repos/asf/harmony/enhanced/classlib/trunk since the previous build
no change for http://svn.apache.org/repos/asf/harmony/enhanced/jdktools/trunk since the previous build
no change for http://svn.apache.org/repos/asf/harmony/enhanced/drlvm/trunk since the previous build
[harmony] $ ant -Duse.libstdc++6=true fetch-depends rebuild bundle-hdk
Buildfile: build.xml
fetch-classlib-libs:
BUILD FAILED
<http://hudson.zones.apache.org/hudson/job/Harmony-1.5-head-linux-x86_64-full-tests/ws/harmony/build.xml>:508: The following error occurred while executing this line:
java.io.FileNotFoundException: <http://hudson.zones.apache.org/hudson/job/Harmony-1.5-head-linux-x86_64-full-tests/ws/harmony/classlib/build.xml> (No such file or directory)
Total time: 0 seconds
Archiving artifacts
Recording test results
Build failed in Hudson: Harmony-1.5-head-linux-x86_64-full-tests
#105
Posted by Apache Hudson Server <hu...@hudson.zones.apache.org>.
See <http://hudson.zones.apache.org/hudson/job/Harmony-1.5-head-linux-x86_64-full-tests/105/changes>
Changes:
[hindessm] Remove confusing working_ prefix and rename vm dir to drlvm.
[hindessm] Remove confusing working_ prefix and rename vm dir to drlvm.
[hindessm] Remove confusing working_ prefix and rename vm dir to drlvm.
------------------------------------------
[...truncated 14431 lines...]
AU src/test/regression/H3341/StopThreadInWait.java
AU src/test/regression/H3341/StopThreadInWait.cpp
A src/test/regression/H1802
AU src/test/regression/H1802/run.test.xml
AU src/test/regression/H1802/UnresolvedHandlerTest.java
AU src/test/regression/H1802/UnresolvedParamTest.java
A src/test/regression/H4511
AU src/test/regression/H4511/run.test.xml
AU src/test/regression/H4511/GCTagged.java
AU src/test/regression/H4511/GCTagged.cpp
A src/test/regression/H3225
AU src/test/regression/H3225/MergeEmptyStackNegativeTest.j
AU src/test/regression/H3225/MergeStackNegativeTest.j
AU src/test/regression/H3225/NegativeJsrTest.java
AU src/test/regression/H3225/RetOrderNegativeTest.j
AU src/test/regression/H3225/run.test.xml
AU src/test/regression/H3225/J9CompatibleJsrTest.j
AU src/test/regression/H3225/PositiveJsrTest.j
AU src/test/regression/H3225/MergeIntFloatNegativeTest.j
AU src/test/regression/H3225/PerfTest.java
AU src/test/regression/H3225/MergeExecutionNegativeTest.j
A src/test/regression/H3027
AU src/test/regression/H3027/run.test.xml
AU src/test/regression/H3027/AgentLibTest.java
AU src/test/regression/H3027/AgentLib.cpp
A src/test/regression/H4512
AU src/test/regression/H4512/GetCurrentThreadCpuTime.java
AU src/test/regression/H4512/run.test.xml
AU src/test/regression/H4512/GetCurrentThreadCpuTime.cpp
A src/test/regression/H3505
AU src/test/regression/H3505/run.test.xml
AU src/test/regression/H3505/GetFieldModifiersTest.java
AU src/test/regression/H3505/GetFieldModifiersTest.cpp
A src/test/regression/H1840
AU src/test/regression/H1840/run.test.xml
AU src/test/regression/H1840/SimplestTest.j
A src/test/regression/H2092
AU src/test/regression/H2092/Test.java
AU src/test/regression/H2092/run.test.xml
A src/test/regression/H2335
AU src/test/regression/H2335/run.test.xml
AU src/test/regression/H2335/SimplestLibraryPathTest.java
AU src/test/regression/H2335/readme.txt
A src/test/regression/H5206
AU src/test/regression/H5206/VolatileLongTest.java
AU src/test/regression/H5206/run.test.xml
A src/test/regression/H3380
AU src/test/regression/H3380/run.test.xml
AU src/test/regression/H3380/LongToBitsTest.java
A src/test/regression/H2057
AU src/test/regression/H2057/run.test.xml
AU src/test/regression/H2057/SyncTest.java
A src/test/regression/H4073
AU src/test/regression/H4073/Test.java
AU src/test/regression/H4073/run.test.xml
A src/test/regression/H4514
AU src/test/regression/H4514/Test.java
AU src/test/regression/H4514/run.test.xml
A src/test/regression/H3228
AU src/test/regression/H3228/run.test.xml
AU src/test/regression/H3228/H3228.java
A src/test/regression/H3822
AU src/test/regression/H3822/Test.java
A src/test/regression/H5127
AU src/test/regression/H5127/Test.java
AU src/test/regression/H5127/run.test.xml
A src/test/regression/H3382
AU src/test/regression/H3382/run.test.xml
AU src/test/regression/H3382/Test.j
AU src/test/regression/H3382/TestX.java
A src/test/regression/H3067
AU src/test/regression/H3067/Test.java
AU src/test/regression/H3067/WideGoto.j
A src/test/regression/H4751
AU src/test/regression/H4751/Test.java
AU src/test/regression/H4751/run.test.xml
A src/test/regression/H5480
AU src/test/regression/H5480/run.test.xml
AU src/test/regression/H5480/LooseMathTest.java
A src/test/regression/H3582
AU src/test/regression/H3582/Test.java
A src/test/regression/H2259
AU src/test/regression/H2259/run.test.xml
AU src/test/regression/H2259/H2259.java
A src/test/regression/H2773
AU src/test/regression/H2773/run.test.xml
AU src/test/regression/H2773/InfinityTest.java
A src/test/regression/H3862
AU src/test/regression/H3862/neg.j
AU src/test/regression/H3862/run.test.xml
AU src/test/regression/H3862/neg2.j
AU src/test/regression/H3862/neg3.j
AU src/test/regression/H3862/SubrBounds.java
AU src/test/regression/H3862/pos.j
AU src/test/regression/H3862/pos2.j
A src/test/regression/H3908
AU src/test/regression/H3908/InvokeTest.java
A src/test/regression/H3909
AU src/test/regression/H3909/run.test.xml
AU src/test/regression/H3909/FinalizerThreadGroup.java
AU src/test/regression/H3909/FinalizerThreadGroup.cpp
A src/test/regression/H3784
AU src/test/regression/H3784/Test.java
AU src/test/regression/H3784/run.test.xml
AU src/test/regression/H3784/check.cpp
A src/test/regression/H3982
AU src/test/regression/H3982/run.test.xml
AU src/test/regression/H3982/EmptyStackTrace.java
AU src/test/regression/H3982/EmptyStackTrace.cpp
A src/test/regression/H4675
AU src/test/regression/H4675/run.test.xml
AU src/test/regression/H4675/DivLongTest.java
A src/test/regression/H4595
AU src/test/regression/H4595/Test.java
AU src/test/regression/H4595/run.test.xml
A src/test/regression/H4874
AU src/test/regression/H4874/Test.java
AU src/test/regression/H4874/run.test.xml
A src/test/harmony-1800
AU src/test/harmony-1800/testExec1.java
A src/test/microbenchmark
A src/test/microbenchmark/harmony-2012
AU src/test/microbenchmark/harmony-2012/test2012.java
A src/test/microbenchmark/harmony-2874
AU src/test/microbenchmark/harmony-2874/test0.java
AU src/test/microbenchmark/harmony-2874/test1.java
AU src/test/microbenchmark/harmony-2874/test2.java
A src/test/microbenchmark/harmony-2223
AU src/test/microbenchmark/harmony-2223/test_longmuldiv_speed.java
A src/test/microbenchmark/harmony-3243
AU src/test/microbenchmark/harmony-3243/ArrayFillPerf.java
A src/test/microbenchmark/harmony-3630
A src/test/microbenchmark/harmony-3630/abstractCall
AU src/test/microbenchmark/harmony-3630/abstractCall/test.java
A src/test/microbenchmark/harmony-3630/virtualCall
AU src/test/microbenchmark/harmony-3630/virtualCall/test.java
A src/test/microbenchmark/harmony-3630/virtualIndirectCall
AU src/test/microbenchmark/harmony-3630/virtualIndirectCall/test.java
A src/test/microbenchmark/harmony-3630/directCall
AU src/test/microbenchmark/harmony-3630/directCall/test.java
A src/test/microbenchmark/harmony-3630/interfaceCall
AU src/test/microbenchmark/harmony-3630/interfaceCall/test.java
A src/test/microbenchmark/harmony-2345
AU src/test/microbenchmark/harmony-2345/test_f2i_speed.java
A src/test/microbenchmark/harmony-2247
AU src/test/microbenchmark/harmony-2247/ArraycopyTest.java
A src/test/microbenchmark/harmony-2815
AU src/test/microbenchmark/harmony-2815/SecurityPerfTest.java
A src/test/microbenchmark/harmony-5480
AU src/test/microbenchmark/harmony-5480/MathTest.java
A src/test/harmony-1417
AU src/test/harmony-1417/Test2_LE.java
A src/test/final_method_test
AU src/test/final_method_test/FinalMethodTest.java
A src/test/final_method_test/finalmethodtest
AU src/test/final_method_test/finalmethodtest/A.java
A src/test/verifier_aastore
A src/test/verifier_aastore/src
AU src/test/verifier_aastore/src/Test.java
AU src/test/verifier_aastore/src/TestInterface.java
AU src/test/verifier_aastore/src/TestAastore2.j
AU src/test/verifier_aastore/src/TestAastore.java
AU src/test/verifier_aastore/HowTo.txt
A src/test/invokespecial_super
A src/test/invokespecial_super/src
AU src/test/invokespecial_super/src/Test.java
AU src/test/invokespecial_super/src/TestInvokeSpecial.j
AU src/test/invokespecial_super/src/Super.j
AU src/test/invokespecial_super/HowTo.txt
A src/test/negative_array_size
AU src/test/negative_array_size/NegativeArray.java
A src/test/array_method_limit
A src/test/array_method_limit/src
AU src/test/array_method_limit/src/Test.java
AU src/test/array_method_limit/src/TestStatic.j
AU src/test/array_method_limit/src/Invoke.j
AU src/test/array_method_limit/src/InvokeInterface.j
AU src/test/array_method_limit/src/TestArray.j
AU src/test/array_method_limit/src/TestInterface.j
AU src/test/array_method_limit/src/TestSpecial.j
AU src/test/array_method_limit/src/TestVirtual.j
AU src/test/array_method_limit/HowTo.txt
A src/test/verifier_empty_init
A src/test/verifier_empty_init/src
AU src/test/verifier_empty_init/src/Test.java
AU src/test/verifier_empty_init/src/TestEmptyInit.j
AU src/test/verifier_empty_init/HowTo.txt
A src/test/package_tests
AU src/test/package_tests/Test1.java
AU src/test/package_tests/Test2.java
AU src/test/package_tests/Test3.java
A src/test/harmony-1694
AU src/test/harmony-1694/StressTest01.java
AU README.txt
A make
AU make/depends.xml
AU make/build-native.xml
A make/tests
AU make/tests/ehwa-test.xml
AU make/tests/test-common.xml
AU make/tests/jvmti-test.xml
AU make/tests/reg-test.xml
AU make/tests/smoke-test.xml
AU make/tests/lazy-test.xml
AU make/tests/reg-test-run.xml
AU make/tests/kernel-test.xml
AU make/tests/cunit-test.xml
A make/vm
AU make/vm/kernel.xml
AU make/vm/em.xml
AU make/vm/gc_gen.xml
AU make/vm/interpreter.xml
AU make/vm/port.xml
AU make/vm/common-vm.xml
AU make/vm/verifier-ext.xml
AU make/vm/verifier.xml
AU make/vm/vmcore.xml
AU make/vm/vmi.xml
AU make/vm/hythr.xml
AU make/vm/jitrino.xml
AU make/vm/port_ch.xml
AU make/vm/encoder.xml
A make/extra
AU make/extra/apr.xml
A make/classlib.override.file.patterns
A make/resources
A make/resources/patches
AU make/resources/harmonyvm.properties
AU make/resources/readme.txt
AU make/test.properties
AU make/properties.xml
AU make/build-java.xml
AU make/depends.properties
AU build.xml
U .
At revision 922679
no change for http://svn.apache.org/repos/asf/harmony/enhanced/classlib/trunk since the previous build
[harmony] $ ant -Duse.libstdc++6=true fetch-depends rebuild bundle-hdk
Buildfile: build.xml
fetch-classlib-libs:
BUILD FAILED
<http://hudson.zones.apache.org/hudson/job/Harmony-1.5-head-linux-x86_64-full-tests/ws/harmony/build.xml>:508: The following error occurred while executing this line:
java.io.FileNotFoundException: <http://hudson.zones.apache.org/hudson/job/Harmony-1.5-head-linux-x86_64-full-tests/ws/harmony/classlib/build.xml> (No such file or directory)
Total time: 0 seconds
Archiving artifacts
Recording test results