You are viewing a plain text version of this content. The canonical link for it is here.
Posted to oak-dev@jackrabbit.apache.org by Apache Jenkins Server <je...@builds.apache.org> on 2018/07/02 14:11:19 UTC

BUILD FAILURE: Jackrabbit Oak - Build # 1519 - Failure

The Apache Jenkins build system has built Jackrabbit Oak (build #1519)

Status: Failure

Check console output at https://builds.apache.org/job/Jackrabbit%20Oak/1519/ to view the results.

Changes:
[frm] OAK-6770 - Test the SCR component descriptors

 

Test results:
24 tests failed.
FAILED:  org.apache.jackrabbit.oak.upgrade.CopyCheckpointsTest.validateMigration[Without data store defined it always copies checkpoints]

Error Message:
javax.jcr.RepositoryException: Failed to copy content

Stack Trace:
java.lang.RuntimeException: javax.jcr.RepositoryException: Failed to copy content
	at org.apache.jackrabbit.oak.upgrade.CopyCheckpointsTest.prepare(CopyCheckpointsTest.java:141)
Caused by: javax.jcr.RepositoryException: Failed to copy content
	at org.apache.jackrabbit.oak.upgrade.CopyCheckpointsTest.prepare(CopyCheckpointsTest.java:141)
Caused by: java.lang.IllegalArgumentException
	at org.apache.jackrabbit.oak.upgrade.CopyCheckpointsTest.prepare(CopyCheckpointsTest.java:141)


FAILED:  org.apache.jackrabbit.oak.upgrade.CopyCheckpointsTest.validateMigration[Suppress the warning]

Error Message:
javax.jcr.RepositoryException: Failed to copy content

Stack Trace:
java.lang.RuntimeException: javax.jcr.RepositoryException: Failed to copy content
	at org.apache.jackrabbit.oak.upgrade.CopyCheckpointsTest.prepare(CopyCheckpointsTest.java:141)
Caused by: javax.jcr.RepositoryException: Failed to copy content
	at org.apache.jackrabbit.oak.upgrade.CopyCheckpointsTest.prepare(CopyCheckpointsTest.java:141)
Caused by: java.lang.IllegalArgumentException
	at org.apache.jackrabbit.oak.upgrade.CopyCheckpointsTest.prepare(CopyCheckpointsTest.java:141)


FAILED:  org.apache.jackrabbit.oak.upgrade.CopyCheckpointsTest.validateMigration[Source data store defined, checkpoints migrated]

Error Message:
javax.jcr.RepositoryException: Failed to copy content

Stack Trace:
java.lang.RuntimeException: javax.jcr.RepositoryException: Failed to copy content
	at org.apache.jackrabbit.oak.upgrade.CopyCheckpointsTest.prepare(CopyCheckpointsTest.java:141)
Caused by: javax.jcr.RepositoryException: Failed to copy content
	at org.apache.jackrabbit.oak.upgrade.CopyCheckpointsTest.prepare(CopyCheckpointsTest.java:141)
Caused by: java.lang.IllegalArgumentException
	at org.apache.jackrabbit.oak.upgrade.CopyCheckpointsTest.prepare(CopyCheckpointsTest.java:141)


FAILED:  org.apache.jackrabbit.oak.upgrade.IgnoreMissingBinariesTest.validateMigration

Error Message:
javax.jcr.RepositoryException: Failed to copy content

Stack Trace:
java.lang.RuntimeException: javax.jcr.RepositoryException: Failed to copy content
	at org.apache.jackrabbit.oak.upgrade.IgnoreMissingBinariesTest.prepare(IgnoreMissingBinariesTest.java:63)
Caused by: javax.jcr.RepositoryException: Failed to copy content
	at org.apache.jackrabbit.oak.upgrade.IgnoreMissingBinariesTest.prepare(IgnoreMissingBinariesTest.java:63)
Caused by: java.lang.IllegalArgumentException
	at org.apache.jackrabbit.oak.upgrade.IgnoreMissingBinariesTest.prepare(IgnoreMissingBinariesTest.java:63)


FAILED:  org.apache.jackrabbit.oak.upgrade.UpgradeOldSegmentTest.upgradeFrom10

Error Message:
javax.jcr.RepositoryException: Failed to copy content

Stack Trace:
java.lang.RuntimeException: javax.jcr.RepositoryException: Failed to copy content
	at org.apache.jackrabbit.oak.upgrade.UpgradeOldSegmentTest.upgradeFrom10(UpgradeOldSegmentTest.java:62)
Caused by: javax.jcr.RepositoryException: Failed to copy content
	at org.apache.jackrabbit.oak.upgrade.UpgradeOldSegmentTest.upgradeFrom10(UpgradeOldSegmentTest.java:62)
Caused by: java.lang.IllegalArgumentException
	at org.apache.jackrabbit.oak.upgrade.UpgradeOldSegmentTest.upgradeFrom10(UpgradeOldSegmentTest.java:62)


FAILED:  org.apache.jackrabbit.oak.upgrade.cli.JdbcToSegmentTest.validateMigration

Error Message:
javax.jcr.RepositoryException: Failed to copy content

Stack Trace:
java.lang.RuntimeException: javax.jcr.RepositoryException: Failed to copy content
Caused by: javax.jcr.RepositoryException: Failed to copy content
Caused by: java.lang.IllegalArgumentException


FAILED:  org.apache.jackrabbit.oak.upgrade.cli.JdbcToSegmentWithMetadataTest.validateMigration

Error Message:
javax.jcr.RepositoryException: Failed to copy content

Stack Trace:
java.lang.RuntimeException: javax.jcr.RepositoryException: Failed to copy content
Caused by: javax.jcr.RepositoryException: Failed to copy content
Caused by: java.lang.IllegalArgumentException


FAILED:  org.apache.jackrabbit.oak.upgrade.cli.SegmentTarToSegmentTest.validateMigration

Error Message:
javax.jcr.RepositoryException: Failed to copy content

Stack Trace:
java.lang.RuntimeException: javax.jcr.RepositoryException: Failed to copy content
Caused by: javax.jcr.RepositoryException: Failed to copy content
Caused by: java.lang.IllegalArgumentException


FAILED:  org.apache.jackrabbit.oak.upgrade.cli.SegmentToJdbcTest.validateMigration

Error Message:
javax.jcr.RepositoryException: Failed to copy content

Stack Trace:
java.lang.RuntimeException: javax.jcr.RepositoryException: Failed to copy content
Caused by: javax.jcr.RepositoryException: Failed to copy content
Caused by: java.lang.IllegalArgumentException


FAILED:  org.apache.jackrabbit.oak.upgrade.cli.SegmentToSegmentTarTest.validateMigration

Error Message:
javax.jcr.RepositoryException: Failed to copy content

Stack Trace:
java.lang.RuntimeException: javax.jcr.RepositoryException: Failed to copy content
Caused by: javax.jcr.RepositoryException: Failed to copy content
Caused by: java.lang.IllegalArgumentException


FAILED:  org.apache.jackrabbit.oak.upgrade.cli.SegmentToSegmentTarWithMissingDestinationDirectoryTest.validateMigration

Error Message:
javax.jcr.RepositoryException: Failed to copy content

Stack Trace:
java.lang.RuntimeException: javax.jcr.RepositoryException: Failed to copy content
Caused by: javax.jcr.RepositoryException: Failed to copy content
Caused by: java.lang.IllegalArgumentException


FAILED:  org.apache.jackrabbit.oak.upgrade.cli.SegmentToSegmentTest.validateMigration

Error Message:
javax.jcr.RepositoryException: Failed to copy content

Stack Trace:
java.lang.RuntimeException: javax.jcr.RepositoryException: Failed to copy content
Caused by: javax.jcr.RepositoryException: Failed to copy content
Caused by: java.lang.IllegalArgumentException


FAILED:  org.apache.jackrabbit.oak.upgrade.cli.SegmentToSegmentWithMissingDestinationDirectoryTest.validateMigration

Error Message:
javax.jcr.RepositoryException: Failed to copy content

Stack Trace:
java.lang.RuntimeException: javax.jcr.RepositoryException: Failed to copy content
Caused by: javax.jcr.RepositoryException: Failed to copy content
Caused by: java.lang.IllegalArgumentException


FAILED:  org.apache.jackrabbit.oak.upgrade.cli.blob.CopyBinariesTest.validateMigration[Copy references, no blobstores defined, segment -> segment]

Error Message:
javax.jcr.RepositoryException: Failed to copy content

Stack Trace:
java.lang.RuntimeException: javax.jcr.RepositoryException: Failed to copy content
	at org.apache.jackrabbit.oak.upgrade.cli.blob.CopyBinariesTest.prepare(CopyBinariesTest.java:195)
Caused by: javax.jcr.RepositoryException: Failed to copy content
	at org.apache.jackrabbit.oak.upgrade.cli.blob.CopyBinariesTest.prepare(CopyBinariesTest.java:195)
Caused by: java.lang.IllegalArgumentException
	at org.apache.jackrabbit.oak.upgrade.cli.blob.CopyBinariesTest.prepare(CopyBinariesTest.java:195)


FAILED:  org.apache.jackrabbit.oak.upgrade.cli.blob.CopyBinariesTest.validateMigration[Copy references, no blobstores defined, segment-tar -> segment-tar]

Error Message:
javax.jcr.RepositoryException: Failed to copy content

Stack Trace:
java.lang.RuntimeException: javax.jcr.RepositoryException: Failed to copy content
	at org.apache.jackrabbit.oak.upgrade.cli.blob.CopyBinariesTest.prepare(CopyBinariesTest.java:195)
Caused by: javax.jcr.RepositoryException: Failed to copy content
	at org.apache.jackrabbit.oak.upgrade.cli.blob.CopyBinariesTest.prepare(CopyBinariesTest.java:195)
Caused by: java.lang.IllegalArgumentException
	at org.apache.jackrabbit.oak.upgrade.cli.blob.CopyBinariesTest.prepare(CopyBinariesTest.java:195)


FAILED:  org.apache.jackrabbit.oak.upgrade.cli.blob.CopyBinariesTest.validateMigration[Copy references, no blobstores defined, segment -> segment-tar]

Error Message:
javax.jcr.RepositoryException: Failed to copy content

Stack Trace:
java.lang.RuntimeException: javax.jcr.RepositoryException: Failed to copy content
	at org.apache.jackrabbit.oak.upgrade.cli.blob.CopyBinariesTest.prepare(CopyBinariesTest.java:195)
Caused by: javax.jcr.RepositoryException: Failed to copy content
	at org.apache.jackrabbit.oak.upgrade.cli.blob.CopyBinariesTest.prepare(CopyBinariesTest.java:195)
Caused by: java.lang.IllegalArgumentException
	at org.apache.jackrabbit.oak.upgrade.cli.blob.CopyBinariesTest.prepare(CopyBinariesTest.java:195)


FAILED:  org.apache.jackrabbit.oak.upgrade.cli.blob.CopyBinariesTest.validateMigration[Copy embedded to embedded, no blobstores defined]

Error Message:
javax.jcr.RepositoryException: Failed to copy content

Stack Trace:
java.lang.RuntimeException: javax.jcr.RepositoryException: Failed to copy content
	at org.apache.jackrabbit.oak.upgrade.cli.blob.CopyBinariesTest.prepare(CopyBinariesTest.java:195)
Caused by: javax.jcr.RepositoryException: Failed to copy content
	at org.apache.jackrabbit.oak.upgrade.cli.blob.CopyBinariesTest.prepare(CopyBinariesTest.java:195)
Caused by: java.lang.IllegalArgumentException
	at org.apache.jackrabbit.oak.upgrade.cli.blob.CopyBinariesTest.prepare(CopyBinariesTest.java:195)


FAILED:  org.apache.jackrabbit.oak.upgrade.cli.blob.CopyBinariesTest.validateMigration[Copy embedded to external, no blobstores defined]

Error Message:
javax.jcr.RepositoryException: Failed to copy content

Stack Trace:
java.lang.RuntimeException: javax.jcr.RepositoryException: Failed to copy content
	at org.apache.jackrabbit.oak.upgrade.cli.blob.CopyBinariesTest.prepare(CopyBinariesTest.java:195)
Caused by: javax.jcr.RepositoryException: Failed to copy content
	at org.apache.jackrabbit.oak.upgrade.cli.blob.CopyBinariesTest.prepare(CopyBinariesTest.java:195)
Caused by: java.lang.IllegalArgumentException
	at org.apache.jackrabbit.oak.upgrade.cli.blob.CopyBinariesTest.prepare(CopyBinariesTest.java:195)


FAILED:  org.apache.jackrabbit.oak.upgrade.cli.blob.CopyBinariesTest.validateMigration[Copy references, src blobstore defined]

Error Message:
javax.jcr.RepositoryException: Failed to copy content

Stack Trace:
java.lang.RuntimeException: javax.jcr.RepositoryException: Failed to copy content
	at org.apache.jackrabbit.oak.upgrade.cli.blob.CopyBinariesTest.prepare(CopyBinariesTest.java:195)
Caused by: javax.jcr.RepositoryException: Failed to copy content
	at org.apache.jackrabbit.oak.upgrade.cli.blob.CopyBinariesTest.prepare(CopyBinariesTest.java:195)
Caused by: java.lang.IllegalArgumentException
	at org.apache.jackrabbit.oak.upgrade.cli.blob.CopyBinariesTest.prepare(CopyBinariesTest.java:195)


FAILED:  org.apache.jackrabbit.oak.upgrade.cli.blob.CopyBinariesTest.validateMigration[Copy external to embedded, src blobstore defined]

Error Message:
javax.jcr.RepositoryException: Failed to copy content

Stack Trace:
java.lang.RuntimeException: javax.jcr.RepositoryException: Failed to copy content
	at org.apache.jackrabbit.oak.upgrade.cli.blob.CopyBinariesTest.prepare(CopyBinariesTest.java:195)
Caused by: javax.jcr.RepositoryException: Failed to copy content
	at org.apache.jackrabbit.oak.upgrade.cli.blob.CopyBinariesTest.prepare(CopyBinariesTest.java:195)
Caused by: java.lang.IllegalArgumentException
	at org.apache.jackrabbit.oak.upgrade.cli.blob.CopyBinariesTest.prepare(CopyBinariesTest.java:195)


FAILED:  org.apache.jackrabbit.oak.upgrade.cli.blob.CopyBinariesTest.validateMigration[Copy external to external, src blobstore defined]

Error Message:
javax.jcr.RepositoryException: Failed to copy content

Stack Trace:
java.lang.RuntimeException: javax.jcr.RepositoryException: Failed to copy content
	at org.apache.jackrabbit.oak.upgrade.cli.blob.CopyBinariesTest.prepare(CopyBinariesTest.java:195)
Caused by: javax.jcr.RepositoryException: Failed to copy content
	at org.apache.jackrabbit.oak.upgrade.cli.blob.CopyBinariesTest.prepare(CopyBinariesTest.java:195)
Caused by: java.lang.IllegalArgumentException
	at org.apache.jackrabbit.oak.upgrade.cli.blob.CopyBinariesTest.prepare(CopyBinariesTest.java:195)


FAILED:  org.apache.jackrabbit.oak.upgrade.cli.blob.FbsToFbsTest.validateMigration

Error Message:
javax.jcr.RepositoryException: Failed to copy content

Stack Trace:
java.lang.RuntimeException: javax.jcr.RepositoryException: Failed to copy content
Caused by: javax.jcr.RepositoryException: Failed to copy content
Caused by: java.lang.IllegalArgumentException


FAILED:  org.apache.jackrabbit.oak.upgrade.cli.blob.FbsToFdsTest.validateMigration

Error Message:
javax.jcr.RepositoryException: Failed to copy content

Stack Trace:
java.lang.RuntimeException: javax.jcr.RepositoryException: Failed to copy content
Caused by: javax.jcr.RepositoryException: Failed to copy content
Caused by: java.lang.IllegalArgumentException


FAILED:  org.apache.jackrabbit.oak.upgrade.cli.blob.FdsToFbsTest.validateMigration

Error Message:
javax.jcr.RepositoryException: Failed to copy content

Stack Trace:
java.lang.RuntimeException: javax.jcr.RepositoryException: Failed to copy content
Caused by: javax.jcr.RepositoryException: Failed to copy content
Caused by: java.lang.IllegalArgumentException

BUILD FAILURE: Jackrabbit Oak - Build # 1520 - Still Failing

Posted by Apache Jenkins Server <je...@builds.apache.org>.
The Apache Jenkins build system has built Jackrabbit Oak (build #1520)

Status: Still Failing

Check console output at https://builds.apache.org/job/Jackrabbit%20Oak/1520/ to view the results.

Changes:
[frm] OAK-6770 - Test the metatype information descriptors

 

Test results:
1 tests failed.
FAILED:  org.apache.jackrabbit.oak.run.osgi.SecurityProviderRegistrationTest.testRequiredTokenConfigurationNotAvailable

Error Message:
assert securityProviderServiceReferences != null
       |                                 |
       null                              false

Stack Trace:
org.codehaus.groovy.runtime.powerassert.PowerAssertionError: 
assert securityProviderServiceReferences != null
       |                                 |
       null                              false
	at org.apache.jackrabbit.oak.run.osgi.SecurityProviderRegistrationTest.testRequiredService(SecurityProviderRegistrationTest.groovy:309)
	at org.apache.jackrabbit.oak.run.osgi.SecurityProviderRegistrationTest.testRequiredTokenConfigurationNotAvailable(SecurityProviderRegistrationTest.groovy:102)