You are viewing a plain text version of this content. The canonical link for it is here.
Posted to builds@beam.apache.org by Apache Jenkins Server <je...@builds.apache.org> on 2022/06/15 18:01:22 UTC

Build failed in Jenkins: beam_PostCommit_XVR_Spark #3843

See <https://ci-beam.apache.org/job/beam_PostCommit_XVR_Spark/3843/display/redirect?page=changes>

Changes:

[naireenhussain] convert windmill min timestamp to beam min timestamp

[dannymccormick] Mark issues as triaged when they are assigned

[noreply] Sickbay Pytorch example IT test (#21857)

[noreply] Add required=True to Pytorch image classification example (#21883)

[noreply] Switch go todos from issue # syntax to links (#21890)


------------------------------------------
[...truncated 122.24 KB...]
Collecting sqlalchemy<2.0,>=1.3
  Using cached SQLAlchemy-1.4.37-cp37-cp37m-manylinux_2_5_x86_64.manylinux1_x86_64.manylinux_2_17_x86_64.manylinux2014_x86_64.whl (1.6 MB)
Collecting psycopg2-binary<3.0.0,>=2.8.5
  Using cached psycopg2_binary-2.9.3-cp37-cp37m-manylinux_2_17_x86_64.manylinux2014_x86_64.whl (3.0 MB)
Collecting testcontainers[mysql]<4.0.0,>=3.0.3
  Using cached testcontainers-3.6.0-py2.py3-none-any.whl (41 kB)
Collecting cryptography>=36.0.0
  Using cached cryptography-37.0.2-cp36-abi3-manylinux_2_24_x86_64.whl (4.0 MB)
Collecting azure-storage-blob>=12.3.2
  Using cached azure_storage_blob-12.12.0-py3-none-any.whl (366 kB)
Collecting azure-core>=1.7.0
  Using cached azure_core-1.24.1-py3-none-any.whl (178 kB)
Requirement already satisfied: six>=1.11.0 in <https://ci-beam.apache.org/job/beam_PostCommit_XVR_Spark/ws/src/build/gradleenv/1922375555/lib/python3.7/site-packages> (from azure-core>=1.7.0->apache-beam==2.40.0.dev0) (1.16.0)
Collecting msrest>=0.6.21
  Using cached msrest-0.7.1-py3-none-any.whl (85 kB)
Collecting s3transfer<0.7.0,>=0.6.0
  Using cached s3transfer-0.6.0-py3-none-any.whl (79 kB)

> Task :sdks:java:extensions:sql:expansion-service:shadowJar FROM-CACHE
> Task :sdks:java:io:google-cloud-platform:expansion-service:distZip
> Task :sdks:java:io:google-cloud-platform:expansion-service:compileTestJava NO-SOURCE
> Task :sdks:java:io:google-cloud-platform:expansion-service:testClasses UP-TO-DATE

> Task :sdks:python:installGcpTest
Collecting botocore<1.28.0,>=1.27.9
  Using cached botocore-1.27.9-py3-none-any.whl (8.9 MB)
Collecting jmespath<2.0.0,>=0.7.1
  Using cached jmespath-1.0.0-py3-none-any.whl (23 kB)

> Task :sdks:java:io:google-cloud-platform:expansion-service:packageTests

> Task :sdks:python:installGcpTest
Collecting cffi>=1.12
  Using cached cffi-1.15.0-cp37-cp37m-manylinux_2_12_x86_64.manylinux2010_x86_64.whl (427 kB)
Collecting oauth2client>=1.4.12
  Using cached oauth2client-4.1.3-py2.py3-none-any.whl (98 kB)
Collecting fasteners>=0.14
  Using cached fasteners-0.17.3-py3-none-any.whl (18 kB)
Collecting pyasn1-modules>=0.2.1
  Using cached pyasn1_modules-0.2.8-py2.py3-none-any.whl (155 kB)
Collecting rsa<5,>=3.1.4
  Using cached rsa-4.8-py3-none-any.whl (39 kB)
Collecting google-api-core[grpc]!=2.0.*,!=2.1.*,!=2.2.*,!=2.3.0,<3.0.0dev,>=1.31.5
  Using cached google_api_core-2.8.2-py3-none-any.whl (114 kB)
Requirement already satisfied: packaging<22.0dev,>=14.3 in <https://ci-beam.apache.org/job/beam_PostCommit_XVR_Spark/ws/src/build/gradleenv/1922375555/lib/python3.7/site-packages> (from google-cloud-bigquery<3,>=1.6.0->apache-beam==2.40.0.dev0) (21.3)
Collecting google-resumable-media<3.0dev,>=0.6.0
  Using cached google_resumable_media-2.3.3-py2.py3-none-any.whl (76 kB)
Collecting grpc-google-iam-v1<0.13dev,>=0.12.3
  Using cached grpc_google_iam_v1-0.12.4-py2.py3-none-any.whl (26 kB)
Collecting google-auth<3,>=1.18.0
  Using cached google_auth-1.35.0-py2.py3-none-any.whl (152 kB)
Collecting google-api-core<2.0.0dev,>=1.21.0
  Using cached google_api_core-1.31.6-py2.py3-none-any.whl (93 kB)
Requirement already satisfied: setuptools>=40.3.0 in <https://ci-beam.apache.org/job/beam_PostCommit_XVR_Spark/ws/src/build/gradleenv/1922375555/lib/python3.7/site-packages> (from google-auth<3,>=1.18.0->apache-beam==2.40.0.dev0) (62.4.0)
Collecting grpcio-status>=1.16.0
  Using cached grpcio_status-1.46.3-py3-none-any.whl (10.0 kB)
Collecting overrides<7.0.0,>=6.0.1
  Using cached overrides-6.1.0-py3-none-any.whl (14 kB)
Collecting docopt
  Using cached docopt-0.6.2-py2.py3-none-any.whl
Requirement already satisfied: pyparsing!=3.0.0,!=3.0.1,!=3.0.2,!=3.0.3,<4,>=2.4.2 in <https://ci-beam.apache.org/job/beam_PostCommit_XVR_Spark/ws/src/build/gradleenv/1922375555/lib/python3.7/site-packages> (from httplib2<0.21.0,>=0.8->apache-beam==2.40.0.dev0) (3.0.9)
Collecting pbr>=0.11
  Using cached pbr-5.9.0-py2.py3-none-any.whl (112 kB)

> Task :sdks:java:io:google-cloud-platform:expansion-service:shadowJar FROM-CACHE

> Task :sdks:python:installGcpTest
Collecting wcwidth
  Using cached wcwidth-0.2.5-py2.py3-none-any.whl (30 kB)
Collecting attrs>=17.4.0
  Using cached attrs-21.4.0-py2.py3-none-any.whl (60 kB)
Requirement already satisfied: py>=1.5.0 in <https://ci-beam.apache.org/job/beam_PostCommit_XVR_Spark/ws/src/build/gradleenv/1922375555/lib/python3.7/site-packages> (from pytest<5.0,>=4.4.0->apache-beam==2.40.0.dev0) (1.11.0)
Collecting pluggy<1.0,>=0.12
  Using cached pluggy-0.13.1-py2.py3-none-any.whl (18 kB)
Collecting atomicwrites>=1.0
  Using cached atomicwrites-1.4.0-py2.py3-none-any.whl (6.8 kB)
Requirement already satisfied: importlib-metadata>=0.12 in <https://ci-beam.apache.org/job/beam_PostCommit_XVR_Spark/ws/src/build/gradleenv/1922375555/lib/python3.7/site-packages> (from pytest<5.0,>=4.4.0->apache-beam==2.40.0.dev0) (2.1.3)
Collecting more-itertools>=4.0.0
  Using cached more_itertools-8.13.0-py3-none-any.whl (51 kB)
Collecting pytest-forked
  Using cached pytest_forked-1.4.0-py3-none-any.whl (4.9 kB)
Collecting execnet>=1.1
  Using cached execnet-1.9.0-py2.py3-none-any.whl (39 kB)
Collecting certifi>=2017.4.17
  Using cached certifi-2022.5.18.1-py3-none-any.whl (155 kB)
Collecting charset-normalizer~=2.0.0
  Using cached charset_normalizer-2.0.12-py3-none-any.whl (39 kB)
Collecting idna<4,>=2.5
  Using cached idna-3.3-py3-none-any.whl (61 kB)
Collecting urllib3<1.27,>=1.21.1
  Using cached urllib3-1.26.9-py2.py3-none-any.whl (138 kB)
Collecting scipy>=1.1.0
  Using cached scipy-1.7.3-cp37-cp37m-manylinux_2_12_x86_64.manylinux2010_x86_64.whl (38.1 MB)
Collecting threadpoolctl>=2.0.0
  Using cached threadpoolctl-3.1.0-py3-none-any.whl (14 kB)
Collecting greenlet!=0.4.17
  Using cached greenlet-1.1.2-cp37-cp37m-manylinux_2_17_x86_64.manylinux2014_x86_64.whl (150 kB)
Collecting wrapt
  Using cached wrapt-1.14.1-cp37-cp37m-manylinux_2_5_x86_64.manylinux1_x86_64.manylinux_2_17_x86_64.manylinux2014_x86_64.whl (75 kB)
Collecting deprecation
  Using cached deprecation-2.1.0-py2.py3-none-any.whl (11 kB)
Collecting docker>=4.0.0
  Using cached docker-5.0.3-py2.py3-none-any.whl (146 kB)
Collecting pymysql
  Using cached PyMySQL-1.0.2-py3-none-any.whl (43 kB)
Collecting pycparser
  Using cached pycparser-2.21-py2.py3-none-any.whl (118 kB)
Collecting websocket-client>=0.32.0
  Using cached websocket_client-1.3.2-py3-none-any.whl (54 kB)
Collecting googleapis-common-protos<2.0dev,>=1.6.0
  Using cached googleapis_common_protos-1.56.2-py2.py3-none-any.whl (211 kB)
WARNING: google-api-core 2.8.2 does not provide the extra 'grpcgcp'
Collecting google-api-core[grpc,grpcgcp]!=2.0.*,!=2.1.*,!=2.2.*,!=2.3.0,<3.0.0dev,>=1.31.5
  Using cached google_api_core-2.8.1-py3-none-any.whl (114 kB)
  Using cached google_api_core-2.8.0-py3-none-any.whl (114 kB)
  Using cached google_api_core-2.7.3-py3-none-any.whl (114 kB)
  Using cached google_api_core-2.7.2-py3-none-any.whl (114 kB)
  Using cached google_api_core-2.7.1-py3-none-any.whl (114 kB)
  Using cached google_api_core-2.7.0-py3-none-any.whl (114 kB)
  Using cached google_api_core-2.6.1-py3-none-any.whl (114 kB)
  Using cached google_api_core-2.6.0-py2.py3-none-any.whl (114 kB)
  Using cached google_api_core-2.5.0-py2.py3-none-any.whl (111 kB)
  Using cached google_api_core-2.4.0-py2.py3-none-any.whl (111 kB)
  Using cached google_api_core-2.3.2-py2.py3-none-any.whl (109 kB)
Collecting google-crc32c<2.0dev,>=1.0
  Using cached google_crc32c-1.3.0-cp37-cp37m-manylinux_2_12_x86_64.manylinux2010_x86_64.whl (38 kB)
Requirement already satisfied: zipp>=0.5 in <https://ci-beam.apache.org/job/beam_PostCommit_XVR_Spark/ws/src/build/gradleenv/1922375555/lib/python3.7/site-packages> (from importlib-metadata>=0.12->pytest<5.0,>=4.4.0->apache-beam==2.40.0.dev0) (3.8.0)

> Task :sdks:java:io:google-cloud-platform:expansion-service:startShadowScripts
> Task :sdks:java:io:google-cloud-platform:expansion-service:shadowDistTar

> Task :sdks:python:installGcpTest
Collecting isodate>=0.6.0
  Using cached isodate-0.6.1-py2.py3-none-any.whl (41 kB)
Collecting requests-oauthlib>=0.5.0
  Using cached requests_oauthlib-1.3.1-py2.py3-none-any.whl (23 kB)
Collecting pyasn1>=0.1.7
  Using cached pyasn1-0.4.8-py2.py3-none-any.whl (77 kB)
Collecting typing-utils>=0.0.3
  Using cached typing_utils-0.1.0-py3-none-any.whl (10 kB)
Collecting oauthlib>=3.0.0
  Using cached oauthlib-3.2.0-py3-none-any.whl (151 kB)
Building wheels for collected packages: apache-beam
  Building wheel for apache-beam (setup.py): started
  Building wheel for apache-beam (setup.py): finished with status 'done'
  Created wheel for apache-beam: filename=apache_beam-2.40.0.dev0-py3-none-any.whl size=2802082 sha256=e860edf12d107a3609c4c7f274262e2ed2e4742c70e1ae0ac5a9f04597bdb0ea
  Stored in directory: /home/jenkins/.cache/pip/wheels/b3/32/a6/13758c4c83e4f61a605abab3d30a52863a1936b188575eeeff
Successfully built apache-beam

> Task :sdks:java:io:google-cloud-platform:expansion-service:shadowDistZip
> Task :sdks:java:io:google-cloud-platform:expansion-service:assemble
> Task :sdks:java:io:google-cloud-platform:expansion-service:analyzeClassesDependencies
> Task :sdks:java:io:google-cloud-platform:expansion-service:analyzeTestClassesDependencies SKIPPED
> Task :sdks:java:io:google-cloud-platform:expansion-service:analyzeDependencies
> Task :sdks:java:io:google-cloud-platform:expansion-service:checkstyleMain NO-SOURCE
> Task :sdks:java:io:google-cloud-platform:expansion-service:checkstyleTest NO-SOURCE
> Task :sdks:java:io:google-cloud-platform:expansion-service:javadoc NO-SOURCE
> Task :sdks:java:io:google-cloud-platform:expansion-service:spotbugsMain NO-SOURCE
> Task :sdks:java:io:google-cloud-platform:expansion-service:spotbugsTest SKIPPED
> Task :sdks:java:io:google-cloud-platform:expansion-service:test NO-SOURCE
> Task :sdks:java:io:google-cloud-platform:expansion-service:check
> Task :sdks:java:io:google-cloud-platform:expansion-service:build

> Task :sdks:python:installGcpTest
Installing collected packages: wcwidth, pytz, pyasn1, parameterized, docopt, crcmod, wrapt, websocket-client, urllib3, typing-utils, typing-extensions, threadpoolctl, tenacity, rsa, pyyaml, python-dateutil, pymysql, pymongo, pyhamcrest, pydot, pycparser, pyasn1-modules, psycopg2-binary, proto-plus, pbr, orjson, oauthlib, numpy, more-itertools, joblib, jmespath, isodate, idna, httplib2, greenlet, googleapis-common-protos, google-crc32c, fasteners, fastavro, execnet, dill, cloudpickle, charset-normalizer, certifi, cachetools, attrs, atomicwrites, sqlalchemy, scipy, requests, pyarrow, pluggy, pandas, overrides, oauth2client, mock, grpcio-status, grpcio-gcp, google-resumable-media, google-auth, freezegun, deprecation, cffi, botocore, scikit-learn, s3transfer, requests-oauthlib, requests_mock, pytest, hdfs, grpc-google-iam-v1, google-auth-httplib2, google-apitools, google-api-core, docker, cryptography, azure-core, testcontainers, pytest-timeout, pytest-forked, msrest, google-cloud-core, boto3, apache-beam, pytest-xdist, google-cloud-vision, google-cloud-videointelligence, google-cloud-spanner, google-cloud-recommendations-ai, google-cloud-pubsub, google-cloud-language, google-cloud-dlp, google-cloud-datastore, google-cloud-bigtable, google-cloud-bigquery-storage, google-cloud-bigquery, azure-storage-blob, google-cloud-pubsublite
  Attempting uninstall: pluggy
    Found existing installation: pluggy 1.0.0
    Uninstalling pluggy-1.0.0:
      Successfully uninstalled pluggy-1.0.0

> Task :release:go-licenses:java:dockerRun
# google.golang.org/protobuf/proto
src/google.golang.org/protobuf/proto/equal.go:36:33: undefined: reflect.Pointer

> Task :release:go-licenses:go:dockerRun
# google.golang.org/protobuf/proto
src/google.golang.org/protobuf/proto/equal.go:36:33: undefined: reflect.Pointer

> Task :release:go-licenses:py:dockerRun
# google.golang.org/protobuf/proto
src/google.golang.org/protobuf/proto/equal.go:36:33: undefined: reflect.Pointer

> Task :sdks:python:installGcpTest
Successfully installed apache-beam-2.40.0.dev0 atomicwrites-1.4.0 attrs-21.4.0 azure-core-1.24.1 azure-storage-blob-12.12.0 boto3-1.24.9 botocore-1.27.9 cachetools-4.2.4 certifi-2022.5.18.1 cffi-1.15.0 charset-normalizer-2.0.12 cloudpickle-2.1.0 crcmod-1.7 cryptography-37.0.2 deprecation-2.1.0 dill-0.3.5.1 docker-5.0.3 docopt-0.6.2 execnet-1.9.0 fastavro-1.5.1 fasteners-0.17.3 freezegun-1.2.1 google-api-core-1.31.6 google-apitools-0.5.31 google-auth-1.35.0 google-auth-httplib2-0.1.0 google-cloud-bigquery-2.34.4 google-cloud-bigquery-storage-2.13.2 google-cloud-bigtable-1.7.2 google-cloud-core-1.7.2 google-cloud-datastore-1.15.5 google-cloud-dlp-3.7.1 google-cloud-language-1.3.2 google-cloud-pubsub-2.13.0 google-cloud-pubsublite-1.4.2 google-cloud-recommendations-ai-0.2.0 google-cloud-spanner-1.19.3 google-cloud-videointelligence-1.16.3 google-cloud-vision-1.0.2 google-crc32c-1.3.0 google-resumable-media-2.3.3 googleapis-common-protos-1.56.2 greenlet-1.1.2 grpc-google-iam-v1-0.12.4 grpcio-gcp-0.2.2 grpcio-status-1.46.3 hdfs-2.7.0 httplib2-0.20.4 idna-3.3 isodate-0.6.1 jmespath-1.0.0 joblib-1.1.0 mock-2.0.0 more-itertools-8.13.0 msrest-0.7.1 numpy-1.21.6 oauth2client-4.1.3 oauthlib-3.2.0 orjson-3.7.2 overrides-6.1.0 pandas-1.3.5 parameterized-0.7.5 pbr-5.9.0 pluggy-0.13.1 proto-plus-1.20.6 psycopg2-binary-2.9.3 pyarrow-7.0.0 pyasn1-0.4.8 pyasn1-modules-0.2.8 pycparser-2.21 pydot-1.4.2 pyhamcrest-1.10.1 pymongo-3.12.3 pymysql-1.0.2 pytest-4.6.11 pytest-forked-1.4.0 pytest-timeout-1.4.2 pytest-xdist-1.34.0 python-dateutil-2.8.2 pytz-2022.1 pyyaml-6.0 requests-2.28.0 requests-oauthlib-1.3.1 requests_mock-1.9.3 rsa-4.8 s3transfer-0.6.0 scikit-learn-1.0.2 scipy-1.7.3 sqlalchemy-1.4.37 tenacity-5.1.5 testcontainers-3.6.0 threadpoolctl-3.1.0 typing-extensions-4.2.0 typing-utils-0.1.0 urllib3-1.26.9 wcwidth-0.2.5 websocket-client-1.3.2 wrapt-1.14.1

> Task :release:go-licenses:java:dockerRun FAILED
> Task :release:go-licenses:py:dockerRun FAILED
> Task :release:go-licenses:go:dockerRun FAILED

> Task :runners:spark:2:job-server:sparkJobServerCleanup
Stopping job server pid: 113822.

FAILURE: Build completed with 3 failures.

1: Task failed with an exception.
-----------
* What went wrong:
Execution failed for task ':release:go-licenses:java:dockerRun'.
> Process 'command 'docker'' finished with non-zero exit value 2

* Try:
> Run with --stacktrace option to get the stack trace.
> Run with --info or --debug option to get more log output.
> Run with --scan to get full insights.
==============================================================================

2: Task failed with an exception.
-----------
* What went wrong:
Execution failed for task ':release:go-licenses:py:dockerRun'.
> Process 'command 'docker'' finished with non-zero exit value 2

* Try:
> Run with --stacktrace option to get the stack trace.
> Run with --info or --debug option to get more log output.
> Run with --scan to get full insights.
==============================================================================

3: Task failed with an exception.
-----------
* What went wrong:
Execution failed for task ':release:go-licenses:go:dockerRun'.
> Process 'command 'docker'' finished with non-zero exit value 2

* Try:
> Run with --stacktrace option to get the stack trace.
> Run with --info or --debug option to get more log output.
> Run with --scan to get full insights.
==============================================================================

* Get more help at https://help.gradle.org

Deprecated Gradle features were used in this build, making it incompatible with Gradle 8.0.

You can use '--warning-mode all' to show the individual deprecation warnings and determine if they come from your own scripts or plugins.

See https://docs.gradle.org/7.4/userguide/command_line_interface.html#sec:command_line_warnings

Execution optimizations have been disabled for 1 invalid unit(s) of work during this build to ensure correctness.
Please consult deprecation warnings for more details.

BUILD FAILED in 2m 32s
252 actionable tasks: 168 executed, 72 from cache, 12 up-to-date

Publishing build scan...
https://gradle.com/s/f67uxlk4o3vfw

Build step 'Invoke Gradle script' changed build result to FAILURE
Build step 'Invoke Gradle script' marked build as failure

---------------------------------------------------------------------
To unsubscribe, e-mail: builds-unsubscribe@beam.apache.org
For additional commands, e-mail: builds-help@beam.apache.org


Jenkins build is back to normal : beam_PostCommit_XVR_Spark #3845

Posted by Apache Jenkins Server <je...@builds.apache.org>.
See <https://ci-beam.apache.org/job/beam_PostCommit_XVR_Spark/3845/display/redirect?page=changes>


---------------------------------------------------------------------
To unsubscribe, e-mail: builds-unsubscribe@beam.apache.org
For additional commands, e-mail: builds-help@beam.apache.org


Build failed in Jenkins: beam_PostCommit_XVR_Spark #3844

Posted by Apache Jenkins Server <je...@builds.apache.org>.
See <https://ci-beam.apache.org/job/beam_PostCommit_XVR_Spark/3844/display/redirect?page=changes>

Changes:

[nielm] Add Spanner Integration tests to verify exception handling

[noreply] Add Pytorch image segmentation example (#21766)

[noreply] Add README documentation for scikit-learn MNIST example (#21887)

[noreply] Decompose labels for new issues (#21888)

[noreply] Use Go 1.18 for go-licenses (#21896)

[noreply] [BEAM-12903] Cron job to cleanup Dataproc leaked resources (#21779)

[noreply] [BEAM-7209][BEAM-9351][BEAM-9428] Upgrade Hive to version 3.1.3 (#17749)

[noreply] Sharding IO tests (Kafka, Debezium, JDBC, Kinesis, Neo4j) from the

[noreply] Merge pull request #17604 from [BEAM-14315] Match updated files

[noreply] Merge pull request #21781 from Sklearn Mnist example and IT test

[noreply] Get the latest version of go-licenses (#21901)

[noreply] Hide internal helpers added to DoFn for batched DoFns (#21860)

[noreply] Updated documentation for ml.inference docs. (#21868)

[Pablo Estrada] Moving to 2.41.0-SNAPSHOT on master branch.


------------------------------------------
[...truncated 412.08 KB...]
    >
  >
  coders: <
    key: "c0@QjiFOCrSwa"
    value: <
      spec: <
        urn: "beam:coder:bytes:v1"
      >
    >
  >
  coders: <
    key: "c1"
    value: <
      spec: <
        urn: "beam:coder:global_window:v1"
      >
    >
  >
  coders: <
    key: "c1@QjiFOCrSwa"
    value: <
      spec: <
        urn: "beam:coder:kv:v1"
      >
      component_coder_ids: "c0@QjiFOCrSwa"
      component_coder_ids: "c0@QjiFOCrSwa"
    >
  >
  coders: <
    key: "c2"
    value: <
      spec: <
        urn: "beam:go:coder:custom:v1"
        payload: "Cgd2YXJpbnR6EgIIAhpdCklnaXRodWIuY29tL2FwYWNoZS9iZWFtL3Nka3MvdjIvZ28vcGtnL2JlYW0vY29yZS9ydW50aW1lL2NvZGVyeC5lbmNWYXJJbnRaEhAIFiIECBlADyoGCBQSAggIImkKSWdpdGh1Yi5jb20vYXBhY2hlL2JlYW0vc2Rrcy92Mi9nby9wa2cvYmVhbS9jb3JlL3J1bnRpbWUvY29kZXJ4LmRlY1ZhckludFoSHAgWIgQIGUADIgYIFBICCAgqBAgZQA8qBAgZQAE="
      >
    >
  >
  coders: <
    key: "c2@QjiFOCrSwa"
    value: <
      spec: <
        urn: "beam:coder:global_window:v1"
      >
    >
  >
  coders: <
    key: "c3"
    value: <
      spec: <
        urn: "beam:coder:length_prefix:v1"
      >
      component_coder_ids: "c2"
    >
  >
  coders: <
    key: "c4"
    value: <
      spec: <
        urn: "beam:coder:kv:v1"
      >
      component_coder_ids: "c0"
      component_coder_ids: "c0"
    >
  >
  environments: <
    key: "QjiFOCrSwabeam:env:docker:v1"
    value: <
      urn: "beam:env:docker:v1"
      payload: "\n apache/beam_java8_sdk:2.41.0.dev"
      capabilities: "beam:coder:bytes:v1"
      capabilities: "beam:coder:bool:v1"
      capabilities: "beam:coder:varint:v1"
      capabilities: "beam:coder:string_utf8:v1"
      capabilities: "beam:coder:iterable:v1"
      capabilities: "beam:coder:timer:v1"
      capabilities: "beam:coder:kv:v1"
      capabilities: "beam:coder:length_prefix:v1"
      capabilities: "beam:coder:global_window:v1"
      capabilities: "beam:coder:interval_window:v1"
      capabilities: "beam:coder:custom_window:v1"
      capabilities: "beam:coder:windowed_value:v1"
      capabilities: "beam:coder:double:v1"
      capabilities: "beam:coder:row:v1"
      capabilities: "beam:coder:param_windowed_value:v1"
      capabilities: "beam:coder:state_backed_iterable:v1"
      capabilities: "beam:coder:sharded_key:v1"
      capabilities: "beam:coder:nullable:v1"
      capabilities: "beam:protocol:multi_core_bundle_processing:v1"
      capabilities: "beam:protocol:progress_reporting:v1"
      capabilities: "beam:protocol:harness_monitoring_infos:v1"
      capabilities: "beam:protocol:control_request_elements_embedding:v1"
      capabilities: "beam:protocol:state_caching:v1"
      capabilities: "beam:version:sdk_base:apache/beam_java8_sdk:2.41.0.dev"
      capabilities: "beam:transform:sdf_truncate_sized_restrictions:v1"
      capabilities: "beam:transform:to_string:v1"
      dependencies: <
        type_urn: "beam:artifact:type:file:v1"
        type_payload: "\nL/tmp/artifacts/icedtea-sound-ebvtNFkfFXg4aaYFuDnwKpwDSjzsaZqlqv5iKxPTr-U.jar\022@79bbed34591f15783869a605b839f02a9c034a3cec699aa5aafe622b13d3afe5"
        role_urn: "beam:artifact:role:staging_to:v1"
        role_payload: "\n=icedtea-sound-ebvtNFkfFXg4aaYFuDnwKpwDSjzsaZqlqv5iKxPTr-U.jar"
      >
      dependencies: <
        type_urn: "beam:artifact:type:file:v1"
        type_payload: "\nF/tmp/artifacts/jaccess-ULFTCPsb6cLYZ0f1BG1FQfczmHNaZCx8plXuRDKpBqE.jar\022@50b15308fb1be9c2d86747f5046d4541f73398735a642c7ca655ee4432a906a1"
        role_urn: "beam:artifact:role:staging_to:v1"
        role_payload: "\n7jaccess-ULFTCPsb6cLYZ0f1BG1FQfczmHNaZCx8plXuRDKpBqE.jar"
      >
      dependencies: <
        type_urn: "beam:artifact:type:file:v1"
        type_payload: "\nI/tmp/artifacts/localedata-dUHqyGxaTVCjfTI8MckPYarZ3_mwf62udkxaHi1aKns.jar\022@7541eac86c5a4d50a37d323c31c90f61aad9dff9b07fadae764c5a1e2d5a2a7b"
        role_urn: "beam:artifact:role:staging_to:v1"
        role_payload: "\n:localedata-dUHqyGxaTVCjfTI8MckPYarZ3_mwf62udkxaHi1aKns.jar"
      >
      dependencies: <
        type_urn: "beam:artifact:type:file:v1"
        type_payload: "\nF/tmp/artifacts/nashorn-XdUndQGroXOP9NCsfITpBERYcbbGXVHLjbvNWXCh-3A.jar\022@5dd5277501aba1738ff4d0ac7c84e904445871b6c65d51cb8dbbcd5970a1fb70"
        role_urn: "beam:artifact:role:staging_to:v1"
        role_payload: "\n7nashorn-XdUndQGroXOP9NCsfITpBERYcbbGXVHLjbvNWXCh-3A.jar"
      >
      dependencies: <
        type_urn: "beam:artifact:type:file:v1"
        type_payload: "\nG/tmp/artifacts/cldrdata-YqzuKX1QnLCOo0cwjKRdBhGrip_ltIJZg-APT60tUPA.jar\022@62acee297d509cb08ea347308ca45d0611ab8a9fe5b4825983e00f4fad2d50f0"
        role_urn: "beam:artifact:role:staging_to:v1"
        role_payload: "\n8cldrdata-YqzuKX1QnLCOo0cwjKRdBhGrip_ltIJZg-APT60tUPA.jar"
      >
      dependencies: <
        type_urn: "beam:artifact:type:file:v1"
        type_payload: "\nD/tmp/artifacts/dnsns-dhEp186udEF6X6chZus-RJzWRmzlccxx1_btlXWayVI.jar\022@761129d7ceae74417a5fa72166eb3e449cd6466ce571cc71d7f6ed95759ac952"
        role_urn: "beam:artifact:role:staging_to:v1"
        role_payload: "\n5dnsns-dhEp186udEF6X6chZus-RJzWRmzlccxx1_btlXWayVI.jar"
      >
      dependencies: <
        type_urn: "beam:artifact:type:file:v1"
        type_payload: "\nr/tmp/artifacts/beam-sdks-java-io-expansion-service-2.41.0-SNAPSHOT-4frTB60opMac-j-LopLURlto61xVD1dHAPsv74ka-Jw.jar\022@e1fad307ad28a4c69cfa3f8ba292d4465b68eb5c550f574700fb2fef891af89c"
        role_urn: "beam:artifact:role:staging_to:v1"
        role_payload: "\ncbeam-sdks-java-io-expansion-service-2.41.0-SNAPSHOT-4frTB60opMac-j-LopLURlto61xVD1dHAPsv74ka-Jw.jar"
      >
    >
  >
  environments: <
    key: "go"
    value: <
      urn: "beam:env:docker:v1"
      payload: "\n\026apache/beam_go_sdk:dev"
      capabilities: "beam:protocol:progress_reporting:v1"
      capabilities: "beam:protocol:multi_core_bundle_processing:v1"
      capabilities: "beam:transform:sdf_truncate_sized_restrictions:v1"
      capabilities: "beam:protocol:worker_status:v1"
      capabilities: "beam:protocol:monitoring_info_short_ids:v1"
      capabilities: "beam:version:sdk_base:go"
      capabilities: "beam:coder:bytes:v1"
      capabilities: "beam:coder:bool:v1"
      capabilities: "beam:coder:varint:v1"
      capabilities: "beam:coder:double:v1"
      capabilities: "beam:coder:string_utf8:v1"
      capabilities: "beam:coder:length_prefix:v1"
      capabilities: "beam:coder:kv:v1"
      capabilities: "beam:coder:iterable:v1"
      capabilities: "beam:coder:state_backed_iterable:v1"
      capabilities: "beam:coder:windowed_value:v1"
      capabilities: "beam:coder:global_window:v1"
      capabilities: "beam:coder:interval_window:v1"
      capabilities: "beam:coder:row:v1"
      capabilities: "beam:coder:nullable:v1"
      dependencies: <
        type_urn: "beam:artifact:type:file:v1"
        role_urn: "beam:artifact:role:go_worker_binary:v1"
      >
    >
  >
>
root_transform_ids: "s1"
2022/06/16 00:27:52 Cross-compiling <https://ci-beam.apache.org/job/beam_PostCommit_XVR_Spark/ws/src/sdks/go/test/integration/io/xlang/kafka/kafka_test.go> as /tmp/worker-1-1655339272757749569
    ptest.go:108: Failed to execute job: 	connecting to job service
        failed to dial server at localhost:38945
        	caused by:
        context deadline exceeded
--- FAIL: TestKafkaIO_BasicReadWrite (124.56s)
FAIL
FAIL	github.com/apache/beam/sdks/v2/go/test/integration/io/xlang/kafka	130.592s
FAIL

> Task :runners:spark:2:job-server:validatesCrossLanguageRunnerGoUsingJava FAILED
> Task :runners:spark:2:job-server:validatesCrossLanguageRunnerPythonUsingJava FAILED
> Task :runners:spark:2:job-server:validatesCrossLanguageRunnerPythonUsingSql
> Task :runners:spark:2:job-server:validatesCrossLanguageRunnerPythonUsingSql FAILED
> Task :runners:spark:2:job-server:validatesCrossLanguageRunnerCleanup
> Task :runners:spark:2:job-server:sparkJobServerCleanup

FAILURE: Build completed with 3 failures.

1: Task failed with an exception.
-----------
* Where:
Build file '<https://ci-beam.apache.org/job/beam_PostCommit_XVR_Spark/ws/src/sdks/go/test/build.gradle'> line: 199

* What went wrong:
Execution failed for task ':runners:spark:2:job-server:validatesCrossLanguageRunnerGoUsingJava'.
> Process 'command 'sh'' finished with non-zero exit value 1

* Try:
> Run with --stacktrace option to get the stack trace.
> Run with --info or --debug option to get more log output.
> Run with --scan to get full insights.
==============================================================================

2: Task failed with an exception.
-----------
* What went wrong:
Execution failed for task ':runners:spark:2:job-server:validatesCrossLanguageRunnerPythonUsingJava'.
> Process 'command 'sh'' finished with non-zero exit value 1

* Try:
> Run with --stacktrace option to get the stack trace.
> Run with --info or --debug option to get more log output.
> Run with --scan to get full insights.
==============================================================================

3: Task failed with an exception.
-----------
* What went wrong:
Execution failed for task ':runners:spark:2:job-server:validatesCrossLanguageRunnerPythonUsingSql'.
> Process 'command 'sh'' finished with non-zero exit value 1

* Try:
> Run with --stacktrace option to get the stack trace.
> Run with --info or --debug option to get more log output.
> Run with --scan to get full insights.
==============================================================================

* Get more help at https://help.gradle.org

Deprecated Gradle features were used in this build, making it incompatible with Gradle 8.0.

You can use '--warning-mode all' to show the individual deprecation warnings and determine if they come from your own scripts or plugins.

See https://docs.gradle.org/7.4/userguide/command_line_interface.html#sec:command_line_warnings

Execution optimizations have been disabled for 1 invalid unit(s) of work during this build to ensure correctness.
Please consult deprecation warnings for more details.

BUILD FAILED in 42m 57s
267 actionable tasks: 254 executed, 4 from cache, 9 up-to-date

Publishing build scan...
https://gradle.com/s/cwteimuywrsfg

Build step 'Invoke Gradle script' changed build result to FAILURE
Build step 'Invoke Gradle script' marked build as failure

---------------------------------------------------------------------
To unsubscribe, e-mail: builds-unsubscribe@beam.apache.org
For additional commands, e-mail: builds-help@beam.apache.org