You are viewing a plain text version of this content. The canonical link for it is here.
Posted to builds@cassandra.apache.org by Apache Jenkins Server <je...@builds.apache.org> on 2025/12/11 10:47:11 UTC
Build complete: Cassandra-trunk #2351 [ABORTED] f7fab8a60acdb7df5fd9403ab4ee41fc14b13689
-------------------------------------------------------------------------------
Build Cassandra-trunk #2351 Aborted
URL: https://ci-cassandra.apache.org/job/Cassandra-trunk/2351/
-------------------------------------------------------------------------------
Changes:
[Stefan Miklosovic] Fix disk usage guardrail disablement when failure threshold is reached
-------------------------------------------------------------------------------
Failed Tests:
25 tests failed.
FAILED: dtest-latest.bootstrap_test.TestBootstrap.Tests / dtest-latest jdk11 2/64 / test_read_from_bootstrapped_node
FAILED: dtest-upgrade.upgrade_tests.bootstrap_upgrade_test.TestBootstrapUpgrade.Tests / dtest-upgrade jdk11 19/160 / test_killed_wiped_node_cannot_join
FAILED: dtest-upgrade.upgrade_tests.cql_tests.TestCQLNodes2RF1_Upgrade_indev_4_0_x_To_indev_trunk.Tests / dtest-upgrade jdk11 146/160 / test_order_by_with_in
FAILED: dtest.bootstrap_test.TestBootstrap.Tests / dtest jdk11 15/64 / test_decommissioned_wiped_node_can_join
FAILED: dtest.bootstrap_test.TestBootstrap.Tests / dtest jdk11 14/64 / test_killed_wiped_node_cannot_join
FAILED: org.apache.cassandra.db.commitlog.CommitLogSegmentManagerCDCTest.Tests / test-latest jdk11 19/20 / testReplayLogic-latest_jdk11_x86_64
FAILED: org.apache.cassandra.distributed.test.accord.AccordMoveTest.Tests / jvm-dtest jdk11 5/16 / moveTest-_jdk11_x86_64
FAILED: org.apache.cassandra.distributed.upgrade.ClusterMetadataUpgradeIgnoreHostsTest.Tests / jvm-dtest-upgrade jdk11 1/6 / upgradeIgnoreHostsTest-_jdk11_x86_64
FAILED: org.apache.cassandra.utils.SimpleBitSetSerializersTest.Tests / test-latest jdk17 12/20 / any-latest_jdk17_x86_64
FAILED: dtest.bootstrap_test.TestBootstrap.Tests / dtest jdk17 2/64 / test_read_from_bootstrapped_node
FAILED: org.apache.cassandra.distributed.test.cql3.MixedReadsAccordInteropMultiNodeTableWalkTest.Tests / jvm-dtest jdk11 9/16 / test-_jdk11_x86_64
FAILED: org.apache.cassandra.fuzz.topology.AccordTopologyMixupTest.Tests / jvm-dtest jdk17 1/16 / test-_jdk17_x86_64
FAILED: org.apache.cassandra.utils.SimpleBitSetSerializersTest.Tests / test-compression jdk17 12/20 / any-compression_jdk17_x86_64
FAILED: org.apache.cassandra.distributed.test.accord.AccordProgressLogTest.Tests / jvm-dtest jdk11 7/16 / testFetchTimeWindow-_jdk11_x86_64
FAILED: dtest-upgrade.upgrade_tests.bootstrap_upgrade_test.TestBootstrapUpgrade.Tests / dtest-upgrade jdk11 20/160 / test_decommissioned_wiped_node_can_join
FAILED: org.apache.cassandra.distributed.test.accord.MigrationFromAccordWriteRaceTest.Tests / jvm-dtest jdk11 5/16 / testSplitAndRetryNonSerialLoggedBatchTwoTablesTwoPkeyHintedViaBatchLogRoutingFailure-_jdk11_x86_64
FAILED: org.apache.cassandra.distributed.test.accord.MigrationFromAccordWriteRaceTest.Tests / jvm-dtest jdk17 5/16 / testSplitAndRetryNonSerialLoggedBatchTwoTablesTwoPkeyHintedViaBatchLogRoutingFailure-_jdk17_x86_64
FAILED: junit.framework.TestSuite.Tests / jvm-dtest jdk11 5/16 / org.apache.cassandra.distributed.test.accord.MigrationFromAccordWriteRaceTest-_jdk11_x86_64
FAILED: junit.framework.TestSuite.Tests / jvm-dtest jdk17 5/16 / org.apache.cassandra.distributed.test.accord.MigrationFromAccordWriteRaceTest-_jdk17_x86_64
FAILED: org.apache.cassandra.fuzz.topology.AccordBootstrapTest.Tests / jvm-dtest jdk11 15/16 / terminated successfully-cassandra.testtag_IS_UNDEFINED
FAILED: org.apache.cassandra.fuzz.topology.AccordBootstrapTest.Tests / jvm-dtest jdk17 15/16 / terminated successfully-cassandra.testtag_IS_UNDEFINED
FAILED: org.apache.cassandra.io.sstable.indexsummary.IndexSummaryTest.Tests / test-latest jdk17 3/20 / testLargeIndexSummary-cassandra.testtag_IS_UNDEFINED
FAILED: org.apache.cassandra.io.sstable.indexsummary.IndexSummaryTest.Tests / test-compression jdk17 3/20 / testLargeIndexSummary-cassandra.testtag_IS_UNDEFINED
FAILED: org.apache.cassandra.io.sstable.indexsummary.IndexSummaryTest.Tests / test-cdc jdk17 3/20 / testLargeIndexSummary-cassandra.testtag_IS_UNDEFINED
FAILED: org.apache.cassandra.io.sstable.indexsummary.IndexSummaryTest.Tests / test jdk17 3/20 / testLargeIndexSummary-cassandra.testtag_IS_UNDEFINED
-------------------------------------------------------------------------------
For complete test report and logs see https://nightlies.apache.org/cassandra/Cassandra-trunk/2351/