You are viewing a plain text version of this content. The canonical link for it is here.
Posted to builds@beam.apache.org by Apache Jenkins Server <je...@builds.apache.org> on 2020/02/20 06:23:32 UTC

Build failed in Jenkins: beam_PostCommit_XVR_Spark #121

See <https://builds.apache.org/job/beam_PostCommit_XVR_Spark/121/display/redirect>

Changes:


------------------------------------------
[...truncated 593.09 KB...]
h5py==2.10.0
hdfs==2.5.6
httplib2==0.12.0
idna==2.9
Keras-Applications==1.0.8
Keras-Preprocessing==1.1.0
Markdown==3.1.1
mock==2.0.0
monotonic==1.5
nose==1.3.7
numpy==1.16.4
oauth2client==3.0.0
oauthlib==3.1.0
opt-einsum==2.3.2
pandas==0.24.2
pbr==5.4.4
pip==20.0.2
proto-google-cloud-datastore-v1==0.90.4
protobuf==3.9.0
protorpc==0.12.0
pyarrow==0.15.1
pyasn1==0.4.8
pyasn1-modules==0.2.8
pydot==1.4.1
PyHamcrest==1.10.1
pymongo==3.8.0
pyparsing==2.4.6
python-dateutil==2.8.1
python-gflags==3.0.6
python-snappy==0.5.4
pytz==2019.1
PyVCF==0.6.8
PyYAML==5.1
requests==2.23.0
requests-oauthlib==1.3.0
rsa==4.0
scipy==1.2.2
setuptools==44.0.0
six==1.14.0
tenacity==6.0.0
tensorboard==2.1.0
tensorflow==2.1.0
tensorflow-estimator==2.1.0
termcolor==1.1.0
typing==3.7.4.1
typing-extensions==3.7.4.1
urllib3==1.25.8
virtualenv==16.7.9
Werkzeug==1.0.0
wheel==0.34.2
wrapt==1.12.0
Removing intermediate container 16fe73f103a6
 ---> 54d461cbe33d
Step 12/15 : ADD target/launcher/linux_amd64/boot /opt/apache/beam/
 ---> 279fefa382ff
Step 13/15 : COPY target/LICENSE /opt/apache/beam/
 ---> 724c3216d424
Step 14/15 : COPY target/NOTICE /opt/apache/beam/
 ---> 59af48b04be2
Step 15/15 : ENTRYPOINT ["/opt/apache/beam/boot"]
 ---> Running in 0cb847ecfe9c
Removing intermediate container 0cb847ecfe9c
 ---> 835e19bd8404
Successfully built 835e19bd8404
Successfully tagged apachebeam/python2.7_sdk:2.20.0.dev

> Task :runners:spark:job-server:validatesCrossLanguageRunnerSetup

> Task :runners:spark:job-server:validatesCrossLanguageRunnerJavaUsingJava

org.apache.beam.runners.core.construction.ExternalTest > expandMultiOutputTest FAILED
    java.lang.RuntimeException at ExternalTest.java:91

org.apache.beam.runners.core.construction.ExternalTest > expandMultipleTest FAILED
    java.lang.RuntimeException at ExternalTest.java:91

org.apache.beam.runners.core.construction.ExternalTest > expandSingleTest FAILED
    java.lang.RuntimeException at ExternalTest.java:91

org.apache.beam.runners.core.construction.ValidateRunnerXlangTest > combineGloballyTest FAILED
    java.lang.RuntimeException at ValidateRunnerXlangTest.java:98

org.apache.beam.runners.core.construction.ValidateRunnerXlangTest > partitionTest FAILED
    java.lang.RuntimeException at ValidateRunnerXlangTest.java:98

org.apache.beam.runners.core.construction.ValidateRunnerXlangTest > coGroupByKeyTest FAILED
    java.lang.RuntimeException at ValidateRunnerXlangTest.java:98

org.apache.beam.runners.core.construction.ValidateRunnerXlangTest > groupByKeyTest FAILED
    java.lang.RuntimeException at ValidateRunnerXlangTest.java:98

org.apache.beam.runners.core.construction.ValidateRunnerXlangTest > combinePerKeyTest FAILED
    java.lang.RuntimeException at ValidateRunnerXlangTest.java:98

org.apache.beam.runners.core.construction.ValidateRunnerXlangTest > flattenTest FAILED
    java.lang.RuntimeException at ValidateRunnerXlangTest.java:98

org.apache.beam.runners.core.construction.ValidateRunnerXlangTest > singleInputOutputTest FAILED
    java.lang.RuntimeException at ValidateRunnerXlangTest.java:98

org.apache.beam.runners.core.construction.ValidateRunnerXlangTest > multiInputOutputWithSideInputTest FAILED
    java.lang.RuntimeException at ValidateRunnerXlangTest.java:98

11 tests completed, 11 failed

> Task :runners:spark:job-server:validatesCrossLanguageRunnerJavaUsingJava FAILED

> Task :runners:spark:job-server:validatesCrossLanguageRunnerJavaUsingPython

org.apache.beam.runners.core.construction.ExternalTest > expandMultiOutputTest FAILED
    java.lang.RuntimeException at ExternalTest.java:91

org.apache.beam.runners.core.construction.ExternalTest > expandMultipleTest FAILED
    java.lang.RuntimeException at ExternalTest.java:91

org.apache.beam.runners.core.construction.ExternalTest > expandSingleTest FAILED
    java.lang.RuntimeException at ExternalTest.java:91

org.apache.beam.runners.core.construction.ValidateRunnerXlangTest > combineGloballyTest FAILED
    java.lang.RuntimeException at ValidateRunnerXlangTest.java:98

org.apache.beam.runners.core.construction.ValidateRunnerXlangTest > partitionTest FAILED
    java.lang.RuntimeException at ValidateRunnerXlangTest.java:98

org.apache.beam.runners.core.construction.ValidateRunnerXlangTest > coGroupByKeyTest FAILED
    java.lang.RuntimeException at ValidateRunnerXlangTest.java:98

org.apache.beam.runners.core.construction.ValidateRunnerXlangTest > groupByKeyTest FAILED
    java.lang.RuntimeException at ValidateRunnerXlangTest.java:98

org.apache.beam.runners.core.construction.ValidateRunnerXlangTest > combinePerKeyTest FAILED
    java.lang.RuntimeException at ValidateRunnerXlangTest.java:98

org.apache.beam.runners.core.construction.ValidateRunnerXlangTest > flattenTest FAILED
    java.lang.RuntimeException at ValidateRunnerXlangTest.java:98

org.apache.beam.runners.core.construction.ValidateRunnerXlangTest > singleInputOutputTest FAILED
    java.lang.RuntimeException at ValidateRunnerXlangTest.java:98

org.apache.beam.runners.core.construction.ValidateRunnerXlangTest > multiInputOutputWithSideInputTest FAILED
    java.lang.RuntimeException at ValidateRunnerXlangTest.java:98

11 tests completed, 11 failed

> Task :runners:spark:job-server:validatesCrossLanguageRunnerJavaUsingPython FAILED

> Task :runners:spark:job-server:validatesCrossLanguageRunnerPythonUsingJava
setup.py:252: UserWarning: You are using Apache Beam with Python 2. New releases of Apache Beam will soon support Python 3 only.
  'You are using Apache Beam with Python 2. '
<https://builds.apache.org/job/beam_PostCommit_XVR_Spark/ws/src/build/gradleenv/1922375555/local/lib/python2.7/site-packages/setuptools/dist.py>:476: UserWarning: Normalizing '2.20.0.dev' to '2.20.0.dev0'
  normalized_version,
warning: no files found matching 'README.md'
warning: no files found matching 'NOTICE'
warning: no files found matching 'LICENSE'
<https://builds.apache.org/job/beam_PostCommit_XVR_Spark/ws/src/sdks/python/apache_beam/__init__.py>:82: UserWarning: You are using Apache Beam with Python 2. New releases of Apache Beam will soon support Python 3 only.
  'You are using Apache Beam with Python 2. '
<https://builds.apache.org/job/beam_PostCommit_XVR_Spark/ws/src/sdks/python/apache_beam/transforms/trigger_test.py>:541: YAMLLoadWarning: calling yaml.load_all() without Loader=... is deprecated, as the default Loader is unsafe. Please read https://msg.pyyaml.org/load for full details.
  for spec in yaml.load_all(open(transcript_filename)):
test_generate_sequence (apache_beam.io.external.generate_sequence_test.XlangGenerateSequenceTest) ... ok
test_write (apache_beam.io.external.xlang_parquetio_test.XlangParquetIOTest) ... ok
test_cogroup_by_key (apache_beam.transforms.validate_runner_xlang_test.ValidateRunnerXlangTest) ... ok
test_combine_globally (apache_beam.transforms.validate_runner_xlang_test.ValidateRunnerXlangTest) ... ok
test_combine_per_key (apache_beam.transforms.validate_runner_xlang_test.ValidateRunnerXlangTest) ... ok
test_flatten (apache_beam.transforms.validate_runner_xlang_test.ValidateRunnerXlangTest) ... ok
test_group_by_key (apache_beam.transforms.validate_runner_xlang_test.ValidateRunnerXlangTest) ... ok
test_multi_input_output_with_sideinput (apache_beam.transforms.validate_runner_xlang_test.ValidateRunnerXlangTest) ... ok
test_partition (apache_beam.transforms.validate_runner_xlang_test.ValidateRunnerXlangTest) ... ok
test_prefix (apache_beam.transforms.validate_runner_xlang_test.ValidateRunnerXlangTest) ... ok

----------------------------------------------------------------------
XML: nosetests-xlangValidateRunner.xml
----------------------------------------------------------------------
XML: <https://builds.apache.org/job/beam_PostCommit_XVR_Spark/ws/src/sdks/python/nosetests.xml>
----------------------------------------------------------------------
Ran 10 tests in 141.565s

OK

> Task :runners:spark:job-server:validatesCrossLanguageRunnerPythonUsingPython
setup.py:252: UserWarning: You are using Apache Beam with Python 2. New releases of Apache Beam will soon support Python 3 only.
  'You are using Apache Beam with Python 2. '
<https://builds.apache.org/job/beam_PostCommit_XVR_Spark/ws/src/build/gradleenv/1922375555/local/lib/python2.7/site-packages/setuptools/dist.py>:476: UserWarning: Normalizing '2.20.0.dev' to '2.20.0.dev0'
  normalized_version,
warning: no files found matching 'README.md'
warning: no files found matching 'NOTICE'
warning: no files found matching 'LICENSE'
<https://builds.apache.org/job/beam_PostCommit_XVR_Spark/ws/src/sdks/python/apache_beam/__init__.py>:82: UserWarning: You are using Apache Beam with Python 2. New releases of Apache Beam will soon support Python 3 only.
  'You are using Apache Beam with Python 2. '
<https://builds.apache.org/job/beam_PostCommit_XVR_Spark/ws/src/sdks/python/apache_beam/transforms/trigger_test.py>:541: YAMLLoadWarning: calling yaml.load_all() without Loader=... is deprecated, as the default Loader is unsafe. Please read https://msg.pyyaml.org/load for full details.
  for spec in yaml.load_all(open(transcript_filename)):
test_generate_sequence (apache_beam.io.external.generate_sequence_test.XlangGenerateSequenceTest) ... ok
test_write (apache_beam.io.external.xlang_parquetio_test.XlangParquetIOTest) ... ok
test_cogroup_by_key (apache_beam.transforms.validate_runner_xlang_test.ValidateRunnerXlangTest) ... ok
test_combine_globally (apache_beam.transforms.validate_runner_xlang_test.ValidateRunnerXlangTest) ... ok
test_combine_per_key (apache_beam.transforms.validate_runner_xlang_test.ValidateRunnerXlangTest) ... ok
test_flatten (apache_beam.transforms.validate_runner_xlang_test.ValidateRunnerXlangTest) ... ok
test_group_by_key (apache_beam.transforms.validate_runner_xlang_test.ValidateRunnerXlangTest) ... ok
test_multi_input_output_with_sideinput (apache_beam.transforms.validate_runner_xlang_test.ValidateRunnerXlangTest) ... ok
test_partition (apache_beam.transforms.validate_runner_xlang_test.ValidateRunnerXlangTest) ... ok
test_prefix (apache_beam.transforms.validate_runner_xlang_test.ValidateRunnerXlangTest) ... ok

----------------------------------------------------------------------
XML: nosetests-xlangValidateRunner.xml
----------------------------------------------------------------------
XML: <https://builds.apache.org/job/beam_PostCommit_XVR_Spark/ws/src/sdks/python/nosetests.xml>
----------------------------------------------------------------------
Ran 10 tests in 79.139s

OK

> Task :runners:spark:job-server:validatesCrossLanguageRunnerCleanup
> Task :runners:spark:job-server:sparkJobServerCleanup

FAILURE: Build completed with 2 failures.

1: Task failed with an exception.
-----------
* What went wrong:
Execution failed for task ':runners:spark:job-server:validatesCrossLanguageRunnerJavaUsingJava'.
> There were failing tests. See the report at: file://<https://builds.apache.org/job/beam_PostCommit_XVR_Spark/ws/src/runners/spark/job-server/build/reports/tests/validatesCrossLanguageRunnerJavaUsingJava/index.html>

* Try:
Run with --stacktrace option to get the stack trace. Run with --info or --debug option to get more log output. Run with --scan to get full insights.
==============================================================================

2: Task failed with an exception.
-----------
* What went wrong:
Execution failed for task ':runners:spark:job-server:validatesCrossLanguageRunnerJavaUsingPython'.
> There were failing tests. See the report at: file://<https://builds.apache.org/job/beam_PostCommit_XVR_Spark/ws/src/runners/spark/job-server/build/reports/tests/validatesCrossLanguageRunnerJavaUsingPython/index.html>

* Try:
Run with --stacktrace option to get the stack trace. Run with --info or --debug option to get more log output. Run with --scan to get full insights.
==============================================================================

* Get more help at https://help.gradle.org

Deprecated Gradle features were used in this build, making it incompatible with Gradle 6.0.
Use '--warning-mode all' to show the individual deprecation warnings.
See https://docs.gradle.org/5.2.1/userguide/command_line_interface.html#sec:command_line_warnings

BUILD FAILED in 17m 6s
102 actionable tasks: 78 executed, 22 from cache, 2 up-to-date

Publishing build scan...
https://gradle.com/s/tvkcra63tgqk6

Build step 'Invoke Gradle script' changed build result to FAILURE
Build step 'Invoke Gradle script' marked build as failure

---------------------------------------------------------------------
To unsubscribe, e-mail: builds-unsubscribe@beam.apache.org
For additional commands, e-mail: builds-help@beam.apache.org


Jenkins build is back to normal : beam_PostCommit_XVR_Spark #128

Posted by Apache Jenkins Server <je...@builds.apache.org>.
See <https://builds.apache.org/job/beam_PostCommit_XVR_Spark/128/display/redirect?page=changes>


---------------------------------------------------------------------
To unsubscribe, e-mail: builds-unsubscribe@beam.apache.org
For additional commands, e-mail: builds-help@beam.apache.org


Build failed in Jenkins: beam_PostCommit_XVR_Spark #127

Posted by Apache Jenkins Server <je...@builds.apache.org>.
See <https://builds.apache.org/job/beam_PostCommit_XVR_Spark/127/display/redirect?page=changes>

Changes:

[github] [BEAM-8280] no_annotations decorator (#10904)


------------------------------------------
[...truncated 593.73 KB...]
PyYAML==5.1
requests==2.23.0
requests-oauthlib==1.3.0
rsa==4.0
scipy==1.2.2
setuptools==44.0.0
six==1.14.0
tenacity==6.0.0
tensorboard==2.1.0
tensorflow==2.1.0
tensorflow-estimator==2.1.0
termcolor==1.1.0
typing==3.7.4.1
typing-extensions==3.7.4.1
urllib3==1.25.8
virtualenv==16.7.9
Werkzeug==1.0.0
wheel==0.34.2
wrapt==1.12.0
Removing intermediate container 85d07fe7cf16
 ---> d16cc58365eb
Step 12/15 : ADD target/launcher/linux_amd64/boot /opt/apache/beam/
 ---> 8bf62e1309d6
Step 13/15 : COPY target/LICENSE /opt/apache/beam/
 ---> 1845eb88e8c1
Step 14/15 : COPY target/NOTICE /opt/apache/beam/
 ---> 0f4e3c9c81dd
Step 15/15 : ENTRYPOINT ["/opt/apache/beam/boot"]
 ---> Running in 5fe0d1ea1000
Removing intermediate container 5fe0d1ea1000
 ---> 8e1bb7c7462b
Successfully built 8e1bb7c7462b
Successfully tagged apachebeam/python2.7_sdk:2.20.0.dev

> Task :runners:spark:job-server:validatesCrossLanguageRunnerSetup
Launching Java expansion service @ 18089
Launching Python expansion service @ 18088

> Task :runners:spark:job-server:validatesCrossLanguageRunnerJavaUsingJava

org.apache.beam.runners.core.construction.ExternalTest > expandMultiOutputTest FAILED
    java.lang.RuntimeException at ExternalTest.java:91

org.apache.beam.runners.core.construction.ExternalTest > expandMultipleTest FAILED
    java.lang.RuntimeException at ExternalTest.java:91

org.apache.beam.runners.core.construction.ExternalTest > expandSingleTest FAILED
    java.lang.RuntimeException at ExternalTest.java:91

org.apache.beam.runners.core.construction.ValidateRunnerXlangTest > combineGloballyTest FAILED
    java.lang.RuntimeException at ValidateRunnerXlangTest.java:98

org.apache.beam.runners.core.construction.ValidateRunnerXlangTest > partitionTest FAILED
    java.lang.RuntimeException at ValidateRunnerXlangTest.java:98

org.apache.beam.runners.core.construction.ValidateRunnerXlangTest > coGroupByKeyTest FAILED
    java.lang.RuntimeException at ValidateRunnerXlangTest.java:98

org.apache.beam.runners.core.construction.ValidateRunnerXlangTest > groupByKeyTest FAILED
    java.lang.RuntimeException at ValidateRunnerXlangTest.java:98

org.apache.beam.runners.core.construction.ValidateRunnerXlangTest > combinePerKeyTest FAILED
    java.lang.RuntimeException at ValidateRunnerXlangTest.java:98

org.apache.beam.runners.core.construction.ValidateRunnerXlangTest > flattenTest FAILED
    java.lang.RuntimeException at ValidateRunnerXlangTest.java:98

org.apache.beam.runners.core.construction.ValidateRunnerXlangTest > singleInputOutputTest FAILED
    java.lang.RuntimeException at ValidateRunnerXlangTest.java:98

org.apache.beam.runners.core.construction.ValidateRunnerXlangTest > multiInputOutputWithSideInputTest FAILED
    java.lang.RuntimeException at ValidateRunnerXlangTest.java:98

11 tests completed, 11 failed

> Task :runners:spark:job-server:validatesCrossLanguageRunnerJavaUsingJava FAILED

> Task :runners:spark:job-server:validatesCrossLanguageRunnerJavaUsingPython

org.apache.beam.runners.core.construction.ExternalTest > expandMultiOutputTest FAILED
    java.lang.RuntimeException at ExternalTest.java:91

org.apache.beam.runners.core.construction.ExternalTest > expandMultipleTest FAILED
    java.lang.RuntimeException at ExternalTest.java:91

org.apache.beam.runners.core.construction.ExternalTest > expandSingleTest FAILED
    java.lang.RuntimeException at ExternalTest.java:91

org.apache.beam.runners.core.construction.ValidateRunnerXlangTest > combineGloballyTest FAILED
    java.lang.RuntimeException at ValidateRunnerXlangTest.java:98

org.apache.beam.runners.core.construction.ValidateRunnerXlangTest > partitionTest FAILED
    java.lang.RuntimeException at ValidateRunnerXlangTest.java:98

org.apache.beam.runners.core.construction.ValidateRunnerXlangTest > coGroupByKeyTest FAILED
    java.lang.RuntimeException at ValidateRunnerXlangTest.java:98

org.apache.beam.runners.core.construction.ValidateRunnerXlangTest > groupByKeyTest FAILED
    java.lang.RuntimeException at ValidateRunnerXlangTest.java:98

org.apache.beam.runners.core.construction.ValidateRunnerXlangTest > combinePerKeyTest FAILED
    java.lang.RuntimeException at ValidateRunnerXlangTest.java:98

org.apache.beam.runners.core.construction.ValidateRunnerXlangTest > flattenTest FAILED
    java.lang.RuntimeException at ValidateRunnerXlangTest.java:98

org.apache.beam.runners.core.construction.ValidateRunnerXlangTest > singleInputOutputTest FAILED
    java.lang.RuntimeException at ValidateRunnerXlangTest.java:98

org.apache.beam.runners.core.construction.ValidateRunnerXlangTest > multiInputOutputWithSideInputTest FAILED
    java.lang.RuntimeException at ValidateRunnerXlangTest.java:98

11 tests completed, 11 failed

> Task :runners:spark:job-server:validatesCrossLanguageRunnerJavaUsingPython FAILED

> Task :runners:spark:job-server:validatesCrossLanguageRunnerPythonUsingJava
>>> RUNNING integration tests with pipeline options: --runner=PortableRunner --environment_cache_millis=10000 --job_endpoint=localhost:18091
>>>   test options: --attr=UsesCrossLanguageTransforms
setup.py:252: UserWarning: You are using Apache Beam with Python 2. New releases of Apache Beam will soon support Python 3 only.
  'You are using Apache Beam with Python 2. '
<https://builds.apache.org/job/beam_PostCommit_XVR_Spark/ws/src/build/gradleenv/1922375555/local/lib/python2.7/site-packages/setuptools/dist.py>:476: UserWarning: Normalizing '2.20.0.dev' to '2.20.0.dev0'
  normalized_version,
running nosetests
running egg_info
Skipping proto regeneration: all files up to date
writing requirements to apache_beam.egg-info/requires.txt
writing apache_beam.egg-info/PKG-INFO
writing top-level names to apache_beam.egg-info/top_level.txt
writing dependency_links to apache_beam.egg-info/dependency_links.txt
writing entry points to apache_beam.egg-info/entry_points.txt
reading manifest file 'apache_beam.egg-info/SOURCES.txt'
reading manifest template 'MANIFEST.in'
warning: no files found matching 'README.md'
warning: no files found matching 'NOTICE'
warning: no files found matching 'LICENSE'
writing manifest file 'apache_beam.egg-info/SOURCES.txt'
<https://builds.apache.org/job/beam_PostCommit_XVR_Spark/ws/src/sdks/python/apache_beam/__init__.py>:82: UserWarning: You are using Apache Beam with Python 2. New releases of Apache Beam will soon support Python 3 only.
  'You are using Apache Beam with Python 2. '
<https://builds.apache.org/job/beam_PostCommit_XVR_Spark/ws/src/sdks/python/apache_beam/transforms/trigger_test.py>:541: YAMLLoadWarning: calling yaml.load_all() without Loader=... is deprecated, as the default Loader is unsafe. Please read https://msg.pyyaml.org/load for full details.
  for spec in yaml.load_all(open(transcript_filename)):
test_generate_sequence (apache_beam.io.external.generate_sequence_test.XlangGenerateSequenceTest) ... ok
test_write (apache_beam.io.external.xlang_parquetio_test.XlangParquetIOTest) ... ok
test_cogroup_by_key (apache_beam.transforms.validate_runner_xlang_test.ValidateRunnerXlangTest) ... ok
test_combine_globally (apache_beam.transforms.validate_runner_xlang_test.ValidateRunnerXlangTest) ... ok
test_combine_per_key (apache_beam.transforms.validate_runner_xlang_test.ValidateRunnerXlangTest) ... ok
test_flatten (apache_beam.transforms.validate_runner_xlang_test.ValidateRunnerXlangTest) ... ok
test_group_by_key (apache_beam.transforms.validate_runner_xlang_test.ValidateRunnerXlangTest) ... ok
test_multi_input_output_with_sideinput (apache_beam.transforms.validate_runner_xlang_test.ValidateRunnerXlangTest) ... ok
test_partition (apache_beam.transforms.validate_runner_xlang_test.ValidateRunnerXlangTest) ... ok
test_prefix (apache_beam.transforms.validate_runner_xlang_test.ValidateRunnerXlangTest) ... ok

----------------------------------------------------------------------
XML: nosetests-xlangValidateRunner.xml
----------------------------------------------------------------------
XML: <https://builds.apache.org/job/beam_PostCommit_XVR_Spark/ws/src/sdks/python/nosetests.xml>
----------------------------------------------------------------------
Ran 10 tests in 160.471s

OK

> Task :runners:spark:job-server:validatesCrossLanguageRunnerPythonUsingPython
>>> RUNNING integration tests with pipeline options: --runner=PortableRunner --environment_cache_millis=10000 --job_endpoint=localhost:18091
>>>   test options: --attr=UsesCrossLanguageTransforms
setup.py:252: UserWarning: You are using Apache Beam with Python 2. New releases of Apache Beam will soon support Python 3 only.
  'You are using Apache Beam with Python 2. '
<https://builds.apache.org/job/beam_PostCommit_XVR_Spark/ws/src/build/gradleenv/1922375555/local/lib/python2.7/site-packages/setuptools/dist.py>:476: UserWarning: Normalizing '2.20.0.dev' to '2.20.0.dev0'
  normalized_version,
running nosetests
running egg_info
Skipping proto regeneration: all files up to date
writing requirements to apache_beam.egg-info/requires.txt
writing apache_beam.egg-info/PKG-INFO
writing top-level names to apache_beam.egg-info/top_level.txt
writing dependency_links to apache_beam.egg-info/dependency_links.txt
writing entry points to apache_beam.egg-info/entry_points.txt
reading manifest file 'apache_beam.egg-info/SOURCES.txt'
reading manifest template 'MANIFEST.in'
warning: no files found matching 'README.md'
warning: no files found matching 'NOTICE'
warning: no files found matching 'LICENSE'
writing manifest file 'apache_beam.egg-info/SOURCES.txt'
<https://builds.apache.org/job/beam_PostCommit_XVR_Spark/ws/src/sdks/python/apache_beam/__init__.py>:82: UserWarning: You are using Apache Beam with Python 2. New releases of Apache Beam will soon support Python 3 only.
  'You are using Apache Beam with Python 2. '
<https://builds.apache.org/job/beam_PostCommit_XVR_Spark/ws/src/sdks/python/apache_beam/transforms/trigger_test.py>:541: YAMLLoadWarning: calling yaml.load_all() without Loader=... is deprecated, as the default Loader is unsafe. Please read https://msg.pyyaml.org/load for full details.
  for spec in yaml.load_all(open(transcript_filename)):
test_generate_sequence (apache_beam.io.external.generate_sequence_test.XlangGenerateSequenceTest) ... ok
test_write (apache_beam.io.external.xlang_parquetio_test.XlangParquetIOTest) ... ok
test_cogroup_by_key (apache_beam.transforms.validate_runner_xlang_test.ValidateRunnerXlangTest) ... ok
test_combine_globally (apache_beam.transforms.validate_runner_xlang_test.ValidateRunnerXlangTest) ... ok
test_combine_per_key (apache_beam.transforms.validate_runner_xlang_test.ValidateRunnerXlangTest) ... ok
test_flatten (apache_beam.transforms.validate_runner_xlang_test.ValidateRunnerXlangTest) ... ok
test_group_by_key (apache_beam.transforms.validate_runner_xlang_test.ValidateRunnerXlangTest) ... ok
test_multi_input_output_with_sideinput (apache_beam.transforms.validate_runner_xlang_test.ValidateRunnerXlangTest) ... ok
test_partition (apache_beam.transforms.validate_runner_xlang_test.ValidateRunnerXlangTest) ... ok
test_prefix (apache_beam.transforms.validate_runner_xlang_test.ValidateRunnerXlangTest) ... ok

----------------------------------------------------------------------
XML: nosetests-xlangValidateRunner.xml
----------------------------------------------------------------------
XML: <https://builds.apache.org/job/beam_PostCommit_XVR_Spark/ws/src/sdks/python/nosetests.xml>
----------------------------------------------------------------------
Ran 10 tests in 86.067s

OK

> Task :runners:spark:job-server:validatesCrossLanguageRunnerCleanup
Stopping expansion service pid: 21824.
Stopping expansion service pid: 21825.

> Task :runners:spark:job-server:sparkJobServerCleanup
Stopping job server pid: 2356.

FAILURE: Build completed with 2 failures.

1: Task failed with an exception.
-----------
* What went wrong:
Execution failed for task ':runners:spark:job-server:validatesCrossLanguageRunnerJavaUsingJava'.
> There were failing tests. See the report at: file://<https://builds.apache.org/job/beam_PostCommit_XVR_Spark/ws/src/runners/spark/job-server/build/reports/tests/validatesCrossLanguageRunnerJavaUsingJava/index.html>

* Try:
Run with --stacktrace option to get the stack trace. Run with --info or --debug option to get more log output. Run with --scan to get full insights.
==============================================================================

2: Task failed with an exception.
-----------
* What went wrong:
Execution failed for task ':runners:spark:job-server:validatesCrossLanguageRunnerJavaUsingPython'.
> There were failing tests. See the report at: file://<https://builds.apache.org/job/beam_PostCommit_XVR_Spark/ws/src/runners/spark/job-server/build/reports/tests/validatesCrossLanguageRunnerJavaUsingPython/index.html>

* Try:
Run with --stacktrace option to get the stack trace. Run with --info or --debug option to get more log output. Run with --scan to get full insights.
==============================================================================

* Get more help at https://help.gradle.org

Deprecated Gradle features were used in this build, making it incompatible with Gradle 6.0.
Use '--warning-mode all' to show the individual deprecation warnings.
See https://docs.gradle.org/5.2.1/userguide/command_line_interface.html#sec:command_line_warnings

BUILD FAILED in 18m 5s
102 actionable tasks: 78 executed, 22 from cache, 2 up-to-date

Publishing build scan...
https://gradle.com/s/mbwh7dqas7y7a

Build step 'Invoke Gradle script' changed build result to FAILURE
Build step 'Invoke Gradle script' marked build as failure

---------------------------------------------------------------------
To unsubscribe, e-mail: builds-unsubscribe@beam.apache.org
For additional commands, e-mail: builds-help@beam.apache.org


Build failed in Jenkins: beam_PostCommit_XVR_Spark #126

Posted by Apache Jenkins Server <je...@builds.apache.org>.
See <https://builds.apache.org/job/beam_PostCommit_XVR_Spark/126/display/redirect?page=changes>

Changes:

[jonathan.warburton09] [BEAM-8916] Rename external_test_it so that it is picked up by pytest


------------------------------------------
[...truncated 593.04 KB...]
h5py==2.10.0
hdfs==2.5.6
httplib2==0.12.0
idna==2.9
Keras-Applications==1.0.8
Keras-Preprocessing==1.1.0
Markdown==3.1.1
mock==2.0.0
monotonic==1.5
nose==1.3.7
numpy==1.16.4
oauth2client==3.0.0
oauthlib==3.1.0
opt-einsum==2.3.2
pandas==0.24.2
pbr==5.4.4
pip==20.0.2
proto-google-cloud-datastore-v1==0.90.4
protobuf==3.9.0
protorpc==0.12.0
pyarrow==0.15.1
pyasn1==0.4.8
pyasn1-modules==0.2.8
pydot==1.4.1
PyHamcrest==1.10.1
pymongo==3.8.0
pyparsing==2.4.6
python-dateutil==2.8.1
python-gflags==3.0.6
python-snappy==0.5.4
pytz==2019.1
PyVCF==0.6.8
PyYAML==5.1
requests==2.23.0
requests-oauthlib==1.3.0
rsa==4.0
scipy==1.2.2
setuptools==44.0.0
six==1.14.0
tenacity==6.0.0
tensorboard==2.1.0
tensorflow==2.1.0
tensorflow-estimator==2.1.0
termcolor==1.1.0
typing==3.7.4.1
typing-extensions==3.7.4.1
urllib3==1.25.8
virtualenv==16.7.9
Werkzeug==1.0.0
wheel==0.34.2
wrapt==1.12.0
Removing intermediate container 101e2409dd3f
 ---> f999d1209043
Step 12/15 : ADD target/launcher/linux_amd64/boot /opt/apache/beam/
 ---> 0d2ca22f9a5f
Step 13/15 : COPY target/LICENSE /opt/apache/beam/
 ---> 94fe500b476f
Step 14/15 : COPY target/NOTICE /opt/apache/beam/
 ---> 7f22725dfc43
Step 15/15 : ENTRYPOINT ["/opt/apache/beam/boot"]
 ---> Running in b2f058247220
Removing intermediate container b2f058247220
 ---> 7ddc5c08e3d1
Successfully built 7ddc5c08e3d1
Successfully tagged apachebeam/python2.7_sdk:2.20.0.dev

> Task :runners:spark:job-server:validatesCrossLanguageRunnerSetup

> Task :runners:spark:job-server:validatesCrossLanguageRunnerJavaUsingJava

org.apache.beam.runners.core.construction.ExternalTest > expandMultiOutputTest FAILED
    java.lang.RuntimeException at ExternalTest.java:91

org.apache.beam.runners.core.construction.ExternalTest > expandMultipleTest FAILED
    java.lang.RuntimeException at ExternalTest.java:91

org.apache.beam.runners.core.construction.ExternalTest > expandSingleTest FAILED
    java.lang.RuntimeException at ExternalTest.java:91

org.apache.beam.runners.core.construction.ValidateRunnerXlangTest > combineGloballyTest FAILED
    java.lang.RuntimeException at ValidateRunnerXlangTest.java:98

org.apache.beam.runners.core.construction.ValidateRunnerXlangTest > partitionTest FAILED
    java.lang.RuntimeException at ValidateRunnerXlangTest.java:98

org.apache.beam.runners.core.construction.ValidateRunnerXlangTest > coGroupByKeyTest FAILED
    java.lang.RuntimeException at ValidateRunnerXlangTest.java:98

org.apache.beam.runners.core.construction.ValidateRunnerXlangTest > groupByKeyTest FAILED
    java.lang.RuntimeException at ValidateRunnerXlangTest.java:98

org.apache.beam.runners.core.construction.ValidateRunnerXlangTest > combinePerKeyTest FAILED
    java.lang.RuntimeException at ValidateRunnerXlangTest.java:98

org.apache.beam.runners.core.construction.ValidateRunnerXlangTest > flattenTest FAILED
    java.lang.RuntimeException at ValidateRunnerXlangTest.java:98

org.apache.beam.runners.core.construction.ValidateRunnerXlangTest > singleInputOutputTest FAILED
    java.lang.RuntimeException at ValidateRunnerXlangTest.java:98

org.apache.beam.runners.core.construction.ValidateRunnerXlangTest > multiInputOutputWithSideInputTest FAILED
    java.lang.RuntimeException at ValidateRunnerXlangTest.java:98

11 tests completed, 11 failed

> Task :runners:spark:job-server:validatesCrossLanguageRunnerJavaUsingJava FAILED

> Task :runners:spark:job-server:validatesCrossLanguageRunnerJavaUsingPython

org.apache.beam.runners.core.construction.ExternalTest > expandMultiOutputTest FAILED
    java.lang.RuntimeException at ExternalTest.java:91

org.apache.beam.runners.core.construction.ExternalTest > expandMultipleTest FAILED
    java.lang.RuntimeException at ExternalTest.java:91

org.apache.beam.runners.core.construction.ExternalTest > expandSingleTest FAILED
    java.lang.RuntimeException at ExternalTest.java:91

org.apache.beam.runners.core.construction.ValidateRunnerXlangTest > combineGloballyTest FAILED
    java.lang.RuntimeException at ValidateRunnerXlangTest.java:98

org.apache.beam.runners.core.construction.ValidateRunnerXlangTest > partitionTest FAILED
    java.lang.RuntimeException at ValidateRunnerXlangTest.java:98

org.apache.beam.runners.core.construction.ValidateRunnerXlangTest > coGroupByKeyTest FAILED
    java.lang.RuntimeException at ValidateRunnerXlangTest.java:98

org.apache.beam.runners.core.construction.ValidateRunnerXlangTest > groupByKeyTest FAILED
    java.lang.RuntimeException at ValidateRunnerXlangTest.java:98

org.apache.beam.runners.core.construction.ValidateRunnerXlangTest > combinePerKeyTest FAILED
    java.lang.RuntimeException at ValidateRunnerXlangTest.java:98

org.apache.beam.runners.core.construction.ValidateRunnerXlangTest > flattenTest FAILED
    java.lang.RuntimeException at ValidateRunnerXlangTest.java:98

org.apache.beam.runners.core.construction.ValidateRunnerXlangTest > singleInputOutputTest FAILED
    java.lang.RuntimeException at ValidateRunnerXlangTest.java:98

org.apache.beam.runners.core.construction.ValidateRunnerXlangTest > multiInputOutputWithSideInputTest FAILED
    java.lang.RuntimeException at ValidateRunnerXlangTest.java:98

11 tests completed, 11 failed

> Task :runners:spark:job-server:validatesCrossLanguageRunnerJavaUsingPython FAILED

> Task :runners:spark:job-server:validatesCrossLanguageRunnerPythonUsingJava
setup.py:252: UserWarning: You are using Apache Beam with Python 2. New releases of Apache Beam will soon support Python 3 only.
  'You are using Apache Beam with Python 2. '
<https://builds.apache.org/job/beam_PostCommit_XVR_Spark/ws/src/build/gradleenv/1922375555/local/lib/python2.7/site-packages/setuptools/dist.py>:476: UserWarning: Normalizing '2.20.0.dev' to '2.20.0.dev0'
  normalized_version,
warning: no files found matching 'README.md'
warning: no files found matching 'NOTICE'
warning: no files found matching 'LICENSE'
<https://builds.apache.org/job/beam_PostCommit_XVR_Spark/ws/src/sdks/python/apache_beam/__init__.py>:82: UserWarning: You are using Apache Beam with Python 2. New releases of Apache Beam will soon support Python 3 only.
  'You are using Apache Beam with Python 2. '
<https://builds.apache.org/job/beam_PostCommit_XVR_Spark/ws/src/sdks/python/apache_beam/transforms/trigger_test.py>:541: YAMLLoadWarning: calling yaml.load_all() without Loader=... is deprecated, as the default Loader is unsafe. Please read https://msg.pyyaml.org/load for full details.
  for spec in yaml.load_all(open(transcript_filename)):
test_generate_sequence (apache_beam.io.external.generate_sequence_test.XlangGenerateSequenceTest) ... ok
test_write (apache_beam.io.external.xlang_parquetio_test.XlangParquetIOTest) ... ok
test_cogroup_by_key (apache_beam.transforms.validate_runner_xlang_test.ValidateRunnerXlangTest) ... ok
test_combine_globally (apache_beam.transforms.validate_runner_xlang_test.ValidateRunnerXlangTest) ... ok
test_combine_per_key (apache_beam.transforms.validate_runner_xlang_test.ValidateRunnerXlangTest) ... ok
test_flatten (apache_beam.transforms.validate_runner_xlang_test.ValidateRunnerXlangTest) ... ok
test_group_by_key (apache_beam.transforms.validate_runner_xlang_test.ValidateRunnerXlangTest) ... ok
test_multi_input_output_with_sideinput (apache_beam.transforms.validate_runner_xlang_test.ValidateRunnerXlangTest) ... ok
test_partition (apache_beam.transforms.validate_runner_xlang_test.ValidateRunnerXlangTest) ... ok
test_prefix (apache_beam.transforms.validate_runner_xlang_test.ValidateRunnerXlangTest) ... ok

----------------------------------------------------------------------
XML: nosetests-xlangValidateRunner.xml
----------------------------------------------------------------------
XML: <https://builds.apache.org/job/beam_PostCommit_XVR_Spark/ws/src/sdks/python/nosetests.xml>
----------------------------------------------------------------------
Ran 10 tests in 162.118s

OK

> Task :runners:spark:job-server:validatesCrossLanguageRunnerPythonUsingPython
setup.py:252: UserWarning: You are using Apache Beam with Python 2. New releases of Apache Beam will soon support Python 3 only.
  'You are using Apache Beam with Python 2. '
<https://builds.apache.org/job/beam_PostCommit_XVR_Spark/ws/src/build/gradleenv/1922375555/local/lib/python2.7/site-packages/setuptools/dist.py>:476: UserWarning: Normalizing '2.20.0.dev' to '2.20.0.dev0'
  normalized_version,
warning: no files found matching 'README.md'
warning: no files found matching 'NOTICE'
warning: no files found matching 'LICENSE'
<https://builds.apache.org/job/beam_PostCommit_XVR_Spark/ws/src/sdks/python/apache_beam/__init__.py>:82: UserWarning: You are using Apache Beam with Python 2. New releases of Apache Beam will soon support Python 3 only.
  'You are using Apache Beam with Python 2. '
<https://builds.apache.org/job/beam_PostCommit_XVR_Spark/ws/src/sdks/python/apache_beam/transforms/trigger_test.py>:541: YAMLLoadWarning: calling yaml.load_all() without Loader=... is deprecated, as the default Loader is unsafe. Please read https://msg.pyyaml.org/load for full details.
  for spec in yaml.load_all(open(transcript_filename)):
test_generate_sequence (apache_beam.io.external.generate_sequence_test.XlangGenerateSequenceTest) ... ok
test_write (apache_beam.io.external.xlang_parquetio_test.XlangParquetIOTest) ... ok
test_cogroup_by_key (apache_beam.transforms.validate_runner_xlang_test.ValidateRunnerXlangTest) ... ok
test_combine_globally (apache_beam.transforms.validate_runner_xlang_test.ValidateRunnerXlangTest) ... ok
test_combine_per_key (apache_beam.transforms.validate_runner_xlang_test.ValidateRunnerXlangTest) ... ok
test_flatten (apache_beam.transforms.validate_runner_xlang_test.ValidateRunnerXlangTest) ... ok
test_group_by_key (apache_beam.transforms.validate_runner_xlang_test.ValidateRunnerXlangTest) ... ok
test_multi_input_output_with_sideinput (apache_beam.transforms.validate_runner_xlang_test.ValidateRunnerXlangTest) ... ok
test_partition (apache_beam.transforms.validate_runner_xlang_test.ValidateRunnerXlangTest) ... ok
test_prefix (apache_beam.transforms.validate_runner_xlang_test.ValidateRunnerXlangTest) ... ok

----------------------------------------------------------------------
XML: nosetests-xlangValidateRunner.xml
----------------------------------------------------------------------
XML: <https://builds.apache.org/job/beam_PostCommit_XVR_Spark/ws/src/sdks/python/nosetests.xml>
----------------------------------------------------------------------
Ran 10 tests in 85.548s

OK

> Task :runners:spark:job-server:validatesCrossLanguageRunnerCleanup
> Task :runners:spark:job-server:sparkJobServerCleanup

FAILURE: Build completed with 2 failures.

1: Task failed with an exception.
-----------
* What went wrong:
Execution failed for task ':runners:spark:job-server:validatesCrossLanguageRunnerJavaUsingJava'.
> There were failing tests. See the report at: file://<https://builds.apache.org/job/beam_PostCommit_XVR_Spark/ws/src/runners/spark/job-server/build/reports/tests/validatesCrossLanguageRunnerJavaUsingJava/index.html>

* Try:
Run with --stacktrace option to get the stack trace. Run with --info or --debug option to get more log output. Run with --scan to get full insights.
==============================================================================

2: Task failed with an exception.
-----------
* What went wrong:
Execution failed for task ':runners:spark:job-server:validatesCrossLanguageRunnerJavaUsingPython'.
> There were failing tests. See the report at: file://<https://builds.apache.org/job/beam_PostCommit_XVR_Spark/ws/src/runners/spark/job-server/build/reports/tests/validatesCrossLanguageRunnerJavaUsingPython/index.html>

* Try:
Run with --stacktrace option to get the stack trace. Run with --info or --debug option to get more log output. Run with --scan to get full insights.
==============================================================================

* Get more help at https://help.gradle.org

Deprecated Gradle features were used in this build, making it incompatible with Gradle 6.0.
Use '--warning-mode all' to show the individual deprecation warnings.
See https://docs.gradle.org/5.2.1/userguide/command_line_interface.html#sec:command_line_warnings

BUILD FAILED in 18m 15s
102 actionable tasks: 78 executed, 22 from cache, 2 up-to-date

Publishing build scan...
https://gradle.com/s/rj7m4xps22bde

Build step 'Invoke Gradle script' changed build result to FAILURE
Build step 'Invoke Gradle script' marked build as failure

---------------------------------------------------------------------
To unsubscribe, e-mail: builds-unsubscribe@beam.apache.org
For additional commands, e-mail: builds-help@beam.apache.org


Build failed in Jenkins: beam_PostCommit_XVR_Spark #125

Posted by Apache Jenkins Server <je...@builds.apache.org>.
See <https://builds.apache.org/job/beam_PostCommit_XVR_Spark/125/display/redirect?page=changes>

Changes:

[github] Update google-cloud-videointelligence dependency


------------------------------------------
[...truncated 593.71 KB...]
h5py==2.10.0
hdfs==2.5.6
httplib2==0.12.0
idna==2.9
Keras-Applications==1.0.8
Keras-Preprocessing==1.1.0
Markdown==3.1.1
mock==2.0.0
monotonic==1.5
nose==1.3.7
numpy==1.16.4
oauth2client==3.0.0
oauthlib==3.1.0
opt-einsum==2.3.2
pandas==0.24.2
pbr==5.4.4
pip==20.0.2
proto-google-cloud-datastore-v1==0.90.4
protobuf==3.9.0
protorpc==0.12.0
pyarrow==0.15.1
pyasn1==0.4.8
pyasn1-modules==0.2.8
pydot==1.4.1
PyHamcrest==1.10.1
pymongo==3.8.0
pyparsing==2.4.6
python-dateutil==2.8.1
python-gflags==3.0.6
python-snappy==0.5.4
pytz==2019.1
PyVCF==0.6.8
PyYAML==5.1
requests==2.23.0
requests-oauthlib==1.3.0
rsa==4.0
scipy==1.2.2
setuptools==44.0.0
six==1.14.0
tenacity==6.0.0
tensorboard==2.1.0
tensorflow==2.1.0
tensorflow-estimator==2.1.0
termcolor==1.1.0
typing==3.7.4.1
typing-extensions==3.7.4.1
urllib3==1.25.8
virtualenv==16.7.9
Werkzeug==1.0.0
wheel==0.34.2
wrapt==1.12.0
Removing intermediate container 859818d53daa
 ---> 5be2a47a6520
Step 12/15 : ADD target/launcher/linux_amd64/boot /opt/apache/beam/
 ---> 976b6b5bbc7a
Step 13/15 : COPY target/LICENSE /opt/apache/beam/
 ---> 1b164c2c4159
Step 14/15 : COPY target/NOTICE /opt/apache/beam/
 ---> a9ee683806bd
Step 15/15 : ENTRYPOINT ["/opt/apache/beam/boot"]
 ---> Running in 46458fd92290
Removing intermediate container 46458fd92290
 ---> 8cc33e53e37c
Successfully built 8cc33e53e37c
Successfully tagged apachebeam/python2.7_sdk:2.20.0.dev

> Task :runners:spark:job-server:validatesCrossLanguageRunnerSetup

> Task :runners:spark:job-server:validatesCrossLanguageRunnerJavaUsingJava

org.apache.beam.runners.core.construction.ExternalTest > expandMultiOutputTest FAILED
    java.lang.RuntimeException at ExternalTest.java:91

org.apache.beam.runners.core.construction.ExternalTest > expandMultipleTest FAILED
    java.lang.RuntimeException at ExternalTest.java:91

org.apache.beam.runners.core.construction.ExternalTest > expandSingleTest FAILED
    java.lang.RuntimeException at ExternalTest.java:91

org.apache.beam.runners.core.construction.ValidateRunnerXlangTest > combineGloballyTest FAILED
    java.lang.RuntimeException at ValidateRunnerXlangTest.java:98

org.apache.beam.runners.core.construction.ValidateRunnerXlangTest > partitionTest FAILED
    java.lang.RuntimeException at ValidateRunnerXlangTest.java:98

org.apache.beam.runners.core.construction.ValidateRunnerXlangTest > coGroupByKeyTest FAILED
    java.lang.RuntimeException at ValidateRunnerXlangTest.java:98

org.apache.beam.runners.core.construction.ValidateRunnerXlangTest > groupByKeyTest FAILED
    java.lang.RuntimeException at ValidateRunnerXlangTest.java:98

org.apache.beam.runners.core.construction.ValidateRunnerXlangTest > combinePerKeyTest FAILED
    java.lang.RuntimeException at ValidateRunnerXlangTest.java:98

org.apache.beam.runners.core.construction.ValidateRunnerXlangTest > flattenTest FAILED
    java.lang.RuntimeException at ValidateRunnerXlangTest.java:98

org.apache.beam.runners.core.construction.ValidateRunnerXlangTest > singleInputOutputTest FAILED
    java.lang.RuntimeException at ValidateRunnerXlangTest.java:98

org.apache.beam.runners.core.construction.ValidateRunnerXlangTest > multiInputOutputWithSideInputTest FAILED
    java.lang.RuntimeException at ValidateRunnerXlangTest.java:98

11 tests completed, 11 failed

> Task :runners:spark:job-server:validatesCrossLanguageRunnerJavaUsingJava FAILED

> Task :runners:spark:job-server:validatesCrossLanguageRunnerJavaUsingPython

org.apache.beam.runners.core.construction.ExternalTest > expandMultiOutputTest FAILED
    java.lang.RuntimeException at ExternalTest.java:91

org.apache.beam.runners.core.construction.ExternalTest > expandMultipleTest FAILED
    java.lang.RuntimeException at ExternalTest.java:91

org.apache.beam.runners.core.construction.ExternalTest > expandSingleTest FAILED
    java.lang.RuntimeException at ExternalTest.java:91

org.apache.beam.runners.core.construction.ValidateRunnerXlangTest > combineGloballyTest FAILED
    java.lang.RuntimeException at ValidateRunnerXlangTest.java:98

org.apache.beam.runners.core.construction.ValidateRunnerXlangTest > partitionTest FAILED
    java.lang.RuntimeException at ValidateRunnerXlangTest.java:98

org.apache.beam.runners.core.construction.ValidateRunnerXlangTest > coGroupByKeyTest FAILED
    java.lang.RuntimeException at ValidateRunnerXlangTest.java:98

org.apache.beam.runners.core.construction.ValidateRunnerXlangTest > groupByKeyTest FAILED
    java.lang.RuntimeException at ValidateRunnerXlangTest.java:98

org.apache.beam.runners.core.construction.ValidateRunnerXlangTest > combinePerKeyTest FAILED
    java.lang.RuntimeException at ValidateRunnerXlangTest.java:98

org.apache.beam.runners.core.construction.ValidateRunnerXlangTest > flattenTest FAILED
    java.lang.RuntimeException at ValidateRunnerXlangTest.java:98

org.apache.beam.runners.core.construction.ValidateRunnerXlangTest > singleInputOutputTest FAILED
    java.lang.RuntimeException at ValidateRunnerXlangTest.java:98

org.apache.beam.runners.core.construction.ValidateRunnerXlangTest > multiInputOutputWithSideInputTest FAILED
    java.lang.RuntimeException at ValidateRunnerXlangTest.java:98

11 tests completed, 11 failed

> Task :runners:spark:job-server:validatesCrossLanguageRunnerJavaUsingPython FAILED

> Task :runners:spark:job-server:validatesCrossLanguageRunnerPythonUsingJava
setup.py:252: UserWarning: You are using Apache Beam with Python 2. New releases of Apache Beam will soon support Python 3 only.
  'You are using Apache Beam with Python 2. '
<https://builds.apache.org/job/beam_PostCommit_XVR_Spark/ws/src/build/gradleenv/1922375555/local/lib/python2.7/site-packages/setuptools/dist.py>:476: UserWarning: Normalizing '2.20.0.dev' to '2.20.0.dev0'
  normalized_version,
warning: no files found matching 'README.md'
warning: no files found matching 'NOTICE'
warning: no files found matching 'LICENSE'
<https://builds.apache.org/job/beam_PostCommit_XVR_Spark/ws/src/sdks/python/apache_beam/__init__.py>:82: UserWarning: You are using Apache Beam with Python 2. New releases of Apache Beam will soon support Python 3 only.
  'You are using Apache Beam with Python 2. '
<https://builds.apache.org/job/beam_PostCommit_XVR_Spark/ws/src/sdks/python/apache_beam/transforms/trigger_test.py>:541: YAMLLoadWarning: calling yaml.load_all() without Loader=... is deprecated, as the default Loader is unsafe. Please read https://msg.pyyaml.org/load for full details.
  for spec in yaml.load_all(open(transcript_filename)):
test_generate_sequence (apache_beam.io.external.generate_sequence_test.XlangGenerateSequenceTest) ... ok
test_write (apache_beam.io.external.xlang_parquetio_test.XlangParquetIOTest) ... ok
test_cogroup_by_key (apache_beam.transforms.validate_runner_xlang_test.ValidateRunnerXlangTest) ... ok
test_combine_globally (apache_beam.transforms.validate_runner_xlang_test.ValidateRunnerXlangTest) ... ok
test_combine_per_key (apache_beam.transforms.validate_runner_xlang_test.ValidateRunnerXlangTest) ... ok
test_flatten (apache_beam.transforms.validate_runner_xlang_test.ValidateRunnerXlangTest) ... ok
test_group_by_key (apache_beam.transforms.validate_runner_xlang_test.ValidateRunnerXlangTest) ... ok
test_multi_input_output_with_sideinput (apache_beam.transforms.validate_runner_xlang_test.ValidateRunnerXlangTest) ... ok
test_partition (apache_beam.transforms.validate_runner_xlang_test.ValidateRunnerXlangTest) ... ok
test_prefix (apache_beam.transforms.validate_runner_xlang_test.ValidateRunnerXlangTest) ... ok

----------------------------------------------------------------------
XML: nosetests-xlangValidateRunner.xml
----------------------------------------------------------------------
XML: <https://builds.apache.org/job/beam_PostCommit_XVR_Spark/ws/src/sdks/python/nosetests.xml>
----------------------------------------------------------------------
Ran 10 tests in 149.457s

OK

> Task :runners:spark:job-server:validatesCrossLanguageRunnerPythonUsingPython
setup.py:252: UserWarning: You are using Apache Beam with Python 2. New releases of Apache Beam will soon support Python 3 only.
  'You are using Apache Beam with Python 2. '
<https://builds.apache.org/job/beam_PostCommit_XVR_Spark/ws/src/build/gradleenv/1922375555/local/lib/python2.7/site-packages/setuptools/dist.py>:476: UserWarning: Normalizing '2.20.0.dev' to '2.20.0.dev0'
  normalized_version,
warning: no files found matching 'README.md'
warning: no files found matching 'NOTICE'
warning: no files found matching 'LICENSE'
<https://builds.apache.org/job/beam_PostCommit_XVR_Spark/ws/src/sdks/python/apache_beam/__init__.py>:82: UserWarning: You are using Apache Beam with Python 2. New releases of Apache Beam will soon support Python 3 only.
  'You are using Apache Beam with Python 2. '
<https://builds.apache.org/job/beam_PostCommit_XVR_Spark/ws/src/sdks/python/apache_beam/transforms/trigger_test.py>:541: YAMLLoadWarning: calling yaml.load_all() without Loader=... is deprecated, as the default Loader is unsafe. Please read https://msg.pyyaml.org/load for full details.
  for spec in yaml.load_all(open(transcript_filename)):
test_generate_sequence (apache_beam.io.external.generate_sequence_test.XlangGenerateSequenceTest) ... ok
test_write (apache_beam.io.external.xlang_parquetio_test.XlangParquetIOTest) ... ok
test_cogroup_by_key (apache_beam.transforms.validate_runner_xlang_test.ValidateRunnerXlangTest) ... ok
test_combine_globally (apache_beam.transforms.validate_runner_xlang_test.ValidateRunnerXlangTest) ... ok
test_combine_per_key (apache_beam.transforms.validate_runner_xlang_test.ValidateRunnerXlangTest) ... ok
test_flatten (apache_beam.transforms.validate_runner_xlang_test.ValidateRunnerXlangTest) ... ok
test_group_by_key (apache_beam.transforms.validate_runner_xlang_test.ValidateRunnerXlangTest) ... ok
test_multi_input_output_with_sideinput (apache_beam.transforms.validate_runner_xlang_test.ValidateRunnerXlangTest) ... ok
test_partition (apache_beam.transforms.validate_runner_xlang_test.ValidateRunnerXlangTest) ... ok
test_prefix (apache_beam.transforms.validate_runner_xlang_test.ValidateRunnerXlangTest) ... ok

----------------------------------------------------------------------
XML: nosetests-xlangValidateRunner.xml
----------------------------------------------------------------------
XML: <https://builds.apache.org/job/beam_PostCommit_XVR_Spark/ws/src/sdks/python/nosetests.xml>
----------------------------------------------------------------------
Ran 10 tests in 82.047s

OK

> Task :runners:spark:job-server:validatesCrossLanguageRunnerCleanup
> Task :runners:spark:job-server:sparkJobServerCleanup

FAILURE: Build completed with 2 failures.

1: Task failed with an exception.
-----------
* What went wrong:
Execution failed for task ':runners:spark:job-server:validatesCrossLanguageRunnerJavaUsingJava'.
> There were failing tests. See the report at: file://<https://builds.apache.org/job/beam_PostCommit_XVR_Spark/ws/src/runners/spark/job-server/build/reports/tests/validatesCrossLanguageRunnerJavaUsingJava/index.html>

* Try:
Run with --stacktrace option to get the stack trace. Run with --info or --debug option to get more log output. Run with --scan to get full insights.
==============================================================================

2: Task failed with an exception.
-----------
* What went wrong:
Execution failed for task ':runners:spark:job-server:validatesCrossLanguageRunnerJavaUsingPython'.
> There were failing tests. See the report at: file://<https://builds.apache.org/job/beam_PostCommit_XVR_Spark/ws/src/runners/spark/job-server/build/reports/tests/validatesCrossLanguageRunnerJavaUsingPython/index.html>

* Try:
Run with --stacktrace option to get the stack trace. Run with --info or --debug option to get more log output. Run with --scan to get full insights.
==============================================================================

* Get more help at https://help.gradle.org

Deprecated Gradle features were used in this build, making it incompatible with Gradle 6.0.
Use '--warning-mode all' to show the individual deprecation warnings.
See https://docs.gradle.org/5.2.1/userguide/command_line_interface.html#sec:command_line_warnings

BUILD FAILED in 18m 17s
102 actionable tasks: 78 executed, 22 from cache, 2 up-to-date

Publishing build scan...
https://gradle.com/s/lykr3qcwunhre

Build step 'Invoke Gradle script' changed build result to FAILURE
Build step 'Invoke Gradle script' marked build as failure

---------------------------------------------------------------------
To unsubscribe, e-mail: builds-unsubscribe@beam.apache.org
For additional commands, e-mail: builds-help@beam.apache.org


Build failed in Jenkins: beam_PostCommit_XVR_Spark #124

Posted by Apache Jenkins Server <je...@builds.apache.org>.
See <https://builds.apache.org/job/beam_PostCommit_XVR_Spark/124/display/redirect?page=changes>

Changes:

[github] [BEAM-9085] Fix performance regression in SyntheticSource (#10885)


------------------------------------------
[...truncated 593.91 KB...]
h5py==2.10.0
hdfs==2.5.6
httplib2==0.12.0
idna==2.9
Keras-Applications==1.0.8
Keras-Preprocessing==1.1.0
Markdown==3.1.1
mock==2.0.0
monotonic==1.5
nose==1.3.7
numpy==1.16.4
oauth2client==3.0.0
oauthlib==3.1.0
opt-einsum==2.3.2
pandas==0.24.2
pbr==5.4.4
pip==20.0.2
proto-google-cloud-datastore-v1==0.90.4
protobuf==3.9.0
protorpc==0.12.0
pyarrow==0.15.1
pyasn1==0.4.8
pyasn1-modules==0.2.8
pydot==1.4.1
PyHamcrest==1.10.1
pymongo==3.8.0
pyparsing==2.4.6
python-dateutil==2.8.1
python-gflags==3.0.6
python-snappy==0.5.4
pytz==2019.1
PyVCF==0.6.8
PyYAML==5.1
requests==2.23.0
requests-oauthlib==1.3.0
rsa==4.0
scipy==1.2.2
setuptools==44.0.0
six==1.14.0
tenacity==6.0.0
tensorboard==2.1.0
tensorflow==2.1.0
tensorflow-estimator==2.1.0
termcolor==1.1.0
typing==3.7.4.1
typing-extensions==3.7.4.1
urllib3==1.25.8
virtualenv==16.7.9
Werkzeug==1.0.0
wheel==0.34.2
wrapt==1.12.0
Removing intermediate container 5ef4b17220eb
 ---> db313392b891
Step 12/15 : ADD target/launcher/linux_amd64/boot /opt/apache/beam/
 ---> 6a9dc48ce006
Step 13/15 : COPY target/LICENSE /opt/apache/beam/
 ---> e0b0ac8d420c
Step 14/15 : COPY target/NOTICE /opt/apache/beam/
 ---> fc4094f7a851
Step 15/15 : ENTRYPOINT ["/opt/apache/beam/boot"]
 ---> Running in 4fc2360cec05
Removing intermediate container 4fc2360cec05
 ---> 61b717969afb
Successfully built 61b717969afb
Successfully tagged apachebeam/python2.7_sdk:2.20.0.dev

> Task :runners:spark:job-server:validatesCrossLanguageRunnerSetup

> Task :runners:spark:job-server:validatesCrossLanguageRunnerJavaUsingJava

org.apache.beam.runners.core.construction.ExternalTest > expandMultiOutputTest FAILED
    java.lang.RuntimeException at ExternalTest.java:91

org.apache.beam.runners.core.construction.ExternalTest > expandMultipleTest FAILED
    java.lang.RuntimeException at ExternalTest.java:91

org.apache.beam.runners.core.construction.ExternalTest > expandSingleTest FAILED
    java.lang.RuntimeException at ExternalTest.java:91

org.apache.beam.runners.core.construction.ValidateRunnerXlangTest > combineGloballyTest FAILED
    java.lang.RuntimeException at ValidateRunnerXlangTest.java:98

org.apache.beam.runners.core.construction.ValidateRunnerXlangTest > partitionTest FAILED
    java.lang.RuntimeException at ValidateRunnerXlangTest.java:98

org.apache.beam.runners.core.construction.ValidateRunnerXlangTest > coGroupByKeyTest FAILED
    java.lang.RuntimeException at ValidateRunnerXlangTest.java:98

org.apache.beam.runners.core.construction.ValidateRunnerXlangTest > groupByKeyTest FAILED
    java.lang.RuntimeException at ValidateRunnerXlangTest.java:98

org.apache.beam.runners.core.construction.ValidateRunnerXlangTest > combinePerKeyTest FAILED
    java.lang.RuntimeException at ValidateRunnerXlangTest.java:98

org.apache.beam.runners.core.construction.ValidateRunnerXlangTest > flattenTest FAILED
    java.lang.RuntimeException at ValidateRunnerXlangTest.java:98

org.apache.beam.runners.core.construction.ValidateRunnerXlangTest > singleInputOutputTest FAILED
    java.lang.RuntimeException at ValidateRunnerXlangTest.java:98

org.apache.beam.runners.core.construction.ValidateRunnerXlangTest > multiInputOutputWithSideInputTest FAILED
    java.lang.RuntimeException at ValidateRunnerXlangTest.java:98

11 tests completed, 11 failed

> Task :runners:spark:job-server:validatesCrossLanguageRunnerJavaUsingJava FAILED

> Task :runners:spark:job-server:validatesCrossLanguageRunnerJavaUsingPython

org.apache.beam.runners.core.construction.ExternalTest > expandMultiOutputTest FAILED
    java.lang.RuntimeException at ExternalTest.java:91

org.apache.beam.runners.core.construction.ExternalTest > expandMultipleTest FAILED
    java.lang.RuntimeException at ExternalTest.java:91

org.apache.beam.runners.core.construction.ExternalTest > expandSingleTest FAILED
    java.lang.RuntimeException at ExternalTest.java:91

org.apache.beam.runners.core.construction.ValidateRunnerXlangTest > combineGloballyTest FAILED
    java.lang.RuntimeException at ValidateRunnerXlangTest.java:98

org.apache.beam.runners.core.construction.ValidateRunnerXlangTest > partitionTest FAILED
    java.lang.RuntimeException at ValidateRunnerXlangTest.java:98

org.apache.beam.runners.core.construction.ValidateRunnerXlangTest > coGroupByKeyTest FAILED
    java.lang.RuntimeException at ValidateRunnerXlangTest.java:98

org.apache.beam.runners.core.construction.ValidateRunnerXlangTest > groupByKeyTest FAILED
    java.lang.RuntimeException at ValidateRunnerXlangTest.java:98

org.apache.beam.runners.core.construction.ValidateRunnerXlangTest > combinePerKeyTest FAILED
    java.lang.RuntimeException at ValidateRunnerXlangTest.java:98

org.apache.beam.runners.core.construction.ValidateRunnerXlangTest > flattenTest FAILED
    java.lang.RuntimeException at ValidateRunnerXlangTest.java:98

org.apache.beam.runners.core.construction.ValidateRunnerXlangTest > singleInputOutputTest FAILED
    java.lang.RuntimeException at ValidateRunnerXlangTest.java:98

org.apache.beam.runners.core.construction.ValidateRunnerXlangTest > multiInputOutputWithSideInputTest FAILED
    java.lang.RuntimeException at ValidateRunnerXlangTest.java:98

11 tests completed, 11 failed

> Task :runners:spark:job-server:validatesCrossLanguageRunnerJavaUsingPython FAILED

> Task :runners:spark:job-server:validatesCrossLanguageRunnerPythonUsingJava
setup.py:252: UserWarning: You are using Apache Beam with Python 2. New releases of Apache Beam will soon support Python 3 only.
  'You are using Apache Beam with Python 2. '
<https://builds.apache.org/job/beam_PostCommit_XVR_Spark/ws/src/build/gradleenv/1922375555/local/lib/python2.7/site-packages/setuptools/dist.py>:476: UserWarning: Normalizing '2.20.0.dev' to '2.20.0.dev0'
  normalized_version,
warning: no files found matching 'README.md'
warning: no files found matching 'NOTICE'
warning: no files found matching 'LICENSE'
<https://builds.apache.org/job/beam_PostCommit_XVR_Spark/ws/src/sdks/python/apache_beam/__init__.py>:82: UserWarning: You are using Apache Beam with Python 2. New releases of Apache Beam will soon support Python 3 only.
  'You are using Apache Beam with Python 2. '
<https://builds.apache.org/job/beam_PostCommit_XVR_Spark/ws/src/sdks/python/apache_beam/transforms/trigger_test.py>:541: YAMLLoadWarning: calling yaml.load_all() without Loader=... is deprecated, as the default Loader is unsafe. Please read https://msg.pyyaml.org/load for full details.
  for spec in yaml.load_all(open(transcript_filename)):
test_generate_sequence (apache_beam.io.external.generate_sequence_test.XlangGenerateSequenceTest) ... ok
test_write (apache_beam.io.external.xlang_parquetio_test.XlangParquetIOTest) ... ok
test_cogroup_by_key (apache_beam.transforms.validate_runner_xlang_test.ValidateRunnerXlangTest) ... ok
test_combine_globally (apache_beam.transforms.validate_runner_xlang_test.ValidateRunnerXlangTest) ... ok
test_combine_per_key (apache_beam.transforms.validate_runner_xlang_test.ValidateRunnerXlangTest) ... ok
test_flatten (apache_beam.transforms.validate_runner_xlang_test.ValidateRunnerXlangTest) ... ok
test_group_by_key (apache_beam.transforms.validate_runner_xlang_test.ValidateRunnerXlangTest) ... ok
test_multi_input_output_with_sideinput (apache_beam.transforms.validate_runner_xlang_test.ValidateRunnerXlangTest) ... ok
test_partition (apache_beam.transforms.validate_runner_xlang_test.ValidateRunnerXlangTest) ... ok
test_prefix (apache_beam.transforms.validate_runner_xlang_test.ValidateRunnerXlangTest) ... ok

----------------------------------------------------------------------
XML: nosetests-xlangValidateRunner.xml
----------------------------------------------------------------------
XML: <https://builds.apache.org/job/beam_PostCommit_XVR_Spark/ws/src/sdks/python/nosetests.xml>
----------------------------------------------------------------------
Ran 10 tests in 154.498s

OK

> Task :runners:spark:job-server:validatesCrossLanguageRunnerPythonUsingPython
setup.py:252: UserWarning: You are using Apache Beam with Python 2. New releases of Apache Beam will soon support Python 3 only.
  'You are using Apache Beam with Python 2. '
<https://builds.apache.org/job/beam_PostCommit_XVR_Spark/ws/src/build/gradleenv/1922375555/local/lib/python2.7/site-packages/setuptools/dist.py>:476: UserWarning: Normalizing '2.20.0.dev' to '2.20.0.dev0'
  normalized_version,
warning: no files found matching 'README.md'
warning: no files found matching 'NOTICE'
warning: no files found matching 'LICENSE'
<https://builds.apache.org/job/beam_PostCommit_XVR_Spark/ws/src/sdks/python/apache_beam/__init__.py>:82: UserWarning: You are using Apache Beam with Python 2. New releases of Apache Beam will soon support Python 3 only.
  'You are using Apache Beam with Python 2. '
<https://builds.apache.org/job/beam_PostCommit_XVR_Spark/ws/src/sdks/python/apache_beam/transforms/trigger_test.py>:541: YAMLLoadWarning: calling yaml.load_all() without Loader=... is deprecated, as the default Loader is unsafe. Please read https://msg.pyyaml.org/load for full details.
  for spec in yaml.load_all(open(transcript_filename)):
test_generate_sequence (apache_beam.io.external.generate_sequence_test.XlangGenerateSequenceTest) ... ok
test_write (apache_beam.io.external.xlang_parquetio_test.XlangParquetIOTest) ... ok
test_cogroup_by_key (apache_beam.transforms.validate_runner_xlang_test.ValidateRunnerXlangTest) ... ok
test_combine_globally (apache_beam.transforms.validate_runner_xlang_test.ValidateRunnerXlangTest) ... ok
test_combine_per_key (apache_beam.transforms.validate_runner_xlang_test.ValidateRunnerXlangTest) ... ok
test_flatten (apache_beam.transforms.validate_runner_xlang_test.ValidateRunnerXlangTest) ... ok
test_group_by_key (apache_beam.transforms.validate_runner_xlang_test.ValidateRunnerXlangTest) ... ok
test_multi_input_output_with_sideinput (apache_beam.transforms.validate_runner_xlang_test.ValidateRunnerXlangTest) ... ok
test_partition (apache_beam.transforms.validate_runner_xlang_test.ValidateRunnerXlangTest) ... ok
test_prefix (apache_beam.transforms.validate_runner_xlang_test.ValidateRunnerXlangTest) ... ok

----------------------------------------------------------------------
XML: nosetests-xlangValidateRunner.xml
----------------------------------------------------------------------
XML: <https://builds.apache.org/job/beam_PostCommit_XVR_Spark/ws/src/sdks/python/nosetests.xml>
----------------------------------------------------------------------
Ran 10 tests in 83.364s

OK

> Task :runners:spark:job-server:validatesCrossLanguageRunnerCleanup
> Task :runners:spark:job-server:sparkJobServerCleanup

FAILURE: Build completed with 2 failures.

1: Task failed with an exception.
-----------
* What went wrong:
Execution failed for task ':runners:spark:job-server:validatesCrossLanguageRunnerJavaUsingJava'.
> There were failing tests. See the report at: file://<https://builds.apache.org/job/beam_PostCommit_XVR_Spark/ws/src/runners/spark/job-server/build/reports/tests/validatesCrossLanguageRunnerJavaUsingJava/index.html>

* Try:
Run with --stacktrace option to get the stack trace. Run with --info or --debug option to get more log output. Run with --scan to get full insights.
==============================================================================

2: Task failed with an exception.
-----------
* What went wrong:
Execution failed for task ':runners:spark:job-server:validatesCrossLanguageRunnerJavaUsingPython'.
> There were failing tests. See the report at: file://<https://builds.apache.org/job/beam_PostCommit_XVR_Spark/ws/src/runners/spark/job-server/build/reports/tests/validatesCrossLanguageRunnerJavaUsingPython/index.html>

* Try:
Run with --stacktrace option to get the stack trace. Run with --info or --debug option to get more log output. Run with --scan to get full insights.
==============================================================================

* Get more help at https://help.gradle.org

Deprecated Gradle features were used in this build, making it incompatible with Gradle 6.0.
Use '--warning-mode all' to show the individual deprecation warnings.
See https://docs.gradle.org/5.2.1/userguide/command_line_interface.html#sec:command_line_warnings

BUILD FAILED in 18m 17s
102 actionable tasks: 78 executed, 22 from cache, 2 up-to-date

Publishing build scan...
https://gradle.com/s/6mibolhxbs4zs

Build step 'Invoke Gradle script' changed build result to FAILURE
Build step 'Invoke Gradle script' marked build as failure

---------------------------------------------------------------------
To unsubscribe, e-mail: builds-unsubscribe@beam.apache.org
For additional commands, e-mail: builds-help@beam.apache.org


Build failed in Jenkins: beam_PostCommit_XVR_Spark #123

Posted by Apache Jenkins Server <je...@builds.apache.org>.
See <https://builds.apache.org/job/beam_PostCommit_XVR_Spark/123/display/redirect>

Changes:


------------------------------------------
[...truncated 591.31 KB...]
h5py==2.10.0
hdfs==2.5.6
httplib2==0.12.0
idna==2.9
Keras-Applications==1.0.8
Keras-Preprocessing==1.1.0
Markdown==3.1.1
mock==2.0.0
monotonic==1.5
nose==1.3.7
numpy==1.16.4
oauth2client==3.0.0
oauthlib==3.1.0
opt-einsum==2.3.2
pandas==0.24.2
pbr==5.4.4
pip==20.0.2
proto-google-cloud-datastore-v1==0.90.4
protobuf==3.9.0
protorpc==0.12.0
pyarrow==0.15.1
pyasn1==0.4.8
pyasn1-modules==0.2.8
pydot==1.4.1
PyHamcrest==1.10.1
pymongo==3.8.0
pyparsing==2.4.6
python-dateutil==2.8.1
python-gflags==3.0.6
python-snappy==0.5.4
pytz==2019.1
PyVCF==0.6.8
PyYAML==5.1
requests==2.23.0
requests-oauthlib==1.3.0
rsa==4.0
scipy==1.2.2
setuptools==44.0.0
six==1.14.0
tenacity==6.0.0
tensorboard==2.1.0
tensorflow==2.1.0
tensorflow-estimator==2.1.0
termcolor==1.1.0
typing==3.7.4.1
typing-extensions==3.7.4.1
urllib3==1.25.8
virtualenv==16.7.9
Werkzeug==1.0.0
wheel==0.34.2
wrapt==1.12.0
Removing intermediate container 79d2f722a1e7
 ---> 4084883d6b19
Step 12/15 : ADD target/launcher/linux_amd64/boot /opt/apache/beam/
 ---> efab6e1579dc
Step 13/15 : COPY target/LICENSE /opt/apache/beam/
 ---> ebc829b503e1
Step 14/15 : COPY target/NOTICE /opt/apache/beam/
 ---> 3c9de3c9bd73
Step 15/15 : ENTRYPOINT ["/opt/apache/beam/boot"]
 ---> Running in 62756ab0f460
Removing intermediate container 62756ab0f460
 ---> 194cb0c9d967
Successfully built 194cb0c9d967
Successfully tagged apachebeam/python2.7_sdk:2.20.0.dev

> Task :runners:spark:job-server:validatesCrossLanguageRunnerSetup

> Task :runners:spark:job-server:validatesCrossLanguageRunnerJavaUsingJava

org.apache.beam.runners.core.construction.ExternalTest > expandMultiOutputTest FAILED
    java.lang.RuntimeException at ExternalTest.java:91

org.apache.beam.runners.core.construction.ExternalTest > expandMultipleTest FAILED
    java.lang.RuntimeException at ExternalTest.java:91

org.apache.beam.runners.core.construction.ExternalTest > expandSingleTest FAILED
    java.lang.RuntimeException at ExternalTest.java:91

org.apache.beam.runners.core.construction.ValidateRunnerXlangTest > combineGloballyTest FAILED
    java.lang.RuntimeException at ValidateRunnerXlangTest.java:98

org.apache.beam.runners.core.construction.ValidateRunnerXlangTest > partitionTest FAILED
    java.lang.RuntimeException at ValidateRunnerXlangTest.java:98

org.apache.beam.runners.core.construction.ValidateRunnerXlangTest > coGroupByKeyTest FAILED
    java.lang.RuntimeException at ValidateRunnerXlangTest.java:98

org.apache.beam.runners.core.construction.ValidateRunnerXlangTest > groupByKeyTest FAILED
    java.lang.RuntimeException at ValidateRunnerXlangTest.java:98

org.apache.beam.runners.core.construction.ValidateRunnerXlangTest > combinePerKeyTest FAILED
    java.lang.RuntimeException at ValidateRunnerXlangTest.java:98

org.apache.beam.runners.core.construction.ValidateRunnerXlangTest > flattenTest FAILED
    java.lang.RuntimeException at ValidateRunnerXlangTest.java:98

org.apache.beam.runners.core.construction.ValidateRunnerXlangTest > singleInputOutputTest FAILED
    java.lang.RuntimeException at ValidateRunnerXlangTest.java:98

org.apache.beam.runners.core.construction.ValidateRunnerXlangTest > multiInputOutputWithSideInputTest FAILED
    java.lang.RuntimeException at ValidateRunnerXlangTest.java:98

11 tests completed, 11 failed

> Task :runners:spark:job-server:validatesCrossLanguageRunnerJavaUsingJava FAILED

> Task :runners:spark:job-server:validatesCrossLanguageRunnerJavaUsingPython

org.apache.beam.runners.core.construction.ExternalTest > expandMultiOutputTest FAILED
    java.lang.RuntimeException at ExternalTest.java:91

org.apache.beam.runners.core.construction.ExternalTest > expandMultipleTest FAILED
    java.lang.RuntimeException at ExternalTest.java:91

org.apache.beam.runners.core.construction.ExternalTest > expandSingleTest FAILED
    java.lang.RuntimeException at ExternalTest.java:91

org.apache.beam.runners.core.construction.ValidateRunnerXlangTest > combineGloballyTest FAILED
    java.lang.RuntimeException at ValidateRunnerXlangTest.java:98

org.apache.beam.runners.core.construction.ValidateRunnerXlangTest > partitionTest FAILED
    java.lang.RuntimeException at ValidateRunnerXlangTest.java:98

org.apache.beam.runners.core.construction.ValidateRunnerXlangTest > coGroupByKeyTest FAILED
    java.lang.RuntimeException at ValidateRunnerXlangTest.java:98

org.apache.beam.runners.core.construction.ValidateRunnerXlangTest > groupByKeyTest FAILED
    java.lang.RuntimeException at ValidateRunnerXlangTest.java:98

org.apache.beam.runners.core.construction.ValidateRunnerXlangTest > combinePerKeyTest FAILED
    java.lang.RuntimeException at ValidateRunnerXlangTest.java:98

org.apache.beam.runners.core.construction.ValidateRunnerXlangTest > flattenTest FAILED
    java.lang.RuntimeException at ValidateRunnerXlangTest.java:98

org.apache.beam.runners.core.construction.ValidateRunnerXlangTest > singleInputOutputTest FAILED
    java.lang.RuntimeException at ValidateRunnerXlangTest.java:98

org.apache.beam.runners.core.construction.ValidateRunnerXlangTest > multiInputOutputWithSideInputTest FAILED
    java.lang.RuntimeException at ValidateRunnerXlangTest.java:98

11 tests completed, 11 failed

> Task :runners:spark:job-server:validatesCrossLanguageRunnerJavaUsingPython FAILED

> Task :runners:spark:job-server:validatesCrossLanguageRunnerPythonUsingJava
setup.py:252: UserWarning: You are using Apache Beam with Python 2. New releases of Apache Beam will soon support Python 3 only.
  'You are using Apache Beam with Python 2. '
<https://builds.apache.org/job/beam_PostCommit_XVR_Spark/ws/src/build/gradleenv/1922375555/local/lib/python2.7/site-packages/setuptools/dist.py>:476: UserWarning: Normalizing '2.20.0.dev' to '2.20.0.dev0'
  normalized_version,
warning: no files found matching 'README.md'
warning: no files found matching 'NOTICE'
warning: no files found matching 'LICENSE'
<https://builds.apache.org/job/beam_PostCommit_XVR_Spark/ws/src/sdks/python/apache_beam/__init__.py>:82: UserWarning: You are using Apache Beam with Python 2. New releases of Apache Beam will soon support Python 3 only.
  'You are using Apache Beam with Python 2. '
<https://builds.apache.org/job/beam_PostCommit_XVR_Spark/ws/src/sdks/python/apache_beam/transforms/trigger_test.py>:541: YAMLLoadWarning: calling yaml.load_all() without Loader=... is deprecated, as the default Loader is unsafe. Please read https://msg.pyyaml.org/load for full details.
  for spec in yaml.load_all(open(transcript_filename)):
test_generate_sequence (apache_beam.io.external.generate_sequence_test.XlangGenerateSequenceTest) ... ok
test_write (apache_beam.io.external.xlang_parquetio_test.XlangParquetIOTest) ... ok
test_cogroup_by_key (apache_beam.transforms.validate_runner_xlang_test.ValidateRunnerXlangTest) ... ok
test_combine_globally (apache_beam.transforms.validate_runner_xlang_test.ValidateRunnerXlangTest) ... ok
test_combine_per_key (apache_beam.transforms.validate_runner_xlang_test.ValidateRunnerXlangTest) ... ok
test_flatten (apache_beam.transforms.validate_runner_xlang_test.ValidateRunnerXlangTest) ... ok
test_group_by_key (apache_beam.transforms.validate_runner_xlang_test.ValidateRunnerXlangTest) ... ok
test_multi_input_output_with_sideinput (apache_beam.transforms.validate_runner_xlang_test.ValidateRunnerXlangTest) ... ok
test_partition (apache_beam.transforms.validate_runner_xlang_test.ValidateRunnerXlangTest) ... ok
test_prefix (apache_beam.transforms.validate_runner_xlang_test.ValidateRunnerXlangTest) ... ok

----------------------------------------------------------------------
XML: nosetests-xlangValidateRunner.xml
----------------------------------------------------------------------
XML: <https://builds.apache.org/job/beam_PostCommit_XVR_Spark/ws/src/sdks/python/nosetests.xml>
----------------------------------------------------------------------
Ran 10 tests in 153.317s

OK

> Task :runners:spark:job-server:validatesCrossLanguageRunnerPythonUsingPython
setup.py:252: UserWarning: You are using Apache Beam with Python 2. New releases of Apache Beam will soon support Python 3 only.
  'You are using Apache Beam with Python 2. '
<https://builds.apache.org/job/beam_PostCommit_XVR_Spark/ws/src/build/gradleenv/1922375555/local/lib/python2.7/site-packages/setuptools/dist.py>:476: UserWarning: Normalizing '2.20.0.dev' to '2.20.0.dev0'
  normalized_version,
warning: no files found matching 'README.md'
warning: no files found matching 'NOTICE'
warning: no files found matching 'LICENSE'
<https://builds.apache.org/job/beam_PostCommit_XVR_Spark/ws/src/sdks/python/apache_beam/__init__.py>:82: UserWarning: You are using Apache Beam with Python 2. New releases of Apache Beam will soon support Python 3 only.
  'You are using Apache Beam with Python 2. '
<https://builds.apache.org/job/beam_PostCommit_XVR_Spark/ws/src/sdks/python/apache_beam/transforms/trigger_test.py>:541: YAMLLoadWarning: calling yaml.load_all() without Loader=... is deprecated, as the default Loader is unsafe. Please read https://msg.pyyaml.org/load for full details.
  for spec in yaml.load_all(open(transcript_filename)):
test_generate_sequence (apache_beam.io.external.generate_sequence_test.XlangGenerateSequenceTest) ... ok
test_write (apache_beam.io.external.xlang_parquetio_test.XlangParquetIOTest) ... ok
test_cogroup_by_key (apache_beam.transforms.validate_runner_xlang_test.ValidateRunnerXlangTest) ... ok
test_combine_globally (apache_beam.transforms.validate_runner_xlang_test.ValidateRunnerXlangTest) ... ok
test_combine_per_key (apache_beam.transforms.validate_runner_xlang_test.ValidateRunnerXlangTest) ... ok
test_flatten (apache_beam.transforms.validate_runner_xlang_test.ValidateRunnerXlangTest) ... ok
test_group_by_key (apache_beam.transforms.validate_runner_xlang_test.ValidateRunnerXlangTest) ... ok
test_multi_input_output_with_sideinput (apache_beam.transforms.validate_runner_xlang_test.ValidateRunnerXlangTest) ... ok
test_partition (apache_beam.transforms.validate_runner_xlang_test.ValidateRunnerXlangTest) ... ok
test_prefix (apache_beam.transforms.validate_runner_xlang_test.ValidateRunnerXlangTest) ... ok

----------------------------------------------------------------------
XML: nosetests-xlangValidateRunner.xml
----------------------------------------------------------------------
XML: <https://builds.apache.org/job/beam_PostCommit_XVR_Spark/ws/src/sdks/python/nosetests.xml>
----------------------------------------------------------------------
Ran 10 tests in 78.149s

OK

> Task :runners:spark:job-server:validatesCrossLanguageRunnerCleanup
> Task :runners:spark:job-server:sparkJobServerCleanup

FAILURE: Build completed with 2 failures.

1: Task failed with an exception.
-----------
* What went wrong:
Execution failed for task ':runners:spark:job-server:validatesCrossLanguageRunnerJavaUsingJava'.
> There were failing tests. See the report at: file://<https://builds.apache.org/job/beam_PostCommit_XVR_Spark/ws/src/runners/spark/job-server/build/reports/tests/validatesCrossLanguageRunnerJavaUsingJava/index.html>

* Try:
Run with --stacktrace option to get the stack trace. Run with --info or --debug option to get more log output. Run with --scan to get full insights.
==============================================================================

2: Task failed with an exception.
-----------
* What went wrong:
Execution failed for task ':runners:spark:job-server:validatesCrossLanguageRunnerJavaUsingPython'.
> There were failing tests. See the report at: file://<https://builds.apache.org/job/beam_PostCommit_XVR_Spark/ws/src/runners/spark/job-server/build/reports/tests/validatesCrossLanguageRunnerJavaUsingPython/index.html>

* Try:
Run with --stacktrace option to get the stack trace. Run with --info or --debug option to get more log output. Run with --scan to get full insights.
==============================================================================

* Get more help at https://help.gradle.org

Deprecated Gradle features were used in this build, making it incompatible with Gradle 6.0.
Use '--warning-mode all' to show the individual deprecation warnings.
See https://docs.gradle.org/5.2.1/userguide/command_line_interface.html#sec:command_line_warnings

BUILD FAILED in 18m 19s
102 actionable tasks: 78 executed, 22 from cache, 2 up-to-date

Publishing build scan...
https://gradle.com/s/vf7dfjpiquzp2

Build step 'Invoke Gradle script' changed build result to FAILURE
Build step 'Invoke Gradle script' marked build as failure

---------------------------------------------------------------------
To unsubscribe, e-mail: builds-unsubscribe@beam.apache.org
For additional commands, e-mail: builds-help@beam.apache.org


Build failed in Jenkins: beam_PostCommit_XVR_Spark #122

Posted by Apache Jenkins Server <je...@builds.apache.org>.
See <https://builds.apache.org/job/beam_PostCommit_XVR_Spark/122/display/redirect?page=changes>

Changes:

[bhulette] Don't exclude UsesUnboundedPCollections in Dataflow VR tests


------------------------------------------
[...truncated 592.74 KB...]
h5py==2.10.0
hdfs==2.5.6
httplib2==0.12.0
idna==2.9
Keras-Applications==1.0.8
Keras-Preprocessing==1.1.0
Markdown==3.1.1
mock==2.0.0
monotonic==1.5
nose==1.3.7
numpy==1.16.4
oauth2client==3.0.0
oauthlib==3.1.0
opt-einsum==2.3.2
pandas==0.24.2
pbr==5.4.4
pip==20.0.2
proto-google-cloud-datastore-v1==0.90.4
protobuf==3.9.0
protorpc==0.12.0
pyarrow==0.15.1
pyasn1==0.4.8
pyasn1-modules==0.2.8
pydot==1.4.1
PyHamcrest==1.10.1
pymongo==3.8.0
pyparsing==2.4.6
python-dateutil==2.8.1
python-gflags==3.0.6
python-snappy==0.5.4
pytz==2019.1
PyVCF==0.6.8
PyYAML==5.1
requests==2.23.0
requests-oauthlib==1.3.0
rsa==4.0
scipy==1.2.2
setuptools==44.0.0
six==1.14.0
tenacity==6.0.0
tensorboard==2.1.0
tensorflow==2.1.0
tensorflow-estimator==2.1.0
termcolor==1.1.0
typing==3.7.4.1
typing-extensions==3.7.4.1
urllib3==1.25.8
virtualenv==16.7.9
Werkzeug==1.0.0
wheel==0.34.2
wrapt==1.12.0
Removing intermediate container dbdadb744738
 ---> 6f7f174c2e1a
Step 12/15 : ADD target/launcher/linux_amd64/boot /opt/apache/beam/
 ---> 9a931f41b766
Step 13/15 : COPY target/LICENSE /opt/apache/beam/
 ---> 5dd5c2f049cc
Step 14/15 : COPY target/NOTICE /opt/apache/beam/
 ---> 9a0f49bc8a5f
Step 15/15 : ENTRYPOINT ["/opt/apache/beam/boot"]
 ---> Running in 4c6dff28731e
Removing intermediate container 4c6dff28731e
 ---> 0045d3a153de
Successfully built 0045d3a153de
Successfully tagged apachebeam/python2.7_sdk:2.20.0.dev

> Task :runners:spark:job-server:validatesCrossLanguageRunnerSetup

> Task :runners:spark:job-server:validatesCrossLanguageRunnerJavaUsingJava

org.apache.beam.runners.core.construction.ExternalTest > expandMultiOutputTest FAILED
    java.lang.RuntimeException at ExternalTest.java:91

org.apache.beam.runners.core.construction.ExternalTest > expandMultipleTest FAILED
    java.lang.RuntimeException at ExternalTest.java:91

org.apache.beam.runners.core.construction.ExternalTest > expandSingleTest FAILED
    java.lang.RuntimeException at ExternalTest.java:91

org.apache.beam.runners.core.construction.ValidateRunnerXlangTest > combineGloballyTest FAILED
    java.lang.RuntimeException at ValidateRunnerXlangTest.java:98

org.apache.beam.runners.core.construction.ValidateRunnerXlangTest > partitionTest FAILED
    java.lang.RuntimeException at ValidateRunnerXlangTest.java:98

org.apache.beam.runners.core.construction.ValidateRunnerXlangTest > coGroupByKeyTest FAILED
    java.lang.RuntimeException at ValidateRunnerXlangTest.java:98

org.apache.beam.runners.core.construction.ValidateRunnerXlangTest > groupByKeyTest FAILED
    java.lang.RuntimeException at ValidateRunnerXlangTest.java:98

org.apache.beam.runners.core.construction.ValidateRunnerXlangTest > combinePerKeyTest FAILED
    java.lang.RuntimeException at ValidateRunnerXlangTest.java:98

org.apache.beam.runners.core.construction.ValidateRunnerXlangTest > flattenTest FAILED
    java.lang.RuntimeException at ValidateRunnerXlangTest.java:98

org.apache.beam.runners.core.construction.ValidateRunnerXlangTest > singleInputOutputTest FAILED
    java.lang.RuntimeException at ValidateRunnerXlangTest.java:98

org.apache.beam.runners.core.construction.ValidateRunnerXlangTest > multiInputOutputWithSideInputTest FAILED
    java.lang.RuntimeException at ValidateRunnerXlangTest.java:98

11 tests completed, 11 failed

> Task :runners:spark:job-server:validatesCrossLanguageRunnerJavaUsingJava FAILED

> Task :runners:spark:job-server:validatesCrossLanguageRunnerJavaUsingPython

org.apache.beam.runners.core.construction.ExternalTest > expandMultiOutputTest FAILED
    java.lang.RuntimeException at ExternalTest.java:91

org.apache.beam.runners.core.construction.ExternalTest > expandMultipleTest FAILED
    java.lang.RuntimeException at ExternalTest.java:91

org.apache.beam.runners.core.construction.ExternalTest > expandSingleTest FAILED
    java.lang.RuntimeException at ExternalTest.java:91

org.apache.beam.runners.core.construction.ValidateRunnerXlangTest > combineGloballyTest FAILED
    java.lang.RuntimeException at ValidateRunnerXlangTest.java:98

org.apache.beam.runners.core.construction.ValidateRunnerXlangTest > partitionTest FAILED
    java.lang.RuntimeException at ValidateRunnerXlangTest.java:98

org.apache.beam.runners.core.construction.ValidateRunnerXlangTest > coGroupByKeyTest FAILED
    java.lang.RuntimeException at ValidateRunnerXlangTest.java:98

org.apache.beam.runners.core.construction.ValidateRunnerXlangTest > groupByKeyTest FAILED
    java.lang.RuntimeException at ValidateRunnerXlangTest.java:98

org.apache.beam.runners.core.construction.ValidateRunnerXlangTest > combinePerKeyTest FAILED
    java.lang.RuntimeException at ValidateRunnerXlangTest.java:98

org.apache.beam.runners.core.construction.ValidateRunnerXlangTest > flattenTest FAILED
    java.lang.RuntimeException at ValidateRunnerXlangTest.java:98

org.apache.beam.runners.core.construction.ValidateRunnerXlangTest > singleInputOutputTest FAILED
    java.lang.RuntimeException at ValidateRunnerXlangTest.java:98

org.apache.beam.runners.core.construction.ValidateRunnerXlangTest > multiInputOutputWithSideInputTest FAILED
    java.lang.RuntimeException at ValidateRunnerXlangTest.java:98

11 tests completed, 11 failed

> Task :runners:spark:job-server:validatesCrossLanguageRunnerJavaUsingPython FAILED

> Task :runners:spark:job-server:validatesCrossLanguageRunnerPythonUsingJava
setup.py:252: UserWarning: You are using Apache Beam with Python 2. New releases of Apache Beam will soon support Python 3 only.
  'You are using Apache Beam with Python 2. '
<https://builds.apache.org/job/beam_PostCommit_XVR_Spark/ws/src/build/gradleenv/1922375555/local/lib/python2.7/site-packages/setuptools/dist.py>:476: UserWarning: Normalizing '2.20.0.dev' to '2.20.0.dev0'
  normalized_version,
warning: no files found matching 'README.md'
warning: no files found matching 'NOTICE'
warning: no files found matching 'LICENSE'
<https://builds.apache.org/job/beam_PostCommit_XVR_Spark/ws/src/sdks/python/apache_beam/__init__.py>:82: UserWarning: You are using Apache Beam with Python 2. New releases of Apache Beam will soon support Python 3 only.
  'You are using Apache Beam with Python 2. '
<https://builds.apache.org/job/beam_PostCommit_XVR_Spark/ws/src/sdks/python/apache_beam/transforms/trigger_test.py>:541: YAMLLoadWarning: calling yaml.load_all() without Loader=... is deprecated, as the default Loader is unsafe. Please read https://msg.pyyaml.org/load for full details.
  for spec in yaml.load_all(open(transcript_filename)):
test_generate_sequence (apache_beam.io.external.generate_sequence_test.XlangGenerateSequenceTest) ... ok
test_write (apache_beam.io.external.xlang_parquetio_test.XlangParquetIOTest) ... ok
test_cogroup_by_key (apache_beam.transforms.validate_runner_xlang_test.ValidateRunnerXlangTest) ... ok
test_combine_globally (apache_beam.transforms.validate_runner_xlang_test.ValidateRunnerXlangTest) ... ok
test_combine_per_key (apache_beam.transforms.validate_runner_xlang_test.ValidateRunnerXlangTest) ... ok
test_flatten (apache_beam.transforms.validate_runner_xlang_test.ValidateRunnerXlangTest) ... ok
test_group_by_key (apache_beam.transforms.validate_runner_xlang_test.ValidateRunnerXlangTest) ... ok
test_multi_input_output_with_sideinput (apache_beam.transforms.validate_runner_xlang_test.ValidateRunnerXlangTest) ... ok
test_partition (apache_beam.transforms.validate_runner_xlang_test.ValidateRunnerXlangTest) ... ok
test_prefix (apache_beam.transforms.validate_runner_xlang_test.ValidateRunnerXlangTest) ... ok

----------------------------------------------------------------------
XML: nosetests-xlangValidateRunner.xml
----------------------------------------------------------------------
XML: <https://builds.apache.org/job/beam_PostCommit_XVR_Spark/ws/src/sdks/python/nosetests.xml>
----------------------------------------------------------------------
Ran 10 tests in 186.289s

OK

> Task :runners:spark:job-server:validatesCrossLanguageRunnerPythonUsingPython
setup.py:252: UserWarning: You are using Apache Beam with Python 2. New releases of Apache Beam will soon support Python 3 only.
  'You are using Apache Beam with Python 2. '
<https://builds.apache.org/job/beam_PostCommit_XVR_Spark/ws/src/build/gradleenv/1922375555/local/lib/python2.7/site-packages/setuptools/dist.py>:476: UserWarning: Normalizing '2.20.0.dev' to '2.20.0.dev0'
  normalized_version,
warning: no files found matching 'README.md'
warning: no files found matching 'NOTICE'
warning: no files found matching 'LICENSE'
<https://builds.apache.org/job/beam_PostCommit_XVR_Spark/ws/src/sdks/python/apache_beam/__init__.py>:82: UserWarning: You are using Apache Beam with Python 2. New releases of Apache Beam will soon support Python 3 only.
  'You are using Apache Beam with Python 2. '
<https://builds.apache.org/job/beam_PostCommit_XVR_Spark/ws/src/sdks/python/apache_beam/transforms/trigger_test.py>:541: YAMLLoadWarning: calling yaml.load_all() without Loader=... is deprecated, as the default Loader is unsafe. Please read https://msg.pyyaml.org/load for full details.
  for spec in yaml.load_all(open(transcript_filename)):
test_generate_sequence (apache_beam.io.external.generate_sequence_test.XlangGenerateSequenceTest) ... ok
test_write (apache_beam.io.external.xlang_parquetio_test.XlangParquetIOTest) ... ok
test_cogroup_by_key (apache_beam.transforms.validate_runner_xlang_test.ValidateRunnerXlangTest) ... ok
test_combine_globally (apache_beam.transforms.validate_runner_xlang_test.ValidateRunnerXlangTest) ... ok
test_combine_per_key (apache_beam.transforms.validate_runner_xlang_test.ValidateRunnerXlangTest) ... ok
test_flatten (apache_beam.transforms.validate_runner_xlang_test.ValidateRunnerXlangTest) ... ok
test_group_by_key (apache_beam.transforms.validate_runner_xlang_test.ValidateRunnerXlangTest) ... ok
test_multi_input_output_with_sideinput (apache_beam.transforms.validate_runner_xlang_test.ValidateRunnerXlangTest) ... ok
test_partition (apache_beam.transforms.validate_runner_xlang_test.ValidateRunnerXlangTest) ... ok
test_prefix (apache_beam.transforms.validate_runner_xlang_test.ValidateRunnerXlangTest) ... ok

----------------------------------------------------------------------
XML: nosetests-xlangValidateRunner.xml
----------------------------------------------------------------------
XML: <https://builds.apache.org/job/beam_PostCommit_XVR_Spark/ws/src/sdks/python/nosetests.xml>
----------------------------------------------------------------------
Ran 10 tests in 86.957s

OK

> Task :runners:spark:job-server:validatesCrossLanguageRunnerCleanup
> Task :runners:spark:job-server:sparkJobServerCleanup

FAILURE: Build completed with 2 failures.

1: Task failed with an exception.
-----------
* What went wrong:
Execution failed for task ':runners:spark:job-server:validatesCrossLanguageRunnerJavaUsingJava'.
> There were failing tests. See the report at: file://<https://builds.apache.org/job/beam_PostCommit_XVR_Spark/ws/src/runners/spark/job-server/build/reports/tests/validatesCrossLanguageRunnerJavaUsingJava/index.html>

* Try:
Run with --stacktrace option to get the stack trace. Run with --info or --debug option to get more log output. Run with --scan to get full insights.
==============================================================================

2: Task failed with an exception.
-----------
* What went wrong:
Execution failed for task ':runners:spark:job-server:validatesCrossLanguageRunnerJavaUsingPython'.
> There were failing tests. See the report at: file://<https://builds.apache.org/job/beam_PostCommit_XVR_Spark/ws/src/runners/spark/job-server/build/reports/tests/validatesCrossLanguageRunnerJavaUsingPython/index.html>

* Try:
Run with --stacktrace option to get the stack trace. Run with --info or --debug option to get more log output. Run with --scan to get full insights.
==============================================================================

* Get more help at https://help.gradle.org

Deprecated Gradle features were used in this build, making it incompatible with Gradle 6.0.
Use '--warning-mode all' to show the individual deprecation warnings.
See https://docs.gradle.org/5.2.1/userguide/command_line_interface.html#sec:command_line_warnings

BUILD FAILED in 18m 20s
102 actionable tasks: 78 executed, 22 from cache, 2 up-to-date

Publishing build scan...
https://gradle.com/s/ylkfmv2whimvw

Build step 'Invoke Gradle script' changed build result to FAILURE
Build step 'Invoke Gradle script' marked build as failure

---------------------------------------------------------------------
To unsubscribe, e-mail: builds-unsubscribe@beam.apache.org
For additional commands, e-mail: builds-help@beam.apache.org