You are viewing a plain text version of this content. The canonical link for it is here.
Posted to yarn-dev@hadoop.apache.org by Apache Jenkins Server <je...@builds.apache.org> on 2015/11/19 23:38:18 UTC
Hadoop-Yarn-trunk - Build # 1424 - Failure
See https://builds.apache.org/job/Hadoop-Yarn-trunk/1424/
###################################################################################
########################## LAST 60 LINES OF THE CONSOLE ###########################
[...truncated 9484 lines...]
Tests in error:
TestApplicationPriority.testUpdateInvalidPriorityAtRuntime:367 » ServiceConfiguration
TestApplicationPriority.testRMRestartWithChangeInPriority:417 » NullPointer
TestApplicationPriority.testApplicationPriorityAllocation:165 » NullPointer
TestApplicationPriority.testApplicationPriorityAllocationWithChangeInPriority:470 » NullPointer
TestApplicationPriority.testPriorityWithPendingApplications:250 » NullPointer
TestApplicationPriority.testUpdatePriorityAtRuntime:333 » NullPointer
Tests run: 1256, Failures: 1, Errors: 6, Skipped: 1
[INFO] ------------------------------------------------------------------------
[INFO] Reactor Summary:
[INFO]
[INFO] Apache Hadoop YARN ................................ SUCCESS [ 5.673 s]
[INFO] Apache Hadoop YARN API ............................ SUCCESS [05:23 min]
[INFO] Apache Hadoop YARN Common ......................... SUCCESS [03:52 min]
[INFO] Apache Hadoop YARN Server ......................... SUCCESS [ 0.134 s]
[INFO] Apache Hadoop YARN Server Common .................. SUCCESS [01:05 min]
[INFO] Apache Hadoop YARN NodeManager .................... SUCCESS [10:07 min]
[INFO] Apache Hadoop YARN Web Proxy ...................... SUCCESS [ 28.401 s]
[INFO] Apache Hadoop YARN ApplicationHistoryService ...... SUCCESS [03:37 min]
[INFO] Apache Hadoop YARN ResourceManager ................ FAILURE [ 01:01 h]
[INFO] Apache Hadoop YARN Server Tests ................... SKIPPED
[INFO] Apache Hadoop YARN Client ......................... SKIPPED
[INFO] Apache Hadoop YARN SharedCacheManager ............. SKIPPED
[INFO] Apache Hadoop YARN Applications ................... SKIPPED
[INFO] Apache Hadoop YARN DistributedShell ............... SKIPPED
[INFO] Apache Hadoop YARN Unmanaged Am Launcher .......... SKIPPED
[INFO] Apache Hadoop YARN Site ........................... SKIPPED
[INFO] Apache Hadoop YARN Registry ....................... SKIPPED
[INFO] Apache Hadoop YARN Project ........................ SKIPPED
[INFO] ------------------------------------------------------------------------
[INFO] BUILD FAILURE
[INFO] ------------------------------------------------------------------------
[INFO] Total time: 01:25 h
[INFO] Finished at: 2015-11-19T22:38:16+00:00
[INFO] Final Memory: 59M/540M
[INFO] ------------------------------------------------------------------------
[ERROR] Failed to execute goal org.apache.maven.plugins:maven-surefire-plugin:2.17:test (default-test) on project hadoop-yarn-server-resourcemanager: There are test failures.
[ERROR]
[ERROR] Please refer to /home/jenkins/jenkins-slave/workspace/Hadoop-Yarn-trunk/hadoop-yarn-project/hadoop-yarn/hadoop-yarn-server/hadoop-yarn-server-resourcemanager/target/surefire-reports for the individual test results.
[ERROR] -> [Help 1]
[ERROR]
[ERROR] To see the full stack trace of the errors, re-run Maven with the -e switch.
[ERROR] Re-run Maven using the -X switch to enable full debug logging.
[ERROR]
[ERROR] For more information about the errors and possible solutions, please read the following articles:
[ERROR] [Help 1] http://cwiki.apache.org/confluence/display/MAVEN/MojoFailureException
[ERROR]
[ERROR] After correcting the problems, you can resume the build with the command
[ERROR] mvn <goals> -rf :hadoop-yarn-server-resourcemanager
Build step 'Execute shell' marked build as failure
Archiving artifacts
Recording test results
Updating HADOOP-11901
Sending e-mails to: yarn-dev@hadoop.apache.org
Email was triggered for: Failure - Any
Sending email for trigger: Failure - Any
###################################################################################
############################## FAILED TESTS (if any) ##############################
7 tests failed.
FAILED: org.apache.hadoop.yarn.server.resourcemanager.scheduler.capacity.TestApplicationPriority.testUpdateInvalidPriorityAtRuntime
Error Message:
org.apache.hadoop.security.token.TokenIdentifier: Provider org.apache.hadoop.hdfs.security.token.block.BlockTokenIdentifier not found
Stack Trace:
java.util.ServiceConfigurationError: org.apache.hadoop.security.token.TokenIdentifier: Provider org.apache.hadoop.hdfs.security.token.block.BlockTokenIdentifier not found
at java.util.ServiceLoader.fail(ServiceLoader.java:231)
at java.util.ServiceLoader.access$300(ServiceLoader.java:181)
at java.util.ServiceLoader$LazyIterator.next(ServiceLoader.java:365)
at java.util.ServiceLoader$1.next(ServiceLoader.java:445)
at org.apache.hadoop.security.token.Token.getClassForIdentifier(Token.java:114)
at org.apache.hadoop.security.token.Token.decodeIdentifier(Token.java:135)
at org.apache.hadoop.yarn.server.resourcemanager.MockAM.registerAppAttempt(MockAM.java:126)
at org.apache.hadoop.yarn.server.resourcemanager.MockAM.registerAppAttempt(MockAM.java:106)
at org.apache.hadoop.yarn.server.resourcemanager.scheduler.capacity.TestApplicationPriority.testUpdateInvalidPriorityAtRuntime(TestApplicationPriority.java:367)
FAILED: org.apache.hadoop.yarn.server.resourcemanager.scheduler.capacity.TestApplicationPriority.testRMRestartWithChangeInPriority
Error Message:
null
Stack Trace:
java.lang.NullPointerException: null
at javax.security.auth.Subject$ClassSet.populateSet(Subject.java:1387)
at javax.security.auth.Subject$ClassSet.<init>(Subject.java:1350)
at javax.security.auth.Subject.getPublicCredentials(Subject.java:704)
at org.apache.hadoop.security.UserGroupInformation.getTokenIdentifiers(UserGroupInformation.java:1439)
at org.apache.hadoop.yarn.server.utils.YarnServerSecurityUtils.selectAMRMTokenIdentifier(YarnServerSecurityUtils.java:104)
at org.apache.hadoop.yarn.server.utils.YarnServerSecurityUtils.authorizeRequest(YarnServerSecurityUtils.java:76)
at org.apache.hadoop.yarn.server.resourcemanager.ApplicationMasterService.registerApplicationMaster(ApplicationMasterService.java:181)
at org.apache.hadoop.yarn.server.resourcemanager.MockAM$1.run(MockAM.java:134)
at org.apache.hadoop.yarn.server.resourcemanager.MockAM$1.run(MockAM.java:131)
at java.security.AccessController.doPrivileged(Native Method)
at javax.security.auth.Subject.doAs(Subject.java:415)
at org.apache.hadoop.security.UserGroupInformation.doAs(UserGroupInformation.java:1669)
at org.apache.hadoop.yarn.server.resourcemanager.MockAM.registerAppAttempt(MockAM.java:129)
at org.apache.hadoop.yarn.server.resourcemanager.MockAM.registerAppAttempt(MockAM.java:106)
at org.apache.hadoop.yarn.server.resourcemanager.scheduler.capacity.TestApplicationPriority.testRMRestartWithChangeInPriority(TestApplicationPriority.java:417)
FAILED: org.apache.hadoop.yarn.server.resourcemanager.scheduler.capacity.TestApplicationPriority.testApplicationPriorityAllocation
Error Message:
null
Stack Trace:
java.lang.NullPointerException: null
at javax.security.auth.Subject$ClassSet.populateSet(Subject.java:1387)
at javax.security.auth.Subject$ClassSet.<init>(Subject.java:1350)
at javax.security.auth.Subject.getPublicCredentials(Subject.java:704)
at org.apache.hadoop.security.UserGroupInformation.getTokenIdentifiers(UserGroupInformation.java:1439)
at org.apache.hadoop.yarn.server.utils.YarnServerSecurityUtils.selectAMRMTokenIdentifier(YarnServerSecurityUtils.java:104)
at org.apache.hadoop.yarn.server.utils.YarnServerSecurityUtils.authorizeRequest(YarnServerSecurityUtils.java:76)
at org.apache.hadoop.yarn.server.resourcemanager.ApplicationMasterService.registerApplicationMaster(ApplicationMasterService.java:181)
at org.apache.hadoop.yarn.server.resourcemanager.MockAM$1.run(MockAM.java:134)
at org.apache.hadoop.yarn.server.resourcemanager.MockAM$1.run(MockAM.java:131)
at java.security.AccessController.doPrivileged(Native Method)
at javax.security.auth.Subject.doAs(Subject.java:415)
at org.apache.hadoop.security.UserGroupInformation.doAs(UserGroupInformation.java:1669)
at org.apache.hadoop.yarn.server.resourcemanager.MockAM.registerAppAttempt(MockAM.java:129)
at org.apache.hadoop.yarn.server.resourcemanager.MockAM.registerAppAttempt(MockAM.java:106)
at org.apache.hadoop.yarn.server.resourcemanager.scheduler.capacity.TestApplicationPriority.testApplicationPriorityAllocation(TestApplicationPriority.java:165)
FAILED: org.apache.hadoop.yarn.server.resourcemanager.scheduler.capacity.TestApplicationPriority.testApplicationPriorityAllocationWithChangeInPriority
Error Message:
null
Stack Trace:
java.lang.NullPointerException: null
at javax.security.auth.Subject$ClassSet.populateSet(Subject.java:1387)
at javax.security.auth.Subject$ClassSet.<init>(Subject.java:1350)
at javax.security.auth.Subject.getPublicCredentials(Subject.java:704)
at org.apache.hadoop.security.UserGroupInformation.getTokenIdentifiers(UserGroupInformation.java:1439)
at org.apache.hadoop.yarn.server.utils.YarnServerSecurityUtils.selectAMRMTokenIdentifier(YarnServerSecurityUtils.java:104)
at org.apache.hadoop.yarn.server.utils.YarnServerSecurityUtils.authorizeRequest(YarnServerSecurityUtils.java:76)
at org.apache.hadoop.yarn.server.resourcemanager.ApplicationMasterService.registerApplicationMaster(ApplicationMasterService.java:181)
at org.apache.hadoop.yarn.server.resourcemanager.MockAM$1.run(MockAM.java:134)
at org.apache.hadoop.yarn.server.resourcemanager.MockAM$1.run(MockAM.java:131)
at java.security.AccessController.doPrivileged(Native Method)
at javax.security.auth.Subject.doAs(Subject.java:415)
at org.apache.hadoop.security.UserGroupInformation.doAs(UserGroupInformation.java:1669)
at org.apache.hadoop.yarn.server.resourcemanager.MockAM.registerAppAttempt(MockAM.java:129)
at org.apache.hadoop.yarn.server.resourcemanager.MockAM.registerAppAttempt(MockAM.java:106)
at org.apache.hadoop.yarn.server.resourcemanager.scheduler.capacity.TestApplicationPriority.testApplicationPriorityAllocationWithChangeInPriority(TestApplicationPriority.java:470)
FAILED: org.apache.hadoop.yarn.server.resourcemanager.scheduler.capacity.TestApplicationPriority.testPriorityWithPendingApplications
Error Message:
null
Stack Trace:
java.lang.NullPointerException: null
at javax.security.auth.Subject$ClassSet.populateSet(Subject.java:1387)
at javax.security.auth.Subject$ClassSet.<init>(Subject.java:1350)
at javax.security.auth.Subject.getPublicCredentials(Subject.java:704)
at org.apache.hadoop.security.UserGroupInformation.getTokenIdentifiers(UserGroupInformation.java:1439)
at org.apache.hadoop.yarn.server.utils.YarnServerSecurityUtils.selectAMRMTokenIdentifier(YarnServerSecurityUtils.java:104)
at org.apache.hadoop.yarn.server.utils.YarnServerSecurityUtils.authorizeRequest(YarnServerSecurityUtils.java:76)
at org.apache.hadoop.yarn.server.resourcemanager.ApplicationMasterService.registerApplicationMaster(ApplicationMasterService.java:181)
at org.apache.hadoop.yarn.server.resourcemanager.MockAM$1.run(MockAM.java:134)
at org.apache.hadoop.yarn.server.resourcemanager.MockAM$1.run(MockAM.java:131)
at java.security.AccessController.doPrivileged(Native Method)
at javax.security.auth.Subject.doAs(Subject.java:415)
at org.apache.hadoop.security.UserGroupInformation.doAs(UserGroupInformation.java:1669)
at org.apache.hadoop.yarn.server.resourcemanager.MockAM.registerAppAttempt(MockAM.java:129)
at org.apache.hadoop.yarn.server.resourcemanager.MockAM.registerAppAttempt(MockAM.java:106)
at org.apache.hadoop.yarn.server.resourcemanager.scheduler.capacity.TestApplicationPriority.testPriorityWithPendingApplications(TestApplicationPriority.java:250)
FAILED: org.apache.hadoop.yarn.server.resourcemanager.scheduler.capacity.TestApplicationPriority.testUpdatePriorityAtRuntime
Error Message:
null
Stack Trace:
java.lang.NullPointerException: null
at javax.security.auth.Subject$ClassSet.populateSet(Subject.java:1387)
at javax.security.auth.Subject$ClassSet.<init>(Subject.java:1350)
at javax.security.auth.Subject.getPublicCredentials(Subject.java:704)
at org.apache.hadoop.security.UserGroupInformation.getTokenIdentifiers(UserGroupInformation.java:1439)
at org.apache.hadoop.yarn.server.utils.YarnServerSecurityUtils.selectAMRMTokenIdentifier(YarnServerSecurityUtils.java:104)
at org.apache.hadoop.yarn.server.utils.YarnServerSecurityUtils.authorizeRequest(YarnServerSecurityUtils.java:76)
at org.apache.hadoop.yarn.server.resourcemanager.ApplicationMasterService.registerApplicationMaster(ApplicationMasterService.java:181)
at org.apache.hadoop.yarn.server.resourcemanager.MockAM$1.run(MockAM.java:134)
at org.apache.hadoop.yarn.server.resourcemanager.MockAM$1.run(MockAM.java:131)
at java.security.AccessController.doPrivileged(Native Method)
at javax.security.auth.Subject.doAs(Subject.java:415)
at org.apache.hadoop.security.UserGroupInformation.doAs(UserGroupInformation.java:1669)
at org.apache.hadoop.yarn.server.resourcemanager.MockAM.registerAppAttempt(MockAM.java:129)
at org.apache.hadoop.yarn.server.resourcemanager.MockAM.registerAppAttempt(MockAM.java:106)
at org.apache.hadoop.yarn.server.resourcemanager.scheduler.capacity.TestApplicationPriority.testUpdatePriorityAtRuntime(TestApplicationPriority.java:333)
FAILED: org.apache.hadoop.yarn.server.resourcemanager.scheduler.capacity.TestCapacityScheduler.testHeadRoomCalculationWithDRC
Error Message:
expected:<6144> but was:<16384>
Stack Trace:
java.lang.AssertionError: expected:<6144> but was:<16384>
at org.junit.Assert.fail(Assert.java:88)
at org.junit.Assert.failNotEquals(Assert.java:743)
at org.junit.Assert.assertEquals(Assert.java:118)
at org.junit.Assert.assertEquals(Assert.java:555)
at org.junit.Assert.assertEquals(Assert.java:542)
at org.apache.hadoop.yarn.server.resourcemanager.scheduler.capacity.TestCapacityScheduler.testHeadRoomCalculationWithDRC(TestCapacityScheduler.java:3031)