You are viewing a plain text version of this content. The canonical link for it is here.
Posted to builds@solr.apache.org by Apache Jenkins Server <je...@builds.apache.org> on 2022/02/02 22:07:30 UTC

[JENKINS] Solr » Solr-Check-main - Build # 2779 - Still Unstable!

Build: https://ci-builds.apache.org/job/Solr/job/Solr-Check-main/2779/

5 tests failed.
FAILED:  org.apache.solr.handler.designer.TestSchemaDesignerAPI.testBasicUserWorkflow

Error Message:
org.apache.solr.client.solrj.impl.BaseHttpSolrClient$RemoteSolrException: Error from server at https://127.0.0.1:34167/solr: Underlying core creation failed while creating collection: ._designer_testJson

Stack Trace:
org.apache.solr.client.solrj.impl.BaseHttpSolrClient$RemoteSolrException: Error from server at https://127.0.0.1:34167/solr: Underlying core creation failed while creating collection: ._designer_testJson
	at app//org.apache.solr.client.solrj.impl.HttpSolrClient.executeMethod(HttpSolrClient.java:668)
	at app//org.apache.solr.client.solrj.impl.HttpSolrClient.request(HttpSolrClient.java:239)
	at app//org.apache.solr.client.solrj.impl.HttpSolrClient.request(HttpSolrClient.java:222)
	at app//org.apache.solr.client.solrj.impl.LBSolrClient.doRequest(LBSolrClient.java:389)
	at app//org.apache.solr.client.solrj.impl.LBSolrClient.request(LBSolrClient.java:359)
	at app//org.apache.solr.client.solrj.impl.BaseCloudSolrClient.sendRequest(BaseCloudSolrClient.java:1132)
	at app//org.apache.solr.client.solrj.impl.BaseCloudSolrClient.requestWithRetryOnStaleState(BaseCloudSolrClient.java:898)
	at app//org.apache.solr.client.solrj.impl.BaseCloudSolrClient.request(BaseCloudSolrClient.java:832)
	at app//org.apache.solr.client.solrj.SolrRequest.process(SolrRequest.java:226)
	at app//org.apache.solr.client.solrj.SolrRequest.process(SolrRequest.java:243)
	at app//org.apache.solr.handler.designer.SchemaDesignerConfigSetHelper.createCollection(SchemaDesignerConfigSetHelper.java:651)
	at app//org.apache.solr.handler.designer.SchemaDesignerConfigSetHelper.createCollection(SchemaDesignerConfigSetHelper.java:645)
	at app//org.apache.solr.handler.designer.SchemaDesignerConfigSetHelper.reloadTempCollection(SchemaDesignerConfigSetHelper.java:250)
	at app//org.apache.solr.handler.designer.SchemaDesignerConfigSetHelper.updateSchemaObject(SchemaDesignerConfigSetHelper.java:285)
	at app//org.apache.solr.handler.designer.SchemaDesignerAPI.updateSchemaObject(SchemaDesignerAPI.java:415)
	at app//org.apache.solr.handler.designer.TestSchemaDesignerAPI.testBasicUserWorkflow(TestSchemaDesignerAPI.java:605)
	at java.base@11.0.12/jdk.internal.reflect.NativeMethodAccessorImpl.invoke0(Native Method)
	at java.base@11.0.12/jdk.internal.reflect.NativeMethodAccessorImpl.invoke(NativeMethodAccessorImpl.java:62)
	at java.base@11.0.12/jdk.internal.reflect.DelegatingMethodAccessorImpl.invoke(DelegatingMethodAccessorImpl.java:43)
	at java.base@11.0.12/java.lang.reflect.Method.invoke(Method.java:566)
	at app//com.carrotsearch.randomizedtesting.RandomizedRunner.invoke(RandomizedRunner.java:1754)
	at app//com.carrotsearch.randomizedtesting.RandomizedRunner$8.evaluate(RandomizedRunner.java:942)
	at app//com.carrotsearch.randomizedtesting.RandomizedRunner$9.evaluate(RandomizedRunner.java:978)
	at app//com.carrotsearch.randomizedtesting.RandomizedRunner$10.evaluate(RandomizedRunner.java:992)
	at app//com.carrotsearch.randomizedtesting.rules.SystemPropertiesRestoreRule$1.evaluate(SystemPropertiesRestoreRule.java:57)
	at app//org.junit.rules.RunRules.evaluate(RunRules.java:20)
	at app//org.apache.lucene.util.TestRuleSetupTeardownChained$1.evaluate(TestRuleSetupTeardownChained.java:44)
	at app//org.apache.lucene.util.AbstractBeforeAfterRule$1.evaluate(AbstractBeforeAfterRule.java:43)
	at app//org.apache.lucene.util.TestRuleThreadAndTestName$1.evaluate(TestRuleThreadAndTestName.java:45)
	at app//org.apache.lucene.util.TestRuleIgnoreAfterMaxFailures$1.evaluate(TestRuleIgnoreAfterMaxFailures.java:60)
	at app//org.apache.lucene.util.TestRuleMarkFailure$1.evaluate(TestRuleMarkFailure.java:44)
	at app//org.junit.rules.RunRules.evaluate(RunRules.java:20)
	at app//com.carrotsearch.randomizedtesting.rules.StatementAdapter.evaluate(StatementAdapter.java:36)
	at app//com.carrotsearch.randomizedtesting.ThreadLeakControl$StatementRunner.run(ThreadLeakControl.java:370)
	at app//com.carrotsearch.randomizedtesting.ThreadLeakControl.forkTimeoutingTask(ThreadLeakControl.java:819)
	at app//com.carrotsearch.randomizedtesting.ThreadLeakControl$3.evaluate(ThreadLeakControl.java:470)
	at app//com.carrotsearch.randomizedtesting.RandomizedRunner.runSingleTest(RandomizedRunner.java:951)
	at app//com.carrotsearch.randomizedtesting.RandomizedRunner$5.evaluate(RandomizedRunner.java:836)
	at app//com.carrotsearch.randomizedtesting.RandomizedRunner$6.evaluate(RandomizedRunner.java:887)
	at app//com.carrotsearch.randomizedtesting.RandomizedRunner$7.evaluate(RandomizedRunner.java:898)
	at app//com.carrotsearch.randomizedtesting.rules.StatementAdapter.evaluate(StatementAdapter.java:36)
	at app//org.apache.lucene.util.AbstractBeforeAfterRule$1.evaluate(AbstractBeforeAfterRule.java:43)
	at app//org.apache.lucene.util.AbstractBeforeAfterRule$1.evaluate(AbstractBeforeAfterRule.java:43)
	at app//com.carrotsearch.randomizedtesting.rules.SystemPropertiesRestoreRule$1.evaluate(SystemPropertiesRestoreRule.java:57)
	at app//org.junit.rules.RunRules.evaluate(RunRules.java:20)
	at app//org.apache.lucene.util.AbstractBeforeAfterRule$1.evaluate(AbstractBeforeAfterRule.java:43)
	at app//com.carrotsearch.randomizedtesting.rules.StatementAdapter.evaluate(StatementAdapter.java:36)
	at app//org.apache.lucene.util.TestRuleStoreClassName$1.evaluate(TestRuleStoreClassName.java:38)
	at app//com.carrotsearch.randomizedtesting.rules.NoShadowingOrOverridesOnMethodsRule$1.evaluate(NoShadowingOrOverridesOnMethodsRule.java:40)
	at app//com.carrotsearch.randomizedtesting.rules.NoShadowingOrOverridesOnMethodsRule$1.evaluate(NoShadowingOrOverridesOnMethodsRule.java:40)
	at app//com.carrotsearch.randomizedtesting.rules.StatementAdapter.evaluate(StatementAdapter.java:36)
	at app//com.carrotsearch.randomizedtesting.rules.StatementAdapter.evaluate(StatementAdapter.java:36)
	at app//org.apache.lucene.util.TestRuleAssertionsRequired$1.evaluate(TestRuleAssertionsRequired.java:53)
	at app//org.apache.lucene.util.AbstractBeforeAfterRule$1.evaluate(AbstractBeforeAfterRule.java:43)
	at app//org.apache.lucene.util.TestRuleMarkFailure$1.evaluate(TestRuleMarkFailure.java:44)
	at app//org.apache.lucene.util.TestRuleIgnoreAfterMaxFailures$1.evaluate(TestRuleIgnoreAfterMaxFailures.java:60)
	at app//org.apache.lucene.util.TestRuleIgnoreTestSuites$1.evaluate(TestRuleIgnoreTestSuites.java:47)
	at app//org.junit.rules.RunRules.evaluate(RunRules.java:20)
	at app//com.carrotsearch.randomizedtesting.rules.StatementAdapter.evaluate(StatementAdapter.java:36)
	at app//com.carrotsearch.randomizedtesting.ThreadLeakControl$StatementRunner.run(ThreadLeakControl.java:370)
	at app//com.carrotsearch.randomizedtesting.ThreadLeakControl.lambda$forkTimeoutingTask$0(ThreadLeakControl.java:826)
	at java.base@11.0.12/java.lang.Thread.run(Thread.java:834)


FAILED:  org.apache.solr.schema.PreAnalyzedFieldManagedSchemaCloudTest.classMethod

Error Message:
com.carrotsearch.randomizedtesting.ResourceDisposalError: Resource in scope SUITE failed to close. Resource was registered from thread Thread[id=23156, name=qtp200443060-23156, state=RUNNABLE, group=TGRP-PreAnalyzedFieldManagedSchemaCloudTest], registration stack trace below.

Stack Trace:
com.carrotsearch.randomizedtesting.ResourceDisposalError: Resource in scope SUITE failed to close. Resource was registered from thread Thread[id=23156, name=qtp200443060-23156, state=RUNNABLE, group=TGRP-PreAnalyzedFieldManagedSchemaCloudTest], registration stack trace below.
	at java.base@11.0.12/java.lang.Thread.getStackTrace(Thread.java:1606)
	at app//com.carrotsearch.randomizedtesting.RandomizedContext.closeAtEnd(RandomizedContext.java:157)
	at app//org.apache.lucene.util.LuceneTestCase.closeAfterSuite(LuceneTestCase.java:798)
	at app//org.apache.lucene.util.LuceneTestCase.wrapDirectory(LuceneTestCase.java:1504)
	at app//org.apache.lucene.util.LuceneTestCase.newDirectory(LuceneTestCase.java:1368)
	at app//org.apache.lucene.util.LuceneTestCase.newDirectory(LuceneTestCase.java:1350)
	at app//org.apache.solr.core.MockDirectoryFactory.create(MockDirectoryFactory.java:49)
	at app//org.apache.solr.core.CachingDirectoryFactory.get(CachingDirectoryFactory.java:360)
	at app//org.apache.solr.core.SolrCore.initSnapshotMetaDataManager(SolrCore.java:582)
	at app//org.apache.solr.core.SolrCore.<init>(SolrCore.java:1026)
	at app//org.apache.solr.core.SolrCore.<init>(SolrCore.java:961)
	at app//org.apache.solr.core.CoreContainer.createFromDescriptor(CoreContainer.java:1429)
	at app//org.apache.solr.core.CoreContainer.create(CoreContainer.java:1303)
	at app//org.apache.solr.handler.admin.CoreAdminOperation.lambda$static$0(CoreAdminOperation.java:91)
	at app//org.apache.solr.handler.admin.CoreAdminOperation.execute(CoreAdminOperation.java:345)
	at app//org.apache.solr.handler.admin.CoreAdminHandler$CallInfo.call(CoreAdminHandler.java:423)
	at app//org.apache.solr.handler.admin.CoreAdminHandler.handleRequestBody(CoreAdminHandler.java:197)
	at app//org.apache.solr.handler.RequestHandlerBase.handleRequest(RequestHandlerBase.java:214)
	at app//org.apache.solr.servlet.HttpSolrCall.handleAdmin(HttpSolrCall.java:866)
	at app//org.apache.solr.servlet.HttpSolrCall.handleAdminRequest(HttpSolrCall.java:830)
	at app//org.apache.solr.servlet.HttpSolrCall.call(HttpSolrCall.java:542)
	at app//org.apache.solr.servlet.SolrDispatchFilter.dispatch(SolrDispatchFilter.java:218)
	at app//org.apache.solr.servlet.SolrDispatchFilter.lambda$doFilter$0(SolrDispatchFilter.java:189)
	at app//org.apache.solr.servlet.ServletUtils.traceHttpRequestExecution2(ServletUtils.java:232)
	at app//org.apache.solr.servlet.ServletUtils.rateLimitRequest(ServletUtils.java:208)
	at app//org.apache.solr.servlet.SolrDispatchFilter.doFilter(SolrDispatchFilter.java:187)
	at app//org.apache.solr.servlet.SolrDispatchFilter.doFilter(SolrDispatchFilter.java:171)
	at app//org.eclipse.jetty.servlet.FilterHolder.doFilter(FilterHolder.java:193)
	at app//org.eclipse.jetty.servlet.ServletHandler$Chain.doFilter(ServletHandler.java:1601)
	at app//org.apache.solr.client.solrj.embedded.JettySolrRunner$DebugFilter.doFilter(JettySolrRunner.java:189)
	at app//org.eclipse.jetty.servlet.FilterHolder.doFilter(FilterHolder.java:193)
	at app//org.eclipse.jetty.servlet.ServletHandler$Chain.doFilter(ServletHandler.java:1601)
	at app//org.eclipse.jetty.servlet.ServletHandler.doHandle(ServletHandler.java:548)
	at app//org.eclipse.jetty.server.handler.ScopedHandler.nextHandle(ScopedHandler.java:233)
	at app//org.eclipse.jetty.server.session.SessionHandler.doHandle(SessionHandler.java:1624)
	at app//org.eclipse.jetty.server.handler.ScopedHandler.nextHandle(ScopedHandler.java:233)
	at app//org.eclipse.jetty.server.handler.ContextHandler.doHandle(ContextHandler.java:1434)
	at app//org.eclipse.jetty.server.handler.ScopedHandler.nextScope(ScopedHandler.java:188)
	at app//org.eclipse.jetty.servlet.ServletHandler.doScope(ServletHandler.java:501)
	at app//org.eclipse.jetty.server.session.SessionHandler.doScope(SessionHandler.java:1594)
	at app//org.eclipse.jetty.server.handler.ScopedHandler.nextScope(ScopedHandler.java:186)
	at app//org.eclipse.jetty.server.handler.ContextHandler.doScope(ContextHandler.java:1349)
	at app//org.eclipse.jetty.server.handler.ScopedHandler.handle(ScopedHandler.java:141)
	at app//org.eclipse.jetty.server.handler.HandlerWrapper.handle(HandlerWrapper.java:127)
	at app//org.eclipse.jetty.rewrite.handler.RewriteHandler.handle(RewriteHandler.java:322)
	at app//org.eclipse.jetty.server.handler.gzip.GzipHandler.handle(GzipHandler.java:713)
	at app//org.eclipse.jetty.server.handler.HandlerWrapper.handle(HandlerWrapper.java:127)
	at app//org.eclipse.jetty.server.Server.handle(Server.java:516)
	at app//org.eclipse.jetty.server.HttpChannel.lambda$handle$1(HttpChannel.java:400)
	at app//org.eclipse.jetty.server.HttpChannel.dispatch(HttpChannel.java:645)
	at app//org.eclipse.jetty.server.HttpChannel.handle(HttpChannel.java:392)
	at app//org.eclipse.jetty.server.HttpChannel.run(HttpChannel.java:352)
	at app//org.eclipse.jetty.util.thread.QueuedThreadPool.runJob(QueuedThreadPool.java:883)
	at app//org.eclipse.jetty.util.thread.QueuedThreadPool$Runner.run(QueuedThreadPool.java:1034)
	at java.base@11.0.12/java.lang.Thread.run(Thread.java:834)
Caused by: java.lang.AssertionError: Directory not closed: MockDirectoryWrapper(ByteBuffersDirectory@45b724cd lockFactory=org.apache.lucene.store.SingleInstanceLockFactory@75a40409)
	at org.junit.Assert.fail(Assert.java:89)
	at org.apache.lucene.util.CloseableDirectory.close(CloseableDirectory.java:43)
	at com.carrotsearch.randomizedtesting.RandomizedRunner$4$1.apply(RandomizedRunner.java:788)
	at com.carrotsearch.randomizedtesting.RandomizedRunner$4$1.apply(RandomizedRunner.java:785)
	at com.carrotsearch.randomizedtesting.RandomizedContext.closeResources(RandomizedContext.java:225)
	at com.carrotsearch.randomizedtesting.RandomizedRunner$4.afterAlways(RandomizedRunner.java:801)
	at com.carrotsearch.randomizedtesting.rules.StatementAdapter.evaluate(StatementAdapter.java:43)
	at com.carrotsearch.randomizedtesting.ThreadLeakControl$StatementRunner.run(ThreadLeakControl.java:370)
	at com.carrotsearch.randomizedtesting.ThreadLeakControl.lambda$forkTimeoutingTask$0(ThreadLeakControl.java:826)
	... 1 more


FAILED:  org.apache.solr.schema.PreAnalyzedFieldManagedSchemaCloudTest.classMethod

Error Message:
com.carrotsearch.randomizedtesting.ResourceDisposalError: Resource in scope SUITE failed to close. Resource was registered from thread Thread[id=23156, name=qtp200443060-23156, state=RUNNABLE, group=TGRP-PreAnalyzedFieldManagedSchemaCloudTest], registration stack trace below.

Stack Trace:
com.carrotsearch.randomizedtesting.ResourceDisposalError: Resource in scope SUITE failed to close. Resource was registered from thread Thread[id=23156, name=qtp200443060-23156, state=RUNNABLE, group=TGRP-PreAnalyzedFieldManagedSchemaCloudTest], registration stack trace below.
	at java.base@11.0.12/java.lang.Thread.getStackTrace(Thread.java:1606)
	at app//com.carrotsearch.randomizedtesting.RandomizedContext.closeAtEnd(RandomizedContext.java:157)
	at app//org.apache.lucene.util.LuceneTestCase.closeAfterSuite(LuceneTestCase.java:798)
	at app//org.apache.lucene.util.LuceneTestCase.wrapDirectory(LuceneTestCase.java:1504)
	at app//org.apache.lucene.util.LuceneTestCase.newDirectory(LuceneTestCase.java:1368)
	at app//org.apache.lucene.util.LuceneTestCase.newDirectory(LuceneTestCase.java:1350)
	at app//org.apache.solr.core.MockDirectoryFactory.create(MockDirectoryFactory.java:49)
	at app//org.apache.solr.core.CachingDirectoryFactory.get(CachingDirectoryFactory.java:360)
	at app//org.apache.solr.core.SolrCore.getNewIndexDir(SolrCore.java:404)
	at app//org.apache.solr.core.SolrCore.initIndex(SolrCore.java:817)
	at app//org.apache.solr.core.SolrCore.<init>(SolrCore.java:1030)
	at app//org.apache.solr.core.SolrCore.<init>(SolrCore.java:961)
	at app//org.apache.solr.core.CoreContainer.createFromDescriptor(CoreContainer.java:1429)
	at app//org.apache.solr.core.CoreContainer.create(CoreContainer.java:1303)
	at app//org.apache.solr.handler.admin.CoreAdminOperation.lambda$static$0(CoreAdminOperation.java:91)
	at app//org.apache.solr.handler.admin.CoreAdminOperation.execute(CoreAdminOperation.java:345)
	at app//org.apache.solr.handler.admin.CoreAdminHandler$CallInfo.call(CoreAdminHandler.java:423)
	at app//org.apache.solr.handler.admin.CoreAdminHandler.handleRequestBody(CoreAdminHandler.java:197)
	at app//org.apache.solr.handler.RequestHandlerBase.handleRequest(RequestHandlerBase.java:214)
	at app//org.apache.solr.servlet.HttpSolrCall.handleAdmin(HttpSolrCall.java:866)
	at app//org.apache.solr.servlet.HttpSolrCall.handleAdminRequest(HttpSolrCall.java:830)
	at app//org.apache.solr.servlet.HttpSolrCall.call(HttpSolrCall.java:542)
	at app//org.apache.solr.servlet.SolrDispatchFilter.dispatch(SolrDispatchFilter.java:218)
	at app//org.apache.solr.servlet.SolrDispatchFilter.lambda$doFilter$0(SolrDispatchFilter.java:189)
	at app//org.apache.solr.servlet.ServletUtils.traceHttpRequestExecution2(ServletUtils.java:232)
	at app//org.apache.solr.servlet.ServletUtils.rateLimitRequest(ServletUtils.java:208)
	at app//org.apache.solr.servlet.SolrDispatchFilter.doFilter(SolrDispatchFilter.java:187)
	at app//org.apache.solr.servlet.SolrDispatchFilter.doFilter(SolrDispatchFilter.java:171)
	at app//org.eclipse.jetty.servlet.FilterHolder.doFilter(FilterHolder.java:193)
	at app//org.eclipse.jetty.servlet.ServletHandler$Chain.doFilter(ServletHandler.java:1601)
	at app//org.apache.solr.client.solrj.embedded.JettySolrRunner$DebugFilter.doFilter(JettySolrRunner.java:189)
	at app//org.eclipse.jetty.servlet.FilterHolder.doFilter(FilterHolder.java:193)
	at app//org.eclipse.jetty.servlet.ServletHandler$Chain.doFilter(ServletHandler.java:1601)
	at app//org.eclipse.jetty.servlet.ServletHandler.doHandle(ServletHandler.java:548)
	at app//org.eclipse.jetty.server.handler.ScopedHandler.nextHandle(ScopedHandler.java:233)
	at app//org.eclipse.jetty.server.session.SessionHandler.doHandle(SessionHandler.java:1624)
	at app//org.eclipse.jetty.server.handler.ScopedHandler.nextHandle(ScopedHandler.java:233)
	at app//org.eclipse.jetty.server.handler.ContextHandler.doHandle(ContextHandler.java:1434)
	at app//org.eclipse.jetty.server.handler.ScopedHandler.nextScope(ScopedHandler.java:188)
	at app//org.eclipse.jetty.servlet.ServletHandler.doScope(ServletHandler.java:501)
	at app//org.eclipse.jetty.server.session.SessionHandler.doScope(SessionHandler.java:1594)
	at app//org.eclipse.jetty.server.handler.ScopedHandler.nextScope(ScopedHandler.java:186)
	at app//org.eclipse.jetty.server.handler.ContextHandler.doScope(ContextHandler.java:1349)
	at app//org.eclipse.jetty.server.handler.ScopedHandler.handle(ScopedHandler.java:141)
	at app//org.eclipse.jetty.server.handler.HandlerWrapper.handle(HandlerWrapper.java:127)
	at app//org.eclipse.jetty.rewrite.handler.RewriteHandler.handle(RewriteHandler.java:322)
	at app//org.eclipse.jetty.server.handler.gzip.GzipHandler.handle(GzipHandler.java:713)
	at app//org.eclipse.jetty.server.handler.HandlerWrapper.handle(HandlerWrapper.java:127)
	at app//org.eclipse.jetty.server.Server.handle(Server.java:516)
	at app//org.eclipse.jetty.server.HttpChannel.lambda$handle$1(HttpChannel.java:400)
	at app//org.eclipse.jetty.server.HttpChannel.dispatch(HttpChannel.java:645)
	at app//org.eclipse.jetty.server.HttpChannel.handle(HttpChannel.java:392)
	at app//org.eclipse.jetty.server.HttpChannel.run(HttpChannel.java:352)
	at app//org.eclipse.jetty.util.thread.QueuedThreadPool.runJob(QueuedThreadPool.java:883)
	at app//org.eclipse.jetty.util.thread.QueuedThreadPool$Runner.run(QueuedThreadPool.java:1034)
	at java.base@11.0.12/java.lang.Thread.run(Thread.java:834)
Caused by: java.lang.AssertionError: Directory not closed: MockDirectoryWrapper(NRTCachingDirectory(ByteBuffersDirectory@26a5cf9f lockFactory=org.apache.lucene.store.SingleInstanceLockFactory@3464fb67; maxCacheMB=0.3818359375 maxMergeSizeMB=0.7216796875))
	at org.junit.Assert.fail(Assert.java:89)
	at org.apache.lucene.util.CloseableDirectory.close(CloseableDirectory.java:43)
	at com.carrotsearch.randomizedtesting.RandomizedRunner$4$1.apply(RandomizedRunner.java:788)
	at com.carrotsearch.randomizedtesting.RandomizedRunner$4$1.apply(RandomizedRunner.java:785)
	at com.carrotsearch.randomizedtesting.RandomizedContext.closeResources(RandomizedContext.java:225)
	at com.carrotsearch.randomizedtesting.RandomizedRunner$4.afterAlways(RandomizedRunner.java:801)
	at com.carrotsearch.randomizedtesting.rules.StatementAdapter.evaluate(StatementAdapter.java:43)
	at com.carrotsearch.randomizedtesting.ThreadLeakControl$StatementRunner.run(ThreadLeakControl.java:370)
	at com.carrotsearch.randomizedtesting.ThreadLeakControl.lambda$forkTimeoutingTask$0(ThreadLeakControl.java:826)
	... 1 more


FAILED:  org.apache.solr.schema.PreAnalyzedFieldManagedSchemaCloudTest.classMethod

Error Message:
com.carrotsearch.randomizedtesting.ResourceDisposalError: Resource in scope SUITE failed to close. Resource was registered from thread Thread[id=23156, name=qtp200443060-23156, state=RUNNABLE, group=TGRP-PreAnalyzedFieldManagedSchemaCloudTest], registration stack trace below.

Stack Trace:
com.carrotsearch.randomizedtesting.ResourceDisposalError: Resource in scope SUITE failed to close. Resource was registered from thread Thread[id=23156, name=qtp200443060-23156, state=RUNNABLE, group=TGRP-PreAnalyzedFieldManagedSchemaCloudTest], registration stack trace below.
	at java.base@11.0.12/java.lang.Thread.getStackTrace(Thread.java:1606)
	at app//com.carrotsearch.randomizedtesting.RandomizedContext.closeAtEnd(RandomizedContext.java:157)
	at app//org.apache.lucene.util.LuceneTestCase.closeAfterSuite(LuceneTestCase.java:798)
	at app//org.apache.lucene.util.LuceneTestCase.wrapDirectory(LuceneTestCase.java:1504)
	at app//org.apache.lucene.util.LuceneTestCase.newDirectory(LuceneTestCase.java:1368)
	at app//org.apache.lucene.util.LuceneTestCase.newDirectory(LuceneTestCase.java:1350)
	at app//org.apache.solr.core.MockDirectoryFactory.create(MockDirectoryFactory.java:49)
	at app//org.apache.solr.core.CachingDirectoryFactory.get(CachingDirectoryFactory.java:360)
	at app//org.apache.solr.update.SolrIndexWriter.create(SolrIndexWriter.java:98)
	at app//org.apache.solr.core.SolrCore.initIndex(SolrCore.java:849)
	at app//org.apache.solr.core.SolrCore.<init>(SolrCore.java:1030)
	at app//org.apache.solr.core.SolrCore.<init>(SolrCore.java:961)
	at app//org.apache.solr.core.CoreContainer.createFromDescriptor(CoreContainer.java:1429)
	at app//org.apache.solr.core.CoreContainer.create(CoreContainer.java:1303)
	at app//org.apache.solr.handler.admin.CoreAdminOperation.lambda$static$0(CoreAdminOperation.java:91)
	at app//org.apache.solr.handler.admin.CoreAdminOperation.execute(CoreAdminOperation.java:345)
	at app//org.apache.solr.handler.admin.CoreAdminHandler$CallInfo.call(CoreAdminHandler.java:423)
	at app//org.apache.solr.handler.admin.CoreAdminHandler.handleRequestBody(CoreAdminHandler.java:197)
	at app//org.apache.solr.handler.RequestHandlerBase.handleRequest(RequestHandlerBase.java:214)
	at app//org.apache.solr.servlet.HttpSolrCall.handleAdmin(HttpSolrCall.java:866)
	at app//org.apache.solr.servlet.HttpSolrCall.handleAdminRequest(HttpSolrCall.java:830)
	at app//org.apache.solr.servlet.HttpSolrCall.call(HttpSolrCall.java:542)
	at app//org.apache.solr.servlet.SolrDispatchFilter.dispatch(SolrDispatchFilter.java:218)
	at app//org.apache.solr.servlet.SolrDispatchFilter.lambda$doFilter$0(SolrDispatchFilter.java:189)
	at app//org.apache.solr.servlet.ServletUtils.traceHttpRequestExecution2(ServletUtils.java:232)
	at app//org.apache.solr.servlet.ServletUtils.rateLimitRequest(ServletUtils.java:208)
	at app//org.apache.solr.servlet.SolrDispatchFilter.doFilter(SolrDispatchFilter.java:187)
	at app//org.apache.solr.servlet.SolrDispatchFilter.doFilter(SolrDispatchFilter.java:171)
	at app//org.eclipse.jetty.servlet.FilterHolder.doFilter(FilterHolder.java:193)
	at app//org.eclipse.jetty.servlet.ServletHandler$Chain.doFilter(ServletHandler.java:1601)
	at app//org.apache.solr.client.solrj.embedded.JettySolrRunner$DebugFilter.doFilter(JettySolrRunner.java:189)
	at app//org.eclipse.jetty.servlet.FilterHolder.doFilter(FilterHolder.java:193)
	at app//org.eclipse.jetty.servlet.ServletHandler$Chain.doFilter(ServletHandler.java:1601)
	at app//org.eclipse.jetty.servlet.ServletHandler.doHandle(ServletHandler.java:548)
	at app//org.eclipse.jetty.server.handler.ScopedHandler.nextHandle(ScopedHandler.java:233)
	at app//org.eclipse.jetty.server.session.SessionHandler.doHandle(SessionHandler.java:1624)
	at app//org.eclipse.jetty.server.handler.ScopedHandler.nextHandle(ScopedHandler.java:233)
	at app//org.eclipse.jetty.server.handler.ContextHandler.doHandle(ContextHandler.java:1434)
	at app//org.eclipse.jetty.server.handler.ScopedHandler.nextScope(ScopedHandler.java:188)
	at app//org.eclipse.jetty.servlet.ServletHandler.doScope(ServletHandler.java:501)
	at app//org.eclipse.jetty.server.session.SessionHandler.doScope(SessionHandler.java:1594)
	at app//org.eclipse.jetty.server.handler.ScopedHandler.nextScope(ScopedHandler.java:186)
	at app//org.eclipse.jetty.server.handler.ContextHandler.doScope(ContextHandler.java:1349)
	at app//org.eclipse.jetty.server.handler.ScopedHandler.handle(ScopedHandler.java:141)
	at app//org.eclipse.jetty.server.handler.HandlerWrapper.handle(HandlerWrapper.java:127)
	at app//org.eclipse.jetty.rewrite.handler.RewriteHandler.handle(RewriteHandler.java:322)
	at app//org.eclipse.jetty.server.handler.gzip.GzipHandler.handle(GzipHandler.java:713)
	at app//org.eclipse.jetty.server.handler.HandlerWrapper.handle(HandlerWrapper.java:127)
	at app//org.eclipse.jetty.server.Server.handle(Server.java:516)
	at app//org.eclipse.jetty.server.HttpChannel.lambda$handle$1(HttpChannel.java:400)
	at app//org.eclipse.jetty.server.HttpChannel.dispatch(HttpChannel.java:645)
	at app//org.eclipse.jetty.server.HttpChannel.handle(HttpChannel.java:392)
	at app//org.eclipse.jetty.server.HttpChannel.run(HttpChannel.java:352)
	at app//org.eclipse.jetty.util.thread.QueuedThreadPool.runJob(QueuedThreadPool.java:883)
	at app//org.eclipse.jetty.util.thread.QueuedThreadPool$Runner.run(QueuedThreadPool.java:1034)
	at java.base@11.0.12/java.lang.Thread.run(Thread.java:834)
Caused by: java.lang.AssertionError: Directory not closed: MockDirectoryWrapper(ByteBuffersDirectory@2e123f70 lockFactory=org.apache.lucene.store.SingleInstanceLockFactory@19a7b653)
	at org.junit.Assert.fail(Assert.java:89)
	at org.apache.lucene.util.CloseableDirectory.close(CloseableDirectory.java:43)
	at com.carrotsearch.randomizedtesting.RandomizedRunner$4$1.apply(RandomizedRunner.java:788)
	at com.carrotsearch.randomizedtesting.RandomizedRunner$4$1.apply(RandomizedRunner.java:785)
	at com.carrotsearch.randomizedtesting.RandomizedContext.closeResources(RandomizedContext.java:225)
	at com.carrotsearch.randomizedtesting.RandomizedRunner$4.afterAlways(RandomizedRunner.java:801)
	at com.carrotsearch.randomizedtesting.rules.StatementAdapter.evaluate(StatementAdapter.java:43)
	at com.carrotsearch.randomizedtesting.ThreadLeakControl$StatementRunner.run(ThreadLeakControl.java:370)
	at com.carrotsearch.randomizedtesting.ThreadLeakControl.lambda$forkTimeoutingTask$0(ThreadLeakControl.java:826)
	... 1 more


FAILED:  org.apache.solr.schema.PreAnalyzedFieldManagedSchemaCloudTest.classMethod

Error Message:
com.carrotsearch.randomizedtesting.ThreadLeakError: 2 threads leaked from SUITE scope at org.apache.solr.schema.PreAnalyzedFieldManagedSchemaCloudTest: 
   1) Thread[id=23241, name=searcherExecutor-12925-thread-1-processing-127.0.0.1:33779_solr managed-preanalyzed_shard2_replica_n2 managed-preanalyzed shard2 core_node4, state=WAITING, group=TGRP-PreAnalyzedFieldManagedSchemaCloudTest]
        at java.base@11.0.12/jdk.internal.misc.Unsafe.park(Native Method)
        at java.base@11.0.12/java.util.concurrent.locks.LockSupport.park(LockSupport.java:194)
        at java.base@11.0.12/java.util.concurrent.locks.AbstractQueuedSynchronizer.parkAndCheckInterrupt(AbstractQueuedSynchronizer.java:885)
        at java.base@11.0.12/java.util.concurrent.locks.AbstractQueuedSynchronizer.doAcquireSharedInterruptibly(AbstractQueuedSynchronizer.java:1039)
        at java.base@11.0.12/java.util.concurrent.locks.AbstractQueuedSynchronizer.acquireSharedInterruptibly(AbstractQueuedSynchronizer.java:1345)
        at java.base@11.0.12/java.util.concurrent.CountDownLatch.await(CountDownLatch.java:232)
        at app//org.apache.solr.core.SolrCore.lambda$new$2(SolrCore.java:1048)
        at app//org.apache.solr.core.SolrCore$$Lambda$411/0x0000000100626c40.call(Unknown Source)
        at java.base@11.0.12/java.util.concurrent.FutureTask.run(FutureTask.java:264)
        at app//org.apache.solr.common.util.ExecutorUtil$MDCAwareThreadPoolExecutor.lambda$execute$0(ExecutorUtil.java:235)
        at app//org.apache.solr.common.util.ExecutorUtil$MDCAwareThreadPoolExecutor$$Lambda$274/0x00000001004d1040.run(Unknown Source)
        at java.base@11.0.12/java.util.concurrent.ThreadPoolExecutor.runWorker(ThreadPoolExecutor.java:1128)
        at java.base@11.0.12/java.util.concurrent.ThreadPoolExecutor$Worker.run(ThreadPoolExecutor.java:628)
        at java.base@11.0.12/java.lang.Thread.run(Thread.java:834)
   2) Thread[id=23220, name=ZKEventListenerThread, state=TIMED_WAITING, group=TGRP-PreAnalyzedFieldManagedSchemaCloudTest]
        at java.base@11.0.12/java.lang.Thread.sleep(Native Method)
        at app//org.apache.solr.common.cloud.ZkCmdExecutor.retryDelay(ZkCmdExecutor.java:156)
        at app//org.apache.solr.common.cloud.ZkCmdExecutor.retryOperation(ZkCmdExecutor.java:89)
        at app//org.apache.solr.common.cloud.SolrZkClient.getData(SolrZkClient.java:342)
        at app//org.apache.solr.schema.ZkIndexSchemaReader.updateSchema(ZkIndexSchemaReader.java:168)
        at app//org.apache.solr.schema.ZkIndexSchemaReader.refreshSchemaFromZk(ZkIndexSchemaReader.java:158)
        at app//org.apache.solr.schema.ManagedIndexSchemaFactory.inform(ManagedIndexSchemaFactory.java:482)
        at app//org.apache.solr.core.SolrResourceLoader.inform(SolrResourceLoader.java:687)
        at app//org.apache.solr.core.SolrCore.<init>(SolrCore.java:1061)
        at app//org.apache.solr.core.SolrCore.reload(SolrCore.java:744)
        at app//org.apache.solr.core.CoreContainer.reload(CoreContainer.java:1696)
        at app//org.apache.solr.core.SolrCore.lambda$getConfListener$21(SolrCore.java:3129)
        at app//org.apache.solr.core.SolrCore$$Lambda$991/0x0000000100aa0440.run(Unknown Source)
        at app//org.apache.solr.cloud.ZkController.lambda$fireEventListeners$18(ZkController.java:2491)
        at app//org.apache.solr.cloud.ZkController$$Lambda$1239/0x0000000100ddf440.run(Unknown Source)
        at java.base@11.0.12/java.lang.Thread.run(Thread.java:834)

Stack Trace:
com.carrotsearch.randomizedtesting.ThreadLeakError: 2 threads leaked from SUITE scope at org.apache.solr.schema.PreAnalyzedFieldManagedSchemaCloudTest: 
   1) Thread[id=23241, name=searcherExecutor-12925-thread-1-processing-127.0.0.1:33779_solr managed-preanalyzed_shard2_replica_n2 managed-preanalyzed shard2 core_node4, state=WAITING, group=TGRP-PreAnalyzedFieldManagedSchemaCloudTest]
        at java.base@11.0.12/jdk.internal.misc.Unsafe.park(Native Method)
        at java.base@11.0.12/java.util.concurrent.locks.LockSupport.park(LockSupport.java:194)
        at java.base@11.0.12/java.util.concurrent.locks.AbstractQueuedSynchronizer.parkAndCheckInterrupt(AbstractQueuedSynchronizer.java:885)
        at java.base@11.0.12/java.util.concurrent.locks.AbstractQueuedSynchronizer.doAcquireSharedInterruptibly(AbstractQueuedSynchronizer.java:1039)
        at java.base@11.0.12/java.util.concurrent.locks.AbstractQueuedSynchronizer.acquireSharedInterruptibly(AbstractQueuedSynchronizer.java:1345)
        at java.base@11.0.12/java.util.concurrent.CountDownLatch.await(CountDownLatch.java:232)
        at app//org.apache.solr.core.SolrCore.lambda$new$2(SolrCore.java:1048)
        at app//org.apache.solr.core.SolrCore$$Lambda$411/0x0000000100626c40.call(Unknown Source)
        at java.base@11.0.12/java.util.concurrent.FutureTask.run(FutureTask.java:264)
        at app//org.apache.solr.common.util.ExecutorUtil$MDCAwareThreadPoolExecutor.lambda$execute$0(ExecutorUtil.java:235)
        at app//org.apache.solr.common.util.ExecutorUtil$MDCAwareThreadPoolExecutor$$Lambda$274/0x00000001004d1040.run(Unknown Source)
        at java.base@11.0.12/java.util.concurrent.ThreadPoolExecutor.runWorker(ThreadPoolExecutor.java:1128)
        at java.base@11.0.12/java.util.concurrent.ThreadPoolExecutor$Worker.run(ThreadPoolExecutor.java:628)
        at java.base@11.0.12/java.lang.Thread.run(Thread.java:834)
   2) Thread[id=23220, name=ZKEventListenerThread, state=TIMED_WAITING, group=TGRP-PreAnalyzedFieldManagedSchemaCloudTest]
        at java.base@11.0.12/java.lang.Thread.sleep(Native Method)
        at app//org.apache.solr.common.cloud.ZkCmdExecutor.retryDelay(ZkCmdExecutor.java:156)
        at app//org.apache.solr.common.cloud.ZkCmdExecutor.retryOperation(ZkCmdExecutor.java:89)
        at app//org.apache.solr.common.cloud.SolrZkClient.getData(SolrZkClient.java:342)
        at app//org.apache.solr.schema.ZkIndexSchemaReader.updateSchema(ZkIndexSchemaReader.java:168)
        at app//org.apache.solr.schema.ZkIndexSchemaReader.refreshSchemaFromZk(ZkIndexSchemaReader.java:158)
        at app//org.apache.solr.schema.ManagedIndexSchemaFactory.inform(ManagedIndexSchemaFactory.java:482)
        at app//org.apache.solr.core.SolrResourceLoader.inform(SolrResourceLoader.java:687)
        at app//org.apache.solr.core.SolrCore.<init>(SolrCore.java:1061)
        at app//org.apache.solr.core.SolrCore.reload(SolrCore.java:744)
        at app//org.apache.solr.core.CoreContainer.reload(CoreContainer.java:1696)
        at app//org.apache.solr.core.SolrCore.lambda$getConfListener$21(SolrCore.java:3129)
        at app//org.apache.solr.core.SolrCore$$Lambda$991/0x0000000100aa0440.run(Unknown Source)
        at app//org.apache.solr.cloud.ZkController.lambda$fireEventListeners$18(ZkController.java:2491)
        at app//org.apache.solr.cloud.ZkController$$Lambda$1239/0x0000000100ddf440.run(Unknown Source)
        at java.base@11.0.12/java.lang.Thread.run(Thread.java:834)
	at __randomizedtesting.SeedInfo.seed([E35CB1385114AA79]:0)




Build Log:
[...truncated 8677 lines...]
ERROR: The following test(s) have failed:
  - org.apache.solr.schema.PreAnalyzedFieldManagedSchemaCloudTest.classMethod (:solr:core)
    Test output: /home/jenkins/jenkins-slave/workspace/Solr/Solr-Check-main/solr/core/build/test-results/test/outputs/OUTPUT-org.apache.solr.schema.PreAnalyzedFieldManagedSchemaCloudTest.txt
    Reproduce with: gradlew :solr:core:test --tests "org.apache.solr.schema.PreAnalyzedFieldManagedSchemaCloudTest.classMethod" -Ptests.jvms=4 -Ptests.haltonfailure=false -Ptests.jvmargs=-XX:TieredStopAtLevel=1 -Ptests.seed=E35CB1385114AA79 -Ptests.multiplier=2 -Ptests.badapples=false -Ptests.file.encoding=US-ASCII

  - org.apache.solr.schema.PreAnalyzedFieldManagedSchemaCloudTest.classMethod (:solr:core)
    Test output: /home/jenkins/jenkins-slave/workspace/Solr/Solr-Check-main/solr/core/build/test-results/test/outputs/OUTPUT-org.apache.solr.schema.PreAnalyzedFieldManagedSchemaCloudTest.txt
    Reproduce with: gradlew :solr:core:test --tests "org.apache.solr.schema.PreAnalyzedFieldManagedSchemaCloudTest.classMethod" -Ptests.jvms=4 -Ptests.haltonfailure=false -Ptests.jvmargs=-XX:TieredStopAtLevel=1 -Ptests.seed=E35CB1385114AA79 -Ptests.multiplier=2 -Ptests.badapples=false -Ptests.file.encoding=US-ASCII

  - org.apache.solr.schema.PreAnalyzedFieldManagedSchemaCloudTest.classMethod (:solr:core)
    Test output: /home/jenkins/jenkins-slave/workspace/Solr/Solr-Check-main/solr/core/build/test-results/test/outputs/OUTPUT-org.apache.solr.schema.PreAnalyzedFieldManagedSchemaCloudTest.txt
    Reproduce with: gradlew :solr:core:test --tests "org.apache.solr.schema.PreAnalyzedFieldManagedSchemaCloudTest.classMethod" -Ptests.jvms=4 -Ptests.haltonfailure=false -Ptests.jvmargs=-XX:TieredStopAtLevel=1 -Ptests.seed=E35CB1385114AA79 -Ptests.multiplier=2 -Ptests.badapples=false -Ptests.file.encoding=US-ASCII

  - org.apache.solr.schema.PreAnalyzedFieldManagedSchemaCloudTest.classMethod (:solr:core)
    Test output: /home/jenkins/jenkins-slave/workspace/Solr/Solr-Check-main/solr/core/build/test-results/test/outputs/OUTPUT-org.apache.solr.schema.PreAnalyzedFieldManagedSchemaCloudTest.txt
    Reproduce with: gradlew :solr:core:test --tests "org.apache.solr.schema.PreAnalyzedFieldManagedSchemaCloudTest.classMethod" -Ptests.jvms=4 -Ptests.haltonfailure=false -Ptests.jvmargs=-XX:TieredStopAtLevel=1 -Ptests.seed=E35CB1385114AA79 -Ptests.multiplier=2 -Ptests.badapples=false -Ptests.file.encoding=US-ASCII

  - org.apache.solr.handler.designer.TestSchemaDesignerAPI.testBasicUserWorkflow (:solr:core)
    Test output: /home/jenkins/jenkins-slave/workspace/Solr/Solr-Check-main/solr/core/build/test-results/test/outputs/OUTPUT-org.apache.solr.handler.designer.TestSchemaDesignerAPI.txt
    Reproduce with: gradlew :solr:core:test --tests "org.apache.solr.handler.designer.TestSchemaDesignerAPI.testBasicUserWorkflow" -Ptests.jvms=4 -Ptests.haltonfailure=false -Ptests.jvmargs=-XX:TieredStopAtLevel=1 -Ptests.seed=E35CB1385114AA79 -Ptests.multiplier=2 -Ptests.badapples=false -Ptests.file.encoding=US-ASCII


Deprecated Gradle features were used in this build, making it incompatible with Gradle 8.0.

You can use '--warning-mode all' to show the individual deprecation warnings and determine if they come from your own scripts or plugins.

See https://docs.gradle.org/7.2/userguide/command_line_interface.html#sec:command_line_warnings

BUILD SUCCESSFUL in 54m
433 actionable tasks: 433 executed
Build step 'Invoke Gradle script' changed build result to SUCCESS
Archiving artifacts
java.lang.InterruptedException: no matches found within 10000
	at hudson.FilePath$ValidateAntFileMask.hasMatch(FilePath.java:3069)
	at hudson.FilePath$ValidateAntFileMask.invoke(FilePath.java:2948)
	at hudson.FilePath$ValidateAntFileMask.invoke(FilePath.java:2929)
	at hudson.FilePath$FileCallableWrapper.call(FilePath.java:3317)
Also:   hudson.remoting.Channel$CallSiteStackTrace: Remote call to lucene-solr-1
		at hudson.remoting.Channel.attachCallSiteStackTrace(Channel.java:1800)
		at hudson.remoting.UserRequest$ExceptionResponse.retrieve(UserRequest.java:356)
		at hudson.remoting.Channel.call(Channel.java:1001)
		at hudson.FilePath.act(FilePath.java:1159)
		at hudson.FilePath.act(FilePath.java:1148)
		at hudson.FilePath.validateAntFileMask(FilePath.java:2927)
		at hudson.tasks.ArtifactArchiver.perform(ArtifactArchiver.java:270)
		at hudson.tasks.BuildStepCompatibilityLayer.perform(BuildStepCompatibilityLayer.java:80)
		at hudson.tasks.BuildStepMonitor$1.perform(BuildStepMonitor.java:20)
		at hudson.model.AbstractBuild$AbstractBuildExecution.perform(AbstractBuild.java:803)
		at hudson.model.AbstractBuild$AbstractBuildExecution.performAllBuildSteps(AbstractBuild.java:752)
		at hudson.model.Build$BuildExecution.post2(Build.java:177)
		at hudson.model.AbstractBuild$AbstractBuildExecution.post(AbstractBuild.java:697)
		at hudson.model.Run.execute(Run.java:1931)
		at hudson.model.FreeStyleBuild.run(FreeStyleBuild.java:43)
		at hudson.model.ResourceController.execute(ResourceController.java:97)
		at hudson.model.Executor.run(Executor.java:429)
Caused: hudson.FilePath$TunneledInterruptedException
	at hudson.FilePath$FileCallableWrapper.call(FilePath.java:3319)
	at hudson.remoting.UserRequest.perform(UserRequest.java:211)
	at hudson.remoting.UserRequest.perform(UserRequest.java:54)
	at hudson.remoting.Request$2.run(Request.java:376)
	at hudson.remoting.InterceptingExecutorService.lambda$wrap$0(InterceptingExecutorService.java:78)
	at java.util.concurrent.FutureTask.run(FutureTask.java:266)
	at java.util.concurrent.ThreadPoolExecutor.runWorker(ThreadPoolExecutor.java:1149)
	at java.util.concurrent.ThreadPoolExecutor$Worker.run(ThreadPoolExecutor.java:624)
	at java.lang.Thread.run(Thread.java:748)
Caused: java.lang.InterruptedException: java.lang.InterruptedException: no matches found within 10000
	at hudson.FilePath.act(FilePath.java:1161)
	at hudson.FilePath.act(FilePath.java:1148)
	at hudson.FilePath.validateAntFileMask(FilePath.java:2927)
	at hudson.tasks.ArtifactArchiver.perform(ArtifactArchiver.java:270)
	at hudson.tasks.BuildStepCompatibilityLayer.perform(BuildStepCompatibilityLayer.java:80)
	at hudson.tasks.BuildStepMonitor$1.perform(BuildStepMonitor.java:20)
	at hudson.model.AbstractBuild$AbstractBuildExecution.perform(AbstractBuild.java:803)
	at hudson.model.AbstractBuild$AbstractBuildExecution.performAllBuildSteps(AbstractBuild.java:752)
	at hudson.model.Build$BuildExecution.post2(Build.java:177)
	at hudson.model.AbstractBuild$AbstractBuildExecution.post(AbstractBuild.java:697)
	at hudson.model.Run.execute(Run.java:1931)
	at hudson.model.FreeStyleBuild.run(FreeStyleBuild.java:43)
	at hudson.model.ResourceController.execute(ResourceController.java:97)
	at hudson.model.Executor.run(Executor.java:429)
No artifacts found that match the file pattern "**/*.events,heapdumps/**,**/hs_err_pid*". Configuration error?
Recording test results
[Checks API] No suitable checks publisher found.
Build step 'Publish JUnit test result report' changed build result to UNSTABLE
Email was triggered for: Unstable (Test Failures)
Sending email for trigger: Unstable (Test Failures)