You are viewing a plain text version of this content. The canonical link for it is here.
Posted to issues@nifi.apache.org by "David Handermann (Jira)" <ji...@apache.org> on 2021/08/31 18:09:00 UTC

[jira] [Assigned] (NIFI-9187) Test Record Path failure

     [ https://issues.apache.org/jira/browse/NIFI-9187?page=com.atlassian.jira.plugin.system.issuetabpanels:all-tabpanel ]

David Handermann reassigned NIFI-9187:
--------------------------------------

    Assignee: David Handermann

> Test Record Path failure
> ------------------------
>
>                 Key: NIFI-9187
>                 URL: https://issues.apache.org/jira/browse/NIFI-9187
>             Project: Apache NiFi
>          Issue Type: Task
>         Environment: Apache Maven 3.8.1 (05c21c65bdfed0f71a2f2ada8b84da59348c4c5d)
> Maven home: /development/tools/apache-maven-3.8.1
> Java version: 11.0.12, vendor: Azul Systems, Inc., runtime: /usr/lib/jvm/zulu11.50.19-ca-jdk11.0.12-linux_x64
> Default locale: en_US, platform encoding: UTF-8
> OS name: "linux", version: "5.13.12-200.fc34.x86_64", arch: "amd64", family: "unix"
>            Reporter: Joe Witt
>            Assignee: David Handermann
>            Priority: Major
>
> [ERROR] Tests run: 75, Failures: 1, Errors: 0, Skipped: 0, Time elapsed: 0.323 s <<< FAILURE! - in org.apache.nifi.record.path.TestRecordPath
> [ERROR] org.apache.nifi.record.path.TestRecordPath.testFormatDateFromString  Time elapsed: 0.005 s  <<< FAILURE!
> org.junit.ComparisonFailure: expected:<2017-10-2[0]> but was:<2017-10-2[1]>
> 	at org.apache.nifi.record.path.TestRecordPath.testFormatDateFromString(TestRecordPath.java:1447)
> [INFO] Running org.apache.nifi.web.api.dto.util.TestNumberUtil
> [INFO] Tests run: 1, Failures: 0, Errors: 0, Skipped: 0, Time elapsed: 0.022 s - in org.apache.nifi.web.api.dto.util.TestNumberUtil
> [INFO] Running org.apache.nifi.web.api.dto.TestRemoteProcessGroupDTO
> [INFO] Tests run: 1, Failures: 0, Errors: 0, Skipped: 0, Time elapsed: 0.002 s - in org.apache.nifi.web.api.dto.TestRemoteProcessGroupDTO
> [INFO] Running org.apache.nifi.web.api.dto.TestProcessGroupDTO
> [INFO] Tests run: 2, Failures: 0, Errors: 0, Skipped: 0, Time elapsed: 0.001 s - in org.apache.nifi.web.api.dto.TestProcessGroupDTO
> [INFO] Running org.apache.nifi.web.api.dto.TestProcessGroupEntity
> [INFO] Tests run: 2, Failures: 0, Errors: 0, Skipped: 0, Time elapsed: 0.002 s - in org.apache.nifi.web.api.dto.TestProcessGroupEntity
> [INFO] 
> [INFO] Results:
> [INFO] 
> [ERROR] Failures: 
> [ERROR]   TestRecordPath.testFormatDateFromString:1447 expected:<2017-10-2[0]> but was:<2017-10-2[1]>
> [INFO] 
> [ERROR] Tests run: 79, Failures: 1, Errors: 0, Skipped: 0



--
This message was sent by Atlassian Jira
(v8.3.4#803005)