You are viewing a plain text version of this content. The canonical link for it is here.
Posted to builds@solr.apache.org by Apache Jenkins Server <je...@builds.apache.org> on 2024/02/07 00:57:49 UTC

[JENKINS] Solr » Solr-Check-9.x - Build # 217 - Still Failing!

Build: https://ci-builds.apache.org/job/Solr/job/Solr-Check-9.x/217/

4 tests failed.
FAILED:  org.apache.solr.bench.DockMakerTest.testRealisticUnicode

Error Message:
java.lang.AssertionError: expected:<6> but was:<9>

Stack Trace:
java.lang.AssertionError: expected:<6> but was:<9>
	at __randomizedtesting.SeedInfo.seed([AB005F2518CF93B1:FBECDBF6CB74C418]:0)
	at org.junit.Assert.fail(Assert.java:89)
	at org.junit.Assert.failNotEquals(Assert.java:835)
	at org.junit.Assert.assertEquals(Assert.java:647)
	at org.junit.Assert.assertEquals(Assert.java:633)
	at org.apache.solr.bench.DockMakerTest.testRealisticUnicode(DockMakerTest.java:189)
	at java.base/jdk.internal.reflect.NativeMethodAccessorImpl.invoke0(Native Method)
	at java.base/jdk.internal.reflect.NativeMethodAccessorImpl.invoke(NativeMethodAccessorImpl.java:62)
	at java.base/jdk.internal.reflect.DelegatingMethodAccessorImpl.invoke(DelegatingMethodAccessorImpl.java:43)
	at java.base/java.lang.reflect.Method.invoke(Method.java:566)
	at com.carrotsearch.randomizedtesting.RandomizedRunner.invoke(RandomizedRunner.java:1758)
	at com.carrotsearch.randomizedtesting.RandomizedRunner$8.evaluate(RandomizedRunner.java:946)
	at com.carrotsearch.randomizedtesting.RandomizedRunner$9.evaluate(RandomizedRunner.java:982)
	at com.carrotsearch.randomizedtesting.RandomizedRunner$10.evaluate(RandomizedRunner.java:996)
	at com.carrotsearch.randomizedtesting.rules.SystemPropertiesRestoreRule$1.evaluate(SystemPropertiesRestoreRule.java:80)
	at org.junit.rules.RunRules.evaluate(RunRules.java:20)
	at org.apache.lucene.tests.util.TestRuleSetupTeardownChained$1.evaluate(TestRuleSetupTeardownChained.java:48)
	at org.apache.lucene.tests.util.AbstractBeforeAfterRule$1.evaluate(AbstractBeforeAfterRule.java:43)
	at org.apache.lucene.tests.util.TestRuleThreadAndTestName$1.evaluate(TestRuleThreadAndTestName.java:45)
	at org.apache.lucene.tests.util.TestRuleIgnoreAfterMaxFailures$1.evaluate(TestRuleIgnoreAfterMaxFailures.java:60)
	at org.apache.lucene.tests.util.TestRuleMarkFailure$1.evaluate(TestRuleMarkFailure.java:44)
	at org.junit.rules.RunRules.evaluate(RunRules.java:20)
	at com.carrotsearch.randomizedtesting.rules.StatementAdapter.evaluate(StatementAdapter.java:36)
	at com.carrotsearch.randomizedtesting.ThreadLeakControl$StatementRunner.run(ThreadLeakControl.java:390)
	at com.carrotsearch.randomizedtesting.ThreadLeakControl.forkTimeoutingTask(ThreadLeakControl.java:843)
	at com.carrotsearch.randomizedtesting.ThreadLeakControl$3.evaluate(ThreadLeakControl.java:490)
	at com.carrotsearch.randomizedtesting.RandomizedRunner.runSingleTest(RandomizedRunner.java:955)
	at com.carrotsearch.randomizedtesting.RandomizedRunner$5.evaluate(RandomizedRunner.java:840)
	at com.carrotsearch.randomizedtesting.RandomizedRunner$6.evaluate(RandomizedRunner.java:891)
	at com.carrotsearch.randomizedtesting.RandomizedRunner$7.evaluate(RandomizedRunner.java:902)
	at com.carrotsearch.randomizedtesting.rules.StatementAdapter.evaluate(StatementAdapter.java:36)
	at com.carrotsearch.randomizedtesting.rules.StatementAdapter.evaluate(StatementAdapter.java:36)
	at org.apache.lucene.tests.util.AbstractBeforeAfterRule$1.evaluate(AbstractBeforeAfterRule.java:43)
	at org.apache.lucene.tests.util.AbstractBeforeAfterRule$1.evaluate(AbstractBeforeAfterRule.java:43)
	at com.carrotsearch.randomizedtesting.rules.SystemPropertiesRestoreRule$1.evaluate(SystemPropertiesRestoreRule.java:80)
	at org.junit.rules.RunRules.evaluate(RunRules.java:20)
	at org.apache.lucene.tests.util.AbstractBeforeAfterRule$1.evaluate(AbstractBeforeAfterRule.java:43)
	at com.carrotsearch.randomizedtesting.rules.StatementAdapter.evaluate(StatementAdapter.java:36)
	at org.apache.lucene.tests.util.TestRuleStoreClassName$1.evaluate(TestRuleStoreClassName.java:38)
	at com.carrotsearch.randomizedtesting.rules.NoShadowingOrOverridesOnMethodsRule$1.evaluate(NoShadowingOrOverridesOnMethodsRule.java:40)
	at com.carrotsearch.randomizedtesting.rules.NoShadowingOrOverridesOnMethodsRule$1.evaluate(NoShadowingOrOverridesOnMethodsRule.java:40)
	at com.carrotsearch.randomizedtesting.rules.StatementAdapter.evaluate(StatementAdapter.java:36)
	at com.carrotsearch.randomizedtesting.rules.StatementAdapter.evaluate(StatementAdapter.java:36)
	at org.apache.lucene.tests.util.TestRuleAssertionsRequired$1.evaluate(TestRuleAssertionsRequired.java:53)
	at org.apache.lucene.tests.util.AbstractBeforeAfterRule$1.evaluate(AbstractBeforeAfterRule.java:43)
	at org.apache.lucene.tests.util.TestRuleMarkFailure$1.evaluate(TestRuleMarkFailure.java:44)
	at org.apache.lucene.tests.util.TestRuleIgnoreAfterMaxFailures$1.evaluate(TestRuleIgnoreAfterMaxFailures.java:60)
	at org.apache.lucene.tests.util.TestRuleIgnoreTestSuites$1.evaluate(TestRuleIgnoreTestSuites.java:47)
	at org.junit.rules.RunRules.evaluate(RunRules.java:20)
	at com.carrotsearch.randomizedtesting.rules.StatementAdapter.evaluate(StatementAdapter.java:36)
	at com.carrotsearch.randomizedtesting.ThreadLeakControl$StatementRunner.run(ThreadLeakControl.java:390)
	at com.carrotsearch.randomizedtesting.ThreadLeakControl.lambda$forkTimeoutingTask$0(ThreadLeakControl.java:850)
	at java.base/java.lang.Thread.run(Thread.java:829)


FAILED:  org.apache.solr.cli.PostToolTest.testBasicRun

Error Message:
java.lang.AssertionError: expected:<0> but was:<1>

Stack Trace:
java.lang.AssertionError: expected:<0> but was:<1>
	at __randomizedtesting.SeedInfo.seed([AB005F2518CF93B1:6976A82113943BF2]:0)
	at org.junit.Assert.fail(Assert.java:89)
	at org.junit.Assert.failNotEquals(Assert.java:835)
	at org.junit.Assert.assertEquals(Assert.java:647)
	at org.junit.Assert.assertEquals(Assert.java:633)
	at org.apache.solr.cli.PostToolTest.testBasicRun(PostToolTest.java:63)
	at java.base/jdk.internal.reflect.NativeMethodAccessorImpl.invoke0(Native Method)
	at java.base/jdk.internal.reflect.NativeMethodAccessorImpl.invoke(NativeMethodAccessorImpl.java:62)
	at java.base/jdk.internal.reflect.DelegatingMethodAccessorImpl.invoke(DelegatingMethodAccessorImpl.java:43)
	at java.base/java.lang.reflect.Method.invoke(Method.java:566)
	at com.carrotsearch.randomizedtesting.RandomizedRunner.invoke(RandomizedRunner.java:1758)
	at com.carrotsearch.randomizedtesting.RandomizedRunner$8.evaluate(RandomizedRunner.java:946)
	at com.carrotsearch.randomizedtesting.RandomizedRunner$9.evaluate(RandomizedRunner.java:982)
	at com.carrotsearch.randomizedtesting.RandomizedRunner$10.evaluate(RandomizedRunner.java:996)
	at com.carrotsearch.randomizedtesting.rules.SystemPropertiesRestoreRule$1.evaluate(SystemPropertiesRestoreRule.java:80)
	at org.junit.rules.RunRules.evaluate(RunRules.java:20)
	at org.apache.lucene.tests.util.TestRuleSetupTeardownChained$1.evaluate(TestRuleSetupTeardownChained.java:48)
	at org.apache.lucene.tests.util.AbstractBeforeAfterRule$1.evaluate(AbstractBeforeAfterRule.java:43)
	at org.apache.lucene.tests.util.TestRuleThreadAndTestName$1.evaluate(TestRuleThreadAndTestName.java:45)
	at org.apache.lucene.tests.util.TestRuleIgnoreAfterMaxFailures$1.evaluate(TestRuleIgnoreAfterMaxFailures.java:60)
	at org.apache.lucene.tests.util.TestRuleMarkFailure$1.evaluate(TestRuleMarkFailure.java:44)
	at org.junit.rules.RunRules.evaluate(RunRules.java:20)
	at com.carrotsearch.randomizedtesting.rules.StatementAdapter.evaluate(StatementAdapter.java:36)
	at com.carrotsearch.randomizedtesting.ThreadLeakControl$StatementRunner.run(ThreadLeakControl.java:390)
	at com.carrotsearch.randomizedtesting.ThreadLeakControl.forkTimeoutingTask(ThreadLeakControl.java:843)
	at com.carrotsearch.randomizedtesting.ThreadLeakControl$3.evaluate(ThreadLeakControl.java:490)
	at com.carrotsearch.randomizedtesting.RandomizedRunner.runSingleTest(RandomizedRunner.java:955)
	at com.carrotsearch.randomizedtesting.RandomizedRunner$5.evaluate(RandomizedRunner.java:840)
	at com.carrotsearch.randomizedtesting.RandomizedRunner$6.evaluate(RandomizedRunner.java:891)
	at com.carrotsearch.randomizedtesting.RandomizedRunner$7.evaluate(RandomizedRunner.java:902)
	at com.carrotsearch.randomizedtesting.rules.StatementAdapter.evaluate(StatementAdapter.java:36)
	at com.carrotsearch.randomizedtesting.rules.StatementAdapter.evaluate(StatementAdapter.java:36)
	at org.apache.lucene.tests.util.AbstractBeforeAfterRule$1.evaluate(AbstractBeforeAfterRule.java:43)
	at org.apache.lucene.tests.util.AbstractBeforeAfterRule$1.evaluate(AbstractBeforeAfterRule.java:43)
	at com.carrotsearch.randomizedtesting.rules.SystemPropertiesRestoreRule$1.evaluate(SystemPropertiesRestoreRule.java:80)
	at org.junit.rules.RunRules.evaluate(RunRules.java:20)
	at org.apache.lucene.tests.util.AbstractBeforeAfterRule$1.evaluate(AbstractBeforeAfterRule.java:43)
	at com.carrotsearch.randomizedtesting.rules.StatementAdapter.evaluate(StatementAdapter.java:36)
	at org.apache.lucene.tests.util.TestRuleStoreClassName$1.evaluate(TestRuleStoreClassName.java:38)
	at com.carrotsearch.randomizedtesting.rules.NoShadowingOrOverridesOnMethodsRule$1.evaluate(NoShadowingOrOverridesOnMethodsRule.java:40)
	at com.carrotsearch.randomizedtesting.rules.NoShadowingOrOverridesOnMethodsRule$1.evaluate(NoShadowingOrOverridesOnMethodsRule.java:40)
	at com.carrotsearch.randomizedtesting.rules.StatementAdapter.evaluate(StatementAdapter.java:36)
	at com.carrotsearch.randomizedtesting.rules.StatementAdapter.evaluate(StatementAdapter.java:36)
	at org.apache.lucene.tests.util.TestRuleAssertionsRequired$1.evaluate(TestRuleAssertionsRequired.java:53)
	at org.apache.lucene.tests.util.AbstractBeforeAfterRule$1.evaluate(AbstractBeforeAfterRule.java:43)
	at org.apache.lucene.tests.util.TestRuleMarkFailure$1.evaluate(TestRuleMarkFailure.java:44)
	at org.apache.lucene.tests.util.TestRuleIgnoreAfterMaxFailures$1.evaluate(TestRuleIgnoreAfterMaxFailures.java:60)
	at org.apache.lucene.tests.util.TestRuleIgnoreTestSuites$1.evaluate(TestRuleIgnoreTestSuites.java:47)
	at org.junit.rules.RunRules.evaluate(RunRules.java:20)
	at com.carrotsearch.randomizedtesting.rules.StatementAdapter.evaluate(StatementAdapter.java:36)
	at com.carrotsearch.randomizedtesting.ThreadLeakControl$StatementRunner.run(ThreadLeakControl.java:390)
	at com.carrotsearch.randomizedtesting.ThreadLeakControl.lambda$forkTimeoutingTask$0(ThreadLeakControl.java:850)
	at java.base/java.lang.Thread.run(Thread.java:829)


FAILED:  org.apache.solr.cluster.placement.impl.PlacementPluginIntegrationTest.testNodeTypeIntegration

Error Message:
java.lang.AssertionError: should have failed due to no nodes with the types: {responseHeader={status=0, QTime=2072}, success={127.0.0.1:46409_solr={responseHeader={status=0, QTime=840}, core=nodeTypeCollection_shard1_replica_n3}, 127.0.0.1:39019_solr={responseHeader={status=0, QTime=1267}, core=nodeTypeCollection_shard1_replica_n1}, 127.0.0.1:40923_solr={responseHeader={status=0, QTime=1351}, core=nodeTypeCollection_shard1_replica_n2}}}

Stack Trace:
java.lang.AssertionError: should have failed due to no nodes with the types: {responseHeader={status=0, QTime=2072}, success={127.0.0.1:46409_solr={responseHeader={status=0, QTime=840}, core=nodeTypeCollection_shard1_replica_n3}, 127.0.0.1:39019_solr={responseHeader={status=0, QTime=1267}, core=nodeTypeCollection_shard1_replica_n1}, 127.0.0.1:40923_solr={responseHeader={status=0, QTime=1351}, core=nodeTypeCollection_shard1_replica_n2}}}
	at __randomizedtesting.SeedInfo.seed([AB005F2518CF93B1:9001F2706D83D96F]:0)
	at org.junit.Assert.fail(Assert.java:89)
	at org.apache.solr.cluster.placement.impl.PlacementPluginIntegrationTest.testNodeTypeIntegration(PlacementPluginIntegrationTest.java:414)
	at java.base/jdk.internal.reflect.NativeMethodAccessorImpl.invoke0(Native Method)
	at java.base/jdk.internal.reflect.NativeMethodAccessorImpl.invoke(NativeMethodAccessorImpl.java:62)
	at java.base/jdk.internal.reflect.DelegatingMethodAccessorImpl.invoke(DelegatingMethodAccessorImpl.java:43)
	at java.base/java.lang.reflect.Method.invoke(Method.java:566)
	at com.carrotsearch.randomizedtesting.RandomizedRunner.invoke(RandomizedRunner.java:1758)
	at com.carrotsearch.randomizedtesting.RandomizedRunner$8.evaluate(RandomizedRunner.java:946)
	at com.carrotsearch.randomizedtesting.RandomizedRunner$9.evaluate(RandomizedRunner.java:982)
	at com.carrotsearch.randomizedtesting.RandomizedRunner$10.evaluate(RandomizedRunner.java:996)
	at com.carrotsearch.randomizedtesting.rules.StatementAdapter.evaluate(StatementAdapter.java:36)
	at com.carrotsearch.randomizedtesting.rules.SystemPropertiesRestoreRule$1.evaluate(SystemPropertiesRestoreRule.java:80)
	at org.junit.rules.RunRules.evaluate(RunRules.java:20)
	at org.apache.lucene.tests.util.TestRuleSetupTeardownChained$1.evaluate(TestRuleSetupTeardownChained.java:48)
	at org.apache.lucene.tests.util.AbstractBeforeAfterRule$1.evaluate(AbstractBeforeAfterRule.java:43)
	at org.apache.lucene.tests.util.TestRuleThreadAndTestName$1.evaluate(TestRuleThreadAndTestName.java:45)
	at org.apache.lucene.tests.util.TestRuleIgnoreAfterMaxFailures$1.evaluate(TestRuleIgnoreAfterMaxFailures.java:60)
	at org.apache.lucene.tests.util.TestRuleMarkFailure$1.evaluate(TestRuleMarkFailure.java:44)
	at org.junit.rules.RunRules.evaluate(RunRules.java:20)
	at com.carrotsearch.randomizedtesting.rules.StatementAdapter.evaluate(StatementAdapter.java:36)
	at com.carrotsearch.randomizedtesting.ThreadLeakControl$StatementRunner.run(ThreadLeakControl.java:390)
	at com.carrotsearch.randomizedtesting.ThreadLeakControl.forkTimeoutingTask(ThreadLeakControl.java:843)
	at com.carrotsearch.randomizedtesting.ThreadLeakControl$3.evaluate(ThreadLeakControl.java:490)
	at com.carrotsearch.randomizedtesting.RandomizedRunner.runSingleTest(RandomizedRunner.java:955)
	at com.carrotsearch.randomizedtesting.RandomizedRunner$5.evaluate(RandomizedRunner.java:840)
	at com.carrotsearch.randomizedtesting.RandomizedRunner$6.evaluate(RandomizedRunner.java:891)
	at com.carrotsearch.randomizedtesting.RandomizedRunner$7.evaluate(RandomizedRunner.java:902)
	at com.carrotsearch.randomizedtesting.rules.StatementAdapter.evaluate(StatementAdapter.java:36)
	at com.carrotsearch.randomizedtesting.rules.StatementAdapter.evaluate(StatementAdapter.java:36)
	at org.apache.lucene.tests.util.AbstractBeforeAfterRule$1.evaluate(AbstractBeforeAfterRule.java:43)
	at org.apache.lucene.tests.util.AbstractBeforeAfterRule$1.evaluate(AbstractBeforeAfterRule.java:43)
	at com.carrotsearch.randomizedtesting.rules.SystemPropertiesRestoreRule$1.evaluate(SystemPropertiesRestoreRule.java:80)
	at org.junit.rules.RunRules.evaluate(RunRules.java:20)
	at org.apache.lucene.tests.util.AbstractBeforeAfterRule$1.evaluate(AbstractBeforeAfterRule.java:43)
	at com.carrotsearch.randomizedtesting.rules.StatementAdapter.evaluate(StatementAdapter.java:36)
	at org.apache.lucene.tests.util.TestRuleStoreClassName$1.evaluate(TestRuleStoreClassName.java:38)
	at com.carrotsearch.randomizedtesting.rules.NoShadowingOrOverridesOnMethodsRule$1.evaluate(NoShadowingOrOverridesOnMethodsRule.java:40)
	at com.carrotsearch.randomizedtesting.rules.NoShadowingOrOverridesOnMethodsRule$1.evaluate(NoShadowingOrOverridesOnMethodsRule.java:40)
	at com.carrotsearch.randomizedtesting.rules.StatementAdapter.evaluate(StatementAdapter.java:36)
	at com.carrotsearch.randomizedtesting.rules.StatementAdapter.evaluate(StatementAdapter.java:36)
	at org.apache.lucene.tests.util.TestRuleAssertionsRequired$1.evaluate(TestRuleAssertionsRequired.java:53)
	at org.apache.lucene.tests.util.AbstractBeforeAfterRule$1.evaluate(AbstractBeforeAfterRule.java:43)
	at org.apache.lucene.tests.util.TestRuleMarkFailure$1.evaluate(TestRuleMarkFailure.java:44)
	at org.apache.lucene.tests.util.TestRuleIgnoreAfterMaxFailures$1.evaluate(TestRuleIgnoreAfterMaxFailures.java:60)
	at org.apache.lucene.tests.util.TestRuleIgnoreTestSuites$1.evaluate(TestRuleIgnoreTestSuites.java:47)
	at org.junit.rules.RunRules.evaluate(RunRules.java:20)
	at com.carrotsearch.randomizedtesting.rules.StatementAdapter.evaluate(StatementAdapter.java:36)
	at com.carrotsearch.randomizedtesting.ThreadLeakControl$StatementRunner.run(ThreadLeakControl.java:390)
	at com.carrotsearch.randomizedtesting.ThreadLeakControl.lambda$forkTimeoutingTask$0(ThreadLeakControl.java:850)
	at java.base/java.lang.Thread.run(Thread.java:829)


FAILED:  org.apache.solr.client.solrj.TestLBHttp2SolrClient.testTwoServers

Error Message:
org.apache.solr.client.solrj.SolrServerException: Total timeout 2000 ms elapsed

Stack Trace:
org.apache.solr.client.solrj.SolrServerException: Total timeout 2000 ms elapsed
	at __randomizedtesting.SeedInfo.seed([AB005F2518CF93B1:BEAF1A8C384BD91]:0)
	at app//org.apache.solr.client.solrj.impl.Http2SolrClient.request(Http2SolrClient.java:591)
	at app//org.apache.solr.client.solrj.impl.LBSolrClient.request(LBSolrClient.java:636)
	at app//org.apache.solr.client.solrj.impl.LBSolrClient.request(LBSolrClient.java:608)
	at app//org.apache.solr.client.solrj.SolrRequest.process(SolrRequest.java:255)
	at app//org.apache.solr.client.solrj.SolrClient.query(SolrClient.java:927)
	at app//org.apache.solr.client.solrj.SolrClient.query(SolrClient.java:940)
	at app//org.apache.solr.client.solrj.TestLBHttp2SolrClient.testTwoServers(TestLBHttp2SolrClient.java:186)
	at java.base@11.0.16.1/jdk.internal.reflect.NativeMethodAccessorImpl.invoke0(Native Method)
	at java.base@11.0.16.1/jdk.internal.reflect.NativeMethodAccessorImpl.invoke(NativeMethodAccessorImpl.java:62)
	at java.base@11.0.16.1/jdk.internal.reflect.DelegatingMethodAccessorImpl.invoke(DelegatingMethodAccessorImpl.java:43)
	at java.base@11.0.16.1/java.lang.reflect.Method.invoke(Method.java:566)
	at app//com.carrotsearch.randomizedtesting.RandomizedRunner.invoke(RandomizedRunner.java:1758)
	at app//com.carrotsearch.randomizedtesting.RandomizedRunner$8.evaluate(RandomizedRunner.java:946)
	at app//com.carrotsearch.randomizedtesting.RandomizedRunner$9.evaluate(RandomizedRunner.java:982)
	at app//com.carrotsearch.randomizedtesting.RandomizedRunner$10.evaluate(RandomizedRunner.java:996)
	at app//com.carrotsearch.randomizedtesting.rules.SystemPropertiesRestoreRule$1.evaluate(SystemPropertiesRestoreRule.java:80)
	at app//org.junit.rules.RunRules.evaluate(RunRules.java:20)
	at app//org.apache.lucene.tests.util.TestRuleSetupTeardownChained$1.evaluate(TestRuleSetupTeardownChained.java:48)
	at app//org.apache.lucene.tests.util.AbstractBeforeAfterRule$1.evaluate(AbstractBeforeAfterRule.java:43)
	at app//org.apache.lucene.tests.util.TestRuleThreadAndTestName$1.evaluate(TestRuleThreadAndTestName.java:45)
	at app//org.apache.lucene.tests.util.TestRuleIgnoreAfterMaxFailures$1.evaluate(TestRuleIgnoreAfterMaxFailures.java:60)
	at app//org.apache.lucene.tests.util.TestRuleMarkFailure$1.evaluate(TestRuleMarkFailure.java:44)
	at app//org.junit.rules.RunRules.evaluate(RunRules.java:20)
	at app//com.carrotsearch.randomizedtesting.rules.StatementAdapter.evaluate(StatementAdapter.java:36)
	at app//com.carrotsearch.randomizedtesting.ThreadLeakControl$StatementRunner.run(ThreadLeakControl.java:390)
	at app//com.carrotsearch.randomizedtesting.ThreadLeakControl.forkTimeoutingTask(ThreadLeakControl.java:843)
	at app//com.carrotsearch.randomizedtesting.ThreadLeakControl$3.evaluate(ThreadLeakControl.java:490)
	at app//com.carrotsearch.randomizedtesting.RandomizedRunner.runSingleTest(RandomizedRunner.java:955)
	at app//com.carrotsearch.randomizedtesting.RandomizedRunner$5.evaluate(RandomizedRunner.java:840)
	at app//com.carrotsearch.randomizedtesting.RandomizedRunner$6.evaluate(RandomizedRunner.java:891)
	at app//com.carrotsearch.randomizedtesting.RandomizedRunner$7.evaluate(RandomizedRunner.java:902)
	at app//com.carrotsearch.randomizedtesting.rules.StatementAdapter.evaluate(StatementAdapter.java:36)
	at app//com.carrotsearch.randomizedtesting.rules.StatementAdapter.evaluate(StatementAdapter.java:36)
	at app//org.apache.lucene.tests.util.AbstractBeforeAfterRule$1.evaluate(AbstractBeforeAfterRule.java:43)
	at app//org.apache.lucene.tests.util.AbstractBeforeAfterRule$1.evaluate(AbstractBeforeAfterRule.java:43)
	at app//com.carrotsearch.randomizedtesting.rules.SystemPropertiesRestoreRule$1.evaluate(SystemPropertiesRestoreRule.java:80)
	at app//org.junit.rules.RunRules.evaluate(RunRules.java:20)
	at app//org.apache.lucene.tests.util.AbstractBeforeAfterRule$1.evaluate(AbstractBeforeAfterRule.java:43)
	at app//com.carrotsearch.randomizedtesting.rules.StatementAdapter.evaluate(StatementAdapter.java:36)
	at app//org.apache.lucene.tests.util.TestRuleStoreClassName$1.evaluate(TestRuleStoreClassName.java:38)
	at app//com.carrotsearch.randomizedtesting.rules.NoShadowingOrOverridesOnMethodsRule$1.evaluate(NoShadowingOrOverridesOnMethodsRule.java:40)
	at app//com.carrotsearch.randomizedtesting.rules.NoShadowingOrOverridesOnMethodsRule$1.evaluate(NoShadowingOrOverridesOnMethodsRule.java:40)
	at app//com.carrotsearch.randomizedtesting.rules.StatementAdapter.evaluate(StatementAdapter.java:36)
	at app//com.carrotsearch.randomizedtesting.rules.StatementAdapter.evaluate(StatementAdapter.java:36)
	at app//org.apache.lucene.tests.util.TestRuleAssertionsRequired$1.evaluate(TestRuleAssertionsRequired.java:53)
	at app//org.apache.lucene.tests.util.AbstractBeforeAfterRule$1.evaluate(AbstractBeforeAfterRule.java:43)
	at app//org.apache.lucene.tests.util.TestRuleMarkFailure$1.evaluate(TestRuleMarkFailure.java:44)
	at app//org.apache.lucene.tests.util.TestRuleIgnoreAfterMaxFailures$1.evaluate(TestRuleIgnoreAfterMaxFailures.java:60)
	at app//org.apache.lucene.tests.util.TestRuleIgnoreTestSuites$1.evaluate(TestRuleIgnoreTestSuites.java:47)
	at app//org.junit.rules.RunRules.evaluate(RunRules.java:20)
	at app//com.carrotsearch.randomizedtesting.rules.StatementAdapter.evaluate(StatementAdapter.java:36)
	at app//com.carrotsearch.randomizedtesting.ThreadLeakControl$StatementRunner.run(ThreadLeakControl.java:390)
	at app//com.carrotsearch.randomizedtesting.ThreadLeakControl.lambda$forkTimeoutingTask$0(ThreadLeakControl.java:850)
	at java.base@11.0.16.1/java.lang.Thread.run(Thread.java:829)
Caused by: java.util.concurrent.TimeoutException: Total timeout 2000 ms elapsed
	at org.eclipse.jetty.client.HttpConnection$RequestTimeouts.onExpired(HttpConnection.java:342)
	at org.eclipse.jetty.client.HttpConnection$RequestTimeouts.onExpired(HttpConnection.java:322)
	at org.eclipse.jetty.io.CyclicTimeouts.onTimeoutExpired(CyclicTimeouts.java:110)
	at org.eclipse.jetty.io.CyclicTimeouts$Timeouts.onTimeoutExpired(CyclicTimeouts.java:197)
	at org.eclipse.jetty.io.CyclicTimeout$Wakeup.run(CyclicTimeout.java:294)
	at java.base/java.util.concurrent.Executors$RunnableAdapter.call(Executors.java:515)
	at java.base/java.util.concurrent.FutureTask.run(FutureTask.java:264)
	at java.base/java.util.concurrent.ScheduledThreadPoolExecutor$ScheduledFutureTask.run(ScheduledThreadPoolExecutor.java:304)
	at java.base/java.util.concurrent.ThreadPoolExecutor.runWorker(ThreadPoolExecutor.java:1128)
	at java.base/java.util.concurrent.ThreadPoolExecutor$Worker.run(ThreadPoolExecutor.java:628)
	... 1 more




Build Log:
[...truncated 2165 lines...]
  2> SimplePostTool: FATAL: Connection error (is Solr running at https://127.0.0.1:39051/solr/testBasicRun/update ?): javax.net.ssl.SSLHandshakeException: PKIX path building failed: sun.security.provider.certpath.SunCertPathBuilderException: unable to find valid certification path to requested target
  2> 
  2> ERROR: System/Runtime.exit(2) or halt(2) calls are not allowed because they terminate the test runner's JVM.
  2> 
   >     java.lang.AssertionError: expected:<0> but was:<1>
   >         at __randomizedtesting.SeedInfo.seed([AB005F2518CF93B1:6976A82113943BF2]:0)
   >         at org.junit.Assert.fail(Assert.java:89)
   >         at org.junit.Assert.failNotEquals(Assert.java:835)
   >         at org.junit.Assert.assertEquals(Assert.java:647)
   >         at org.junit.Assert.assertEquals(Assert.java:633)
   >         at org.apache.solr.cli.PostToolTest.testBasicRun(PostToolTest.java:63)
   >         at java.base/jdk.internal.reflect.NativeMethodAccessorImpl.invoke0(Native Method)
   >         at java.base/jdk.internal.reflect.NativeMethodAccessorImpl.invoke(NativeMethodAccessorImpl.java:62)
   >         at java.base/jdk.internal.reflect.DelegatingMethodAccessorImpl.invoke(DelegatingMethodAccessorImpl.java:43)
   >         at java.base/java.lang.reflect.Method.invoke(Method.java:566)
   >         at com.carrotsearch.randomizedtesting.RandomizedRunner.invoke(RandomizedRunner.java:1758)
   >         at com.carrotsearch.randomizedtesting.RandomizedRunner$8.evaluate(RandomizedRunner.java:946)
   >         at com.carrotsearch.randomizedtesting.RandomizedRunner$9.evaluate(RandomizedRunner.java:982)
   >         at com.carrotsearch.randomizedtesting.RandomizedRunner$10.evaluate(RandomizedRunner.java:996)
   >         at com.carrotsearch.randomizedtesting.rules.SystemPropertiesRestoreRule$1.evaluate(SystemPropertiesRestoreRule.java:80)
   >         at org.junit.rules.RunRules.evaluate(RunRules.java:20)
   >         at org.apache.lucene.tests.util.TestRuleSetupTeardownChained$1.evaluate(TestRuleSetupTeardownChained.java:48)
   >         at org.apache.lucene.tests.util.AbstractBeforeAfterRule$1.evaluate(AbstractBeforeAfterRule.java:43)
   >         at org.apache.lucene.tests.util.TestRuleThreadAndTestName$1.evaluate(TestRuleThreadAndTestName.java:45)
   >         at org.apache.lucene.tests.util.TestRuleIgnoreAfterMaxFailures$1.evaluate(TestRuleIgnoreAfterMaxFailures.java:60)
   >         at org.apache.lucene.tests.util.TestRuleMarkFailure$1.evaluate(TestRuleMarkFailure.java:44)
   >         at org.junit.rules.RunRules.evaluate(RunRules.java:20)
   >         at com.carrotsearch.randomizedtesting.rules.StatementAdapter.evaluate(StatementAdapter.java:36)
   >         at com.carrotsearch.randomizedtesting.ThreadLeakControl$StatementRunner.run(ThreadLeakControl.java:390)
   >         at com.carrotsearch.randomizedtesting.ThreadLeakControl.forkTimeoutingTask(ThreadLeakControl.java:843)
   >         at com.carrotsearch.randomizedtesting.ThreadLeakControl$3.evaluate(ThreadLeakControl.java:490)
   >         at com.carrotsearch.randomizedtesting.RandomizedRunner.runSingleTest(RandomizedRunner.java:955)
   >         at com.carrotsearch.randomizedtesting.RandomizedRunner$5.evaluate(RandomizedRunner.java:840)
   >         at com.carrotsearch.randomizedtesting.RandomizedRunner$6.evaluate(RandomizedRunner.java:891)
   >         at com.carrotsearch.randomizedtesting.RandomizedRunner$7.evaluate(RandomizedRunner.java:902)
   >         at com.carrotsearch.randomizedtesting.rules.StatementAdapter.evaluate(StatementAdapter.java:36)
   >         at com.carrotsearch.randomizedtesting.rules.StatementAdapter.evaluate(StatementAdapter.java:36)
   >         at org.apache.lucene.tests.util.AbstractBeforeAfterRule$1.evaluate(AbstractBeforeAfterRule.java:43)
   >         at org.apache.lucene.tests.util.AbstractBeforeAfterRule$1.evaluate(AbstractBeforeAfterRule.java:43)
   >         at com.carrotsearch.randomizedtesting.rules.SystemPropertiesRestoreRule$1.evaluate(SystemPropertiesRestoreRule.java:80)
   >         at org.junit.rules.RunRules.evaluate(RunRules.java:20)
   >         at org.apache.lucene.tests.util.AbstractBeforeAfterRule$1.evaluate(AbstractBeforeAfterRule.java:43)
   >         at com.carrotsearch.randomizedtesting.rules.StatementAdapter.evaluate(StatementAdapter.java:36)
   >         at org.apache.lucene.tests.util.TestRuleStoreClassName$1.evaluate(TestRuleStoreClassName.java:38)
   >         at com.carrotsearch.randomizedtesting.rules.NoShadowingOrOverridesOnMethodsRule$1.evaluate(NoShadowingOrOverridesOnMethodsRule.java:40)
   >         at com.carrotsearch.randomizedtesting.rules.NoShadowingOrOverridesOnMethodsRule$1.evaluate(NoShadowingOrOverridesOnMethodsRule.java:40)
   >         at com.carrotsearch.randomizedtesting.rules.StatementAdapter.evaluate(StatementAdapter.java:36)
   >         at com.carrotsearch.randomizedtesting.rules.StatementAdapter.evaluate(StatementAdapter.java:36)
   >         at org.apache.lucene.tests.util.TestRuleAssertionsRequired$1.evaluate(TestRuleAssertionsRequired.java:53)
   >         at org.apache.lucene.tests.util.AbstractBeforeAfterRule$1.evaluate(AbstractBeforeAfterRule.java:43)
   >         at org.apache.lucene.tests.util.TestRuleMarkFailure$1.evaluate(TestRuleMarkFailure.java:44)
   >         at org.apache.lucene.tests.util.TestRuleIgnoreAfterMaxFailures$1.evaluate(TestRuleIgnoreAfterMaxFailures.java:60)
   >         at org.apache.lucene.tests.util.TestRuleIgnoreTestSuites$1.evaluate(TestRuleIgnoreTestSuites.java:47)
   >         at org.junit.rules.RunRules.evaluate(RunRules.java:20)
   >         at com.carrotsearch.randomizedtesting.rules.StatementAdapter.evaluate(StatementAdapter.java:36)
   >         at com.carrotsearch.randomizedtesting.ThreadLeakControl$StatementRunner.run(ThreadLeakControl.java:390)
   >         at com.carrotsearch.randomizedtesting.ThreadLeakControl.lambda$forkTimeoutingTask$0(ThreadLeakControl.java:850)
   >         at java.base/java.lang.Thread.run(Thread.java:829)
  2> NOTE: reproduce with: gradlew test --tests PostToolTest.testBasicRun -Dtests.seed=AB005F2518CF93B1 -Dtests.multiplier=2 -Dtests.locale=pa -Dtests.timezone=Asia/Kuching -Dtests.asserts=true -Dtests.file.encoding=UTF-8
  2> 338564 ERROR (OverseerThreadFactory-341-thread-2) [n: c:testRunWithCollectionParam s: r: x: t:] o.a.s.c.a.c.CollectionHandlingUtils Collection testRunWithCollectionParam, operation create failed
  2>           => org.apache.solr.common.SolrException: Can not find the specified config set: conf1
  2> 	at org.apache.solr.cloud.api.collections.CollectionHandlingUtils.validateConfigOrThrowSolrException(CollectionHandlingUtils.java:390)
  2> org.apache.solr.common.SolrException: Can not find the specified config set: conf1
  2> 	at org.apache.solr.cloud.api.collections.CollectionHandlingUtils.validateConfigOrThrowSolrException(CollectionHandlingUtils.java:390) [main/:?]
  2> 	at org.apache.solr.cloud.api.collections.CreateCollectionCmd.call(CreateCollectionCmd.java:133) ~[main/:?]
  2> 	at org.apache.solr.cloud.api.collections.CollApiCmds$TraceAwareCommand.call(CollApiCmds.java:225) ~[main/:?]
  2> 	at org.apache.solr.cloud.api.collections.OverseerCollectionMessageHandler.processMessage(OverseerCollectionMessageHandler.java:130) [main/:?]
  2> 	at org.apache.solr.cloud.OverseerTaskProcessor$Runner.run(OverseerTaskProcessor.java:564) [main/:9.6.0-SNAPSHOT 09148b97f8235712de83af173e6194ccfc187c0a [snapshot build, details omitted]]
  2> 	at org.apache.solr.common.util.ExecutorUtil$MDCAwareThreadPoolExecutor.lambda$execute$0(ExecutorUtil.java:312) [solr-solrj-9.6.0-SNAPSHOT.jar:9.6.0-SNAPSHOT 09148b97f8235712de83af173e6194ccfc187c0a [snapshot build, details omitted]]
  2> 	at java.base/java.util.concurrent.ThreadPoolExecutor.runWorker(ThreadPoolExecutor.java:1128) [?:?]
  2> 	at java.base/java.util.concurrent.ThreadPoolExecutor$Worker.run(ThreadPoolExecutor.java:628) [?:?]
  2> 	at java.base/java.lang.Thread.run(Thread.java:829) [?:?]
  1> Posting files to [base] url http://localhost:39051/solr/testRunWithCollectionParam/update...
  1> Entering auto mode. File endings considered are xml,json,jsonl,csv,pdf,doc,docx,ppt,pptx,xls,xlsx,odt,odp,ods,ott,otp,ots,rtf,htm,html,txt,log
  1> Entering recursive mode, max depth=1, delay=0s
  1> POSTing file temp15393161196045996411json (application/octet-stream) to [base]/extract
  2> SimplePostTool: WARNING: IOException while reading response: java.net.SocketException: Unexpected end of file from server
  1> 1 files indexed.
  1> Time spent: 0:00:00.041
  2> 340436 INFO  (jetty-closer-352-thread-1) [n: c: s: r: x: t:] o.e.j.s.Server Stopped Server@15a91541{STOPPING}[10.0.19,sto=0]
  2> 340526 INFO  (jetty-closer-352-thread-1) [n: c: s: r: x: t:] o.e.j.s.AbstractConnector Stopped ServerConnector@765d549{ssl, (ssl, alpn, http/1.1, h2)}{127.0.0.1:0}
  2> 340526 INFO  (jetty-closer-352-thread-1) [n: c: s: r: x: t:] o.e.j.s.h.ContextHandler Stopped o.e.j.s.ServletContextHandler@770ae8f3{/solr,file:///home/jenkins/jenkins-slave/workspace/Solr/Solr-Check-9.x/solr/core/build/tmp/tests-cwd/,STOPPED}
  2> 341974 WARN  (ZkTestServer Run Thread) [n: c: s: r: x: t:] o.a.s.c.ZkTestServer Watch limit violations: 
  2> Maximum concurrent create/delete watches above limit:
  2> 
  2> 	2	/solr/aliases.json
  2> 
  2> Maximum concurrent data watches above limit:
  2> 
  2> 	2	/solr/clusterprops.json
  2> 
  2> Maximum concurrent children watches above limit:
  2> 
  2> 	5	/solr/overseer/collection-queue-work
  2> 	4	/solr/live_nodes
  2> 	2	/solr/collections
  2> 
  2> NOTE: leaving temporary files on disk at: /home/jenkins/jenkins-slave/workspace/Solr/Solr-Check-9.x/solr/core/build/tmp/tests-tmp/solr.cli.PostToolTest_AB005F2518CF93B1-001
  2> NOTE: test params are: codec=CheapBastard, sim=Asserting(RandomSimilarity(queryNorm=true): {}), locale=pa, timezone=Asia/Kuching
  2> NOTE: Linux 4.15.0-213-generic amd64/Eclipse Adoptium 11.0.16.1 (64-bit)/cpus=1,threads=2,free=163512128,total=349175808
  2> NOTE: All tests run in this JVM: [AnalysisAfterCoreReloadTest, DisMaxRequestHandlerTest, MinimalSchemaTest, SolrTestCaseJ4DeleteCoreTest, TestDistributedGrouping, TestGroupingSearch, TestRandomFaceting, TestTrie, TestCharFilters, TestWordDelimiterFilterFactory, ApiToolTest, PostToolTest]

WARNING: Test org.apache.solr.client.solrj.impl.ConnectionReuseTest wrote 11,164,612 bytes of output.
WARNING: Test org.apache.solr.cloud.TestStressCloudBlindAtomicUpdates wrote 15,644,132 bytes of output.

org.apache.solr.cluster.placement.impl.PlacementPluginIntegrationTest > testNodeTypeIntegration FAILED
    java.lang.AssertionError: should have failed due to no nodes with the types: {responseHeader={status=0, QTime=2072}, success={127.0.0.1:46409_solr={responseHeader={status=0, QTime=840}, core=nodeTypeCollection_shard1_replica_n3}, 127.0.0.1:39019_solr={responseHeader={status=0, QTime=1267}, core=nodeTypeCollection_shard1_replica_n1}, 127.0.0.1:40923_solr={responseHeader={status=0, QTime=1351}, core=nodeTypeCollection_shard1_replica_n2}}}
        at __randomizedtesting.SeedInfo.seed([AB005F2518CF93B1:9001F2706D83D96F]:0)
        at org.junit.Assert.fail(Assert.java:89)
        at org.apache.solr.cluster.placement.impl.PlacementPluginIntegrationTest.testNodeTypeIntegration(PlacementPluginIntegrationTest.java:414)
        at java.base/jdk.internal.reflect.NativeMethodAccessorImpl.invoke0(Native Method)
        at java.base/jdk.internal.reflect.NativeMethodAccessorImpl.invoke(NativeMethodAccessorImpl.java:62)
        at java.base/jdk.internal.reflect.DelegatingMethodAccessorImpl.invoke(DelegatingMethodAccessorImpl.java:43)
        at java.base/java.lang.reflect.Method.invoke(Method.java:566)
        at com.carrotsearch.randomizedtesting.RandomizedRunner.invoke(RandomizedRunner.java:1758)
        at com.carrotsearch.randomizedtesting.RandomizedRunner$8.evaluate(RandomizedRunner.java:946)
        at com.carrotsearch.randomizedtesting.RandomizedRunner$9.evaluate(RandomizedRunner.java:982)
        at com.carrotsearch.randomizedtesting.RandomizedRunner$10.evaluate(RandomizedRunner.java:996)
        at com.carrotsearch.randomizedtesting.rules.StatementAdapter.evaluate(StatementAdapter.java:36)
        at com.carrotsearch.randomizedtesting.rules.SystemPropertiesRestoreRule$1.evaluate(SystemPropertiesRestoreRule.java:80)
        at org.junit.rules.RunRules.evaluate(RunRules.java:20)
        at org.apache.lucene.tests.util.TestRuleSetupTeardownChained$1.evaluate(TestRuleSetupTeardownChained.java:48)
        at org.apache.lucene.tests.util.AbstractBeforeAfterRule$1.evaluate(AbstractBeforeAfterRule.java:43)
        at org.apache.lucene.tests.util.TestRuleThreadAndTestName$1.evaluate(TestRuleThreadAndTestName.java:45)
        at org.apache.lucene.tests.util.TestRuleIgnoreAfterMaxFailures$1.evaluate(TestRuleIgnoreAfterMaxFailures.java:60)
        at org.apache.lucene.tests.util.TestRuleMarkFailure$1.evaluate(TestRuleMarkFailure.java:44)
        at org.junit.rules.RunRules.evaluate(RunRules.java:20)
        at com.carrotsearch.randomizedtesting.rules.StatementAdapter.evaluate(StatementAdapter.java:36)
        at com.carrotsearch.randomizedtesting.ThreadLeakControl$StatementRunner.run(ThreadLeakControl.java:390)
        at com.carrotsearch.randomizedtesting.ThreadLeakControl.forkTimeoutingTask(ThreadLeakControl.java:843)
        at com.carrotsearch.randomizedtesting.ThreadLeakControl$3.evaluate(ThreadLeakControl.java:490)
        at com.carrotsearch.randomizedtesting.RandomizedRunner.runSingleTest(RandomizedRunner.java:955)
        at com.carrotsearch.randomizedtesting.RandomizedRunner$5.evaluate(RandomizedRunner.java:840)
        at com.carrotsearch.randomizedtesting.RandomizedRunner$6.evaluate(RandomizedRunner.java:891)
        at com.carrotsearch.randomizedtesting.RandomizedRunner$7.evaluate(RandomizedRunner.java:902)
        at com.carrotsearch.randomizedtesting.rules.StatementAdapter.evaluate(StatementAdapter.java:36)
        at com.carrotsearch.randomizedtesting.rules.StatementAdapter.evaluate(StatementAdapter.java:36)
        at org.apache.lucene.tests.util.AbstractBeforeAfterRule$1.evaluate(AbstractBeforeAfterRule.java:43)
        at org.apache.lucene.tests.util.AbstractBeforeAfterRule$1.evaluate(AbstractBeforeAfterRule.java:43)
        at com.carrotsearch.randomizedtesting.rules.SystemPropertiesRestoreRule$1.evaluate(SystemPropertiesRestoreRule.java:80)
        at org.junit.rules.RunRules.evaluate(RunRules.java:20)
        at org.apache.lucene.tests.util.AbstractBeforeAfterRule$1.evaluate(AbstractBeforeAfterRule.java:43)
        at com.carrotsearch.randomizedtesting.rules.StatementAdapter.evaluate(StatementAdapter.java:36)
        at org.apache.lucene.tests.util.TestRuleStoreClassName$1.evaluate(TestRuleStoreClassName.java:38)
        at com.carrotsearch.randomizedtesting.rules.NoShadowingOrOverridesOnMethodsRule$1.evaluate(NoShadowingOrOverridesOnMethodsRule.java:40)
        at com.carrotsearch.randomizedtesting.rules.NoShadowingOrOverridesOnMethodsRule$1.evaluate(NoShadowingOrOverridesOnMethodsRule.java:40)
        at com.carrotsearch.randomizedtesting.rules.StatementAdapter.evaluate(StatementAdapter.java:36)
        at com.carrotsearch.randomizedtesting.rules.StatementAdapter.evaluate(StatementAdapter.java:36)
        at org.apache.lucene.tests.util.TestRuleAssertionsRequired$1.evaluate(TestRuleAssertionsRequired.java:53)
        at org.apache.lucene.tests.util.AbstractBeforeAfterRule$1.evaluate(AbstractBeforeAfterRule.java:43)
        at org.apache.lucene.tests.util.TestRuleMarkFailure$1.evaluate(TestRuleMarkFailure.java:44)
        at org.apache.lucene.tests.util.TestRuleIgnoreAfterMaxFailures$1.evaluate(TestRuleIgnoreAfterMaxFailures.java:60)
        at org.apache.lucene.tests.util.TestRuleIgnoreTestSuites$1.evaluate(TestRuleIgnoreTestSuites.java:47)
        at org.junit.rules.RunRules.evaluate(RunRules.java:20)
        at com.carrotsearch.randomizedtesting.rules.StatementAdapter.evaluate(StatementAdapter.java:36)
        at com.carrotsearch.randomizedtesting.ThreadLeakControl$StatementRunner.run(ThreadLeakControl.java:390)
        at com.carrotsearch.randomizedtesting.ThreadLeakControl.lambda$forkTimeoutingTask$0(ThreadLeakControl.java:850)
        at java.base/java.lang.Thread.run(Thread.java:829)

org.apache.solr.cluster.placement.impl.PlacementPluginIntegrationTest > test suite's output saved to /home/jenkins/jenkins-slave/workspace/Solr/Solr-Check-9.x/solr/core/build/test-results/test/outputs/OUTPUT-org.apache.solr.cluster.placement.impl.PlacementPluginIntegrationTest.txt, copied below:
  2> 1595733 INFO  (SUITE-PlacementPluginIntegrationTest-seed#[AB005F2518CF93B1]-worker) [n: c: s: r: x: t:] o.a.s.SolrTestCase Setting 'solr.default.confdir' system property to test-framework derived value of '/home/jenkins/jenkins-slave/workspace/Solr/Solr-Check-9.x/solr/server/solr/configsets/_default/conf'
  2> 1595734 INFO  (SUITE-PlacementPluginIntegrationTest-seed#[AB005F2518CF93B1]-worker) [n: c: s: r: x: t:] o.a.s.u.ErrorLogMuter Closing ErrorLogMuter-regex-137 after mutting 0 log messages
  2> 1595734 INFO  (SUITE-PlacementPluginIntegrationTest-seed#[AB005F2518CF93B1]-worker) [n: c: s: r: x: t:] o.a.s.u.ErrorLogMuter Creating ErrorLogMuter-regex-138 for ERROR logs matching regex: ignore_exception
  2> 1595735 INFO  (SUITE-PlacementPluginIntegrationTest-seed#[AB005F2518CF93B1]-worker) [n: c: s: r: x: t:] o.a.s.SolrTestCaseJ4 Created dataDir: /home/jenkins/jenkins-slave/workspace/Solr/Solr-Check-9.x/solr/core/build/tmp/tests-tmp/solr.cluster.placement.impl.PlacementPluginIntegrationTest_AB005F2518CF93B1-001/data-dir-52-001
  2> 1595735 INFO  (SUITE-PlacementPluginIntegrationTest-seed#[AB005F2518CF93B1]-worker) [n: c: s: r: x: t:] o.a.s.SolrTestCaseJ4 Using PointFields (NUMERIC_POINTS_SYSPROP=true) w/NUMERIC_DOCVALUES_SYSPROP=false
  2> 1595736 INFO  (SUITE-PlacementPluginIntegrationTest-seed#[AB005F2518CF93B1]-worker) [n: c: s: r: x: t:] o.a.s.SolrTestCaseJ4 Randomized ssl (false) and clientAuth (true) via: @org.apache.solr.util.RandomizeSSL(reason="", value=0.0/0.0, ssl=0.0/0.0, clientAuth=0.0/0.0)
  2> 1595736 INFO  (SUITE-PlacementPluginIntegrationTest-seed#[AB005F2518CF93B1]-worker) [n: c: s: r: x: t:] o.a.s.SolrTestCaseJ4 SecureRandom sanity checks: test.solr.allowed.securerandom=null & java.security.egd=file:/dev/./urandom
  2> 1595737 INFO  (SUITE-PlacementPluginIntegrationTest-seed#[AB005F2518CF93B1]-worker) [n: c: s: r: x: t:] o.a.s.u.t.SimplePropagator Always-on trace id generation enabled.
  2> 1595737 INFO  (SUITE-PlacementPluginIntegrationTest-seed#[AB005F2518CF93B1]-worker) [n: c: s: r: x: t:] o.a.s.c.MiniSolrCloudCluster Starting cluster of 3 servers in /home/jenkins/jenkins-slave/workspace/Solr/Solr-Check-9.x/solr/core/build/tmp/tests-tmp/solr.cluster.placement.impl.PlacementPluginIntegrationTest_AB005F2518CF93B1-001/tempDir-001
  2> 1595737 INFO  (SUITE-PlacementPluginIntegrationTest-seed#[AB005F2518CF93B1]-worker) [n: c: s: r: x: t:] o.a.s.c.ZkTestServer STARTING ZK TEST SERVER
  2> 1595740 INFO  (ZkTestServer Run Thread) [n: c: s: r: x: t:] o.a.s.c.ZkTestServer client port: /127.0.0.1:0
  2> 1595741 INFO  (ZkTestServer Run Thread) [n: c: s: r: x: t:] o.a.s.c.ZkTestServer Starting server
  2> 1595742 WARN  (ZkTestServer Run Thread) [n: c: s: r: x: t:] o.a.z.s.ServerCnxnFactory maxCnxns is not configured, using default value 0.
  2> 1595840 INFO  (SUITE-PlacementPluginIntegrationTest-seed#[AB005F2518CF93B1]-worker) [n: c: s: r: x: t:] o.a.s.c.ZkTestServer start zk server on port: 33785
  2> 1595848 WARN  (SUITE-PlacementPluginIntegrationTest-seed#[AB005F2518CF93B1]-worker) [n: c: s: r: x: t:] o.a.s.c.c.SolrZkClient Using default ZkCredentialsInjector. ZkCredentialsInjector is not secure, it creates an empty list of credentials which leads to 'OPEN_ACL_UNSAFE' ACLs to Zookeeper nodes
  2> 1595854 INFO  (SUITE-PlacementPluginIntegrationTest-seed#[AB005F2518CF93B1]-worker) [n: c: s: r: x: t:] o.a.s.c.c.ConnectionManager Waiting up to 30000ms for client to connect to ZooKeeper
  2> 1596049 INFO  (zkConnectionManagerCallback-10493-thread-1) [n: c: s: r: x: t:] o.a.s.c.c.ConnectionManager zkClient has connected
  2> 1596049 INFO  (SUITE-PlacementPluginIntegrationTest-seed#[AB005F2518CF93B1]-worker) [n: c: s: r: x: t:] o.a.s.c.c.ConnectionManager Client is connected to ZooKeeper
  2> 1596049 WARN  (SUITE-PlacementPluginIntegrationTest-seed#[AB005F2518CF93B1]-worker) [n: c: s: r: x: t:] o.a.s.c.c.SolrZkClient Using default ZkACLProvider. DefaultZkACLProvider is not secure, it creates 'OPEN_ACL_UNSAFE' ACLs to Zookeeper nodes
  2> 1596077 WARN  (SUITE-PlacementPluginIntegrationTest-seed#[AB005F2518CF93B1]-worker) [n: c: s: r: x: t:] o.a.s.c.c.SolrZkClient Using default ZkCredentialsInjector. ZkCredentialsInjector is not secure, it creates an empty list of credentials which leads to 'OPEN_ACL_UNSAFE' ACLs to Zookeeper nodes
  2> 1596077 INFO  (SUITE-PlacementPluginIntegrationTest-seed#[AB005F2518CF93B1]-worker) [n: c: s: r: x: t:] o.a.s.c.c.ConnectionManager Waiting up to 30000ms for client to connect to ZooKeeper
  2> 1596088 INFO  (zkConnectionManagerCallback-10495-thread-1) [n: c: s: r: x: t:] o.a.s.c.c.ConnectionManager zkClient has connected
  2> 1596088 INFO  (SUITE-PlacementPluginIntegrationTest-seed#[AB005F2518CF93B1]-worker) [n: c: s: r: x: t:] o.a.s.c.c.ConnectionManager Client is connected to ZooKeeper
  2> 1596088 WARN  (SUITE-PlacementPluginIntegrationTest-seed#[AB005F2518CF93B1]-worker) [n: c: s: r: x: t:] o.a.s.c.c.SolrZkClient Using default ZkACLProvider. DefaultZkACLProvider is not secure, it creates 'OPEN_ACL_UNSAFE' ACLs to Zookeeper nodes
  2> 1596089 WARN  (SUITE-PlacementPluginIntegrationTest-seed#[AB005F2518CF93B1]-worker) [n: c: s: r: x: t:] o.a.s.c.c.SolrZkClient Using default ZkCredentialsInjector. ZkCredentialsInjector is not secure, it creates an empty list of credentials which leads to 'OPEN_ACL_UNSAFE' ACLs to Zookeeper nodes
  2> 1596092 INFO  (SUITE-PlacementPluginIntegrationTest-seed#[AB005F2518CF93B1]-worker) [n: c: s: r: x: t:] o.a.s.c.c.ConnectionManager Waiting up to 15000ms for client to connect to ZooKeeper
  2> 1596122 INFO  (zkConnectionManagerCallback-10497-thread-1) [n: c: s: r: x: t:] o.a.s.c.c.ConnectionManager zkClient has connected
  2> 1596122 INFO  (SUITE-PlacementPluginIntegrationTest-seed#[AB005F2518CF93B1]-worker) [n: c: s: r: x: t:] o.a.s.c.c.ConnectionManager Client is connected to ZooKeeper
  2> 1596122 WARN  (SUITE-PlacementPluginIntegrationTest-seed#[AB005F2518CF93B1]-worker) [n: c: s: r: x: t:] o.a.s.c.c.SolrZkClient Using default ZkACLProvider. DefaultZkACLProvider is not secure, it creates 'OPEN_ACL_UNSAFE' ACLs to Zookeeper nodes
  2> 1596535 INFO  (jetty-launcher-10498-thread-1) [n: c: s: r: x: t:] o.a.s.e.JettySolrRunner Start Jetty (configured port=0, binding port=0)
  2> 1596535 INFO  (jetty-launcher-10498-thread-1) [n: c: s: r: x: t:] o.a.s.e.JettySolrRunner Trying to start Jetty on port 0 try number 2 ...
  2> 1596535 INFO  (jetty-launcher-10498-thread-1) [n: c: s: r: x: t:] o.e.j.s.Server jetty-10.0.19; built: 2023-12-15T20:38:32.477Z; git: 8492d1c78f122bb30cce20aecfa07e7283facd47; jvm 11.0.16.1+1
  2> 1596537 INFO  (jetty-launcher-10498-thread-2) [n: c: s: r: x: t:] o.a.s.e.JettySolrRunner Start Jetty (configured port=0, binding port=0)
  2> 1596538 INFO  (jetty-launcher-10498-thread-2) [n: c: s: r: x: t:] o.a.s.e.JettySolrRunner Trying to start Jetty on port 0 try number 2 ...
  2> 1596538 INFO  (jetty-launcher-10498-thread-2) [n: c: s: r: x: t:] o.e.j.s.Server jetty-10.0.19; built: 2023-12-15T20:38:32.477Z; git: 8492d1c78f122bb30cce20aecfa07e7283facd47; jvm 11.0.16.1+1
  2> 1596546 INFO  (jetty-launcher-10498-thread-3) [n: c: s: r: x: t:] o.a.s.e.JettySolrRunner Start Jetty (configured port=0, binding port=0)
  2> 1596546 INFO  (jetty-launcher-10498-thread-3) [n: c: s: r: x: t:] o.a.s.e.JettySolrRunner Trying to start Jetty on port 0 try number 2 ...
  2> 1596546 INFO  (jetty-launcher-10498-thread-3) [n: c: s: r: x: t:] o.e.j.s.Server jetty-10.0.19; built: 2023-12-15T20:38:32.477Z; git: 8492d1c78f122bb30cce20aecfa07e7283facd47; jvm 11.0.16.1+1
  2> 1596635 INFO  (jetty-launcher-10498-thread-1) [n: c: s: r: x: t:] o.e.j.s.s.DefaultSessionIdManager Session workerName=node0
  2> 1596635 INFO  (jetty-launcher-10498-thread-1) [n: c: s: r: x: t:] o.e.j.s.h.ContextHandler Started o.e.j.s.ServletContextHandler@2109dda5{/solr,file:///home/jenkins/jenkins-slave/workspace/Solr/Solr-Check-9.x/solr/core/build/tmp/tests-cwd/,AVAILABLE}
  2> 1596636 INFO  (jetty-launcher-10498-thread-2) [n: c: s: r: x: t:] o.e.j.s.s.DefaultSessionIdManager Session workerName=node0
  2> 1596636 INFO  (jetty-launcher-10498-thread-1) [n: c: s: r: x: t:] o.e.j.s.AbstractConnector Started ServerConnector@3b19c8d4{HTTP/1.1, (http/1.1, h2c)}{127.0.0.1:39019}
  2> 1596636 INFO  (jetty-launcher-10498-thread-1) [n: c: s: r: x: t:] o.e.j.s.Server Started Server@4b947b17{STARTING}[10.0.19,sto=0] @1597132ms
  2> 1596636 ERROR (jetty-launcher-10498-thread-1) [n: c: s: r: x: t:] o.a.s.u.StartupLoggingUtils Missing Java Option solr.log.dir. Logging may be missing or incomplete.
  2> 1596636 INFO  (jetty-launcher-10498-thread-1) [n: c: s: r: x: t:] o.a.s.s.CoreContainerProvider Using logger factory org.apache.logging.slf4j.Log4jLoggerFactory
  2> 1596636 INFO  (jetty-launcher-10498-thread-1) [n: c: s: r: x: t:] o.a.s.s.CoreContainerProvider  ___      _       Welcome to Apache Solr™ version 9.6.0
  2> 1596636 INFO  (jetty-launcher-10498-thread-1) [n: c: s: r: x: t:] o.a.s.s.CoreContainerProvider / __| ___| |_ _   Starting in cloud mode on port null
  2> 1596636 INFO  (jetty-launcher-10498-thread-1) [n: c: s: r: x: t:] o.a.s.s.CoreContainerProvider \__ \/ _ \ | '_|  Install dir: /home/jenkins/jenkins-slave/workspace/Solr/Solr-Check-9.x/solr
  2> 1596636 INFO  (jetty-launcher-10498-thread-1) [n: c: s: r: x: t:] o.a.s.s.CoreContainerProvider |___/\___/_|_|    Start time: 2024-02-06T22:28:15.451424Z
  2> 1596636 INFO  (jetty-launcher-10498-thread-1) [n: c: s: r: x: t:] o.a.s.s.CoreContainerProvider Solr Home: /home/jenkins/jenkins-slave/workspace/Solr/Solr-Check-9.x/solr/core/build/tmp/tests-tmp/solr.cluster.placement.impl.PlacementPluginIntegrationTest_AB005F2518CF93B1-001/tempDir-001/node1 (source: servlet config: solr.solr.home)
  2> 1596636 WARN  (jetty-launcher-10498-thread-1) [n: c: s: r: x: t:] o.a.s.c.c.SolrZkClient Using default ZkCredentialsInjector. ZkCredentialsInjector is not secure, it creates an empty list of credentials which leads to 'OPEN_ACL_UNSAFE' ACLs to Zookeeper nodes
  2> 1596637 INFO  (jetty-launcher-10498-thread-2) [n: c: s: r: x: t:] o.e.j.s.h.ContextHandler Started o.e.j.s.ServletContextHandler@14510978{/solr,file:///home/jenkins/jenkins-slave/workspace/Solr/Solr-Check-9.x/solr/core/build/tmp/tests-cwd/,AVAILABLE}
  2> 1596637 INFO  (jetty-launcher-10498-thread-2) [n: c: s: r: x: t:] o.e.j.s.AbstractConnector Started ServerConnector@5595302{HTTP/1.1, (http/1.1, h2c)}{127.0.0.1:46409}
  2> 1596637 INFO  (jetty-launcher-10498-thread-2) [n: c: s: r: x: t:] o.e.j.s.Server Started Server@75ea9e1d{STARTING}[10.0.19,sto=0] @1597134ms
  2> 1596637 ERROR (jetty-launcher-10498-thread-2) [n: c: s: r: x: t:] o.a.s.u.StartupLoggingUtils Missing Java Option solr.log.dir. Logging may be missing or incomplete.
  2> 1596637 INFO  (jetty-launcher-10498-thread-2) [n: c: s: r: x: t:] o.a.s.s.CoreContainerProvider Using logger factory org.apache.logging.slf4j.Log4jLoggerFactory
  2> 1596637 INFO  (jetty-launcher-10498-thread-2) [n: c: s: r: x: t:] o.a.s.s.CoreContainerProvider  ___      _       Welcome to Apache Solr™ version 9.6.0
  2> 1596637 INFO  (jetty-launcher-10498-thread-2) [n: c: s: r: x: t:] o.a.s.s.CoreContainerProvider / __| ___| |_ _   Starting in cloud mode on port null
  2> 1596637 INFO  (jetty-launcher-10498-thread-2) [n: c: s: r: x: t:] o.a.s.s.CoreContainerProvider \__ \/ _ \ | '_|  Install dir: /home/jenkins/jenkins-slave/workspace/Solr/Solr-Check-9.x/solr
  2> 1596637 INFO  (jetty-launcher-10498-thread-2) [n: c: s: r: x: t:] o.a.s.s.CoreContainerProvider |___/\___/_|_|    Start time: 2024-02-06T22:28:15.452920Z
  2> 1596638 INFO  (jetty-launcher-10498-thread-2) [n: c: s: r: x: t:] o.a.s.s.CoreContainerProvider Solr Home: /home/jenkins/jenkins-slave/workspace/Solr/Solr-Check-9.x/solr/core/build/tmp/tests-tmp/solr.cluster.placement.impl.PlacementPluginIntegrationTest_AB005F2518CF93B1-001/tempDir-001/node2 (source: servlet config: solr.solr.home)
  2> 1596638 WARN  (jetty-launcher-10498-thread-2) [n: c: s: r: x: t:] o.a.s.c.c.SolrZkClient Using default ZkCredentialsInjector. ZkCredentialsInjector is not secure, it creates an empty list of credentials which leads to 'OPEN_ACL_UNSAFE' ACLs to Zookeeper nodes
  2> 1596671 INFO  (jetty-launcher-10498-thread-3) [n: c: s: r: x: t:] o.e.j.s.s.DefaultSessionIdManager Session workerName=node0
  2> 1596677 INFO  (jetty-launcher-10498-thread-3) [n: c: s: r: x: t:] o.e.j.s.h.ContextHandler Started o.e.j.s.ServletContextHandler@5a1cb58a{/solr,file:///home/jenkins/jenkins-slave/workspace/Solr/Solr-Check-9.x/solr/core/build/tmp/tests-cwd/,AVAILABLE}
  2> 1596684 INFO  (jetty-launcher-10498-thread-3) [n: c: s: r: x: t:] o.e.j.s.AbstractConnector Started ServerConnector@73fb1fe0{HTTP/1.1, (http/1.1, h2c)}{127.0.0.1:40923}
  2> 1596684 INFO  (jetty-launcher-10498-thread-3) [n: c: s: r: x: t:] o.e.j.s.Server Started Server@33e061f{STARTING}[10.0.19,sto=0] @1597181ms
  2> 1596684 ERROR (jetty-launcher-10498-thread-3) [n: c: s: r: x: t:] o.a.s.u.StartupLoggingUtils Missing Java Option solr.log.dir. Logging may be missing or incomplete.
  2> 1596685 INFO  (jetty-launcher-10498-thread-3) [n: c: s: r: x: t:] o.a.s.s.CoreContainerProvider Using logger factory org.apache.logging.slf4j.Log4jLoggerFactory
  2> 1596685 INFO  (jetty-launcher-10498-thread-3) [n: c: s: r: x: t:] o.a.s.s.CoreContainerProvider  ___      _       Welcome to Apache Solr™ version 9.6.0
  2> 1596685 INFO  (jetty-launcher-10498-thread-3) [n: c: s: r: x: t:] o.a.s.s.CoreContainerProvider / __| ___| |_ _   Starting in cloud mode on port null
  2> 1596685 INFO  (jetty-launcher-10498-thread-3) [n: c: s: r: x: t:] o.a.s.s.CoreContainerProvider \__ \/ _ \ | '_|  Install dir: /home/jenkins/jenkins-slave/workspace/Solr/Solr-Check-9.x/solr
  2> 1596685 INFO  (jetty-launcher-10498-thread-3) [n: c: s: r: x: t:] o.a.s.s.CoreContainerProvider |___/\___/_|_|    Start time: 2024-02-06T22:28:15.500099Z
  2> 1596685 INFO  (jetty-launcher-10498-thread-3) [n: c: s: r: x: t:] o.a.s.s.CoreContainerProvider Solr Home: /home/jenkins/jenkins-slave/workspace/Solr/Solr-Check-9.x/solr/core/build/tmp/tests-tmp/solr.cluster.placement.impl.PlacementPluginIntegrationTest_AB005F2518CF93B1-001/tempDir-001/node3 (source: servlet config: solr.solr.home)
  2> 1596685 WARN  (jetty-launcher-10498-thread-3) [n: c: s: r: x: t:] o.a.s.c.c.SolrZkClient Using default ZkCredentialsInjector. ZkCredentialsInjector is not secure, it creates an empty list of credentials which leads to 'OPEN_ACL_UNSAFE' ACLs to Zookeeper nodes
  2> 1596697 INFO  (jetty-launcher-10498-thread-2) [n: c: s: r: x: t:] o.a.s.c.c.ConnectionManager Waiting up to 30000ms for client to connect to ZooKeeper
  2> 1596698 INFO  (jetty-launcher-10498-thread-1) [n: c: s: r: x: t:] o.a.s.c.c.ConnectionManager Waiting up to 30000ms for client to connect to ZooKeeper
  2> 1596702 INFO  (jetty-launcher-10498-thread-3) [n: c: s: r: x: t:] o.a.s.c.c.ConnectionManager Waiting up to 30000ms for client to connect to ZooKeeper
  2> 1596706 INFO  (zkConnectionManagerCallback-10504-thread-1) [n: c: s: r: x: t:] o.a.s.c.c.ConnectionManager zkClient has connected
  2> 1596707 INFO  (jetty-launcher-10498-thread-3) [n: c: s: r: x: t:] o.a.s.c.c.ConnectionManager Client is connected to ZooKeeper
  2> 1596707 WARN  (jetty-launcher-10498-thread-3) [n: c: s: r: x: t:] o.a.s.c.c.SolrZkClient Using default ZkACLProvider. DefaultZkACLProvider is not secure, it creates 'OPEN_ACL_UNSAFE' ACLs to Zookeeper nodes
  2> 1596707 INFO  (zkConnectionManagerCallback-10502-thread-1) [n: c: s: r: x: t:] o.a.s.c.c.ConnectionManager zkClient has connected
  2> 1596707 INFO  (jetty-launcher-10498-thread-2) [n: c: s: r: x: t:] o.a.s.c.c.ConnectionManager Client is connected to ZooKeeper
  2> 1596707 WARN  (jetty-launcher-10498-thread-2) [n: c: s: r: x: t:] o.a.s.c.c.SolrZkClient Using default ZkACLProvider. DefaultZkACLProvider is not secure, it creates 'OPEN_ACL_UNSAFE' ACLs to Zookeeper nodes
  2> 1596711 INFO  (zkConnectionManagerCallback-10500-thread-1) [n: c: s: r: x: t:] o.a.s.c.c.ConnectionManager zkClient has connected
  2> 1596711 INFO  (jetty-launcher-10498-thread-1) [n: c: s: r: x: t:] o.a.s.c.c.ConnectionManager Client is connected to ZooKeeper
  2> 1596711 WARN  (jetty-launcher-10498-thread-1) [n: c: s: r: x: t:] o.a.s.c.c.SolrZkClient Using default ZkACLProvider. DefaultZkACLProvider is not secure, it creates 'OPEN_ACL_UNSAFE' ACLs to Zookeeper nodes
  2> 1596713 INFO  (jetty-launcher-10498-thread-3) [n: c: s: r: x: t:] o.a.s.c.NodeConfig solr.xml found in ZooKeeper. Loading...
  2> 1596713 INFO  (jetty-launcher-10498-thread-1) [n: c: s: r: x: t:] o.a.s.c.NodeConfig solr.xml found in ZooKeeper. Loading...
  2> 1596716 INFO  (jetty-launcher-10498-thread-2) [n: c: s: r: x: t:] o.a.s.c.NodeConfig solr.xml found in ZooKeeper. Loading...
  2> 1596865 INFO  (jetty-launcher-10498-thread-3) [n: c: s: r: x: t:] o.a.s.c.ZkContainer Zookeeper client=127.0.0.1:33785/solr
  2> 1596865 INFO  (jetty-launcher-10498-thread-3) [n: c: s: r: x: t:] o.a.s.c.DistributedClusterStateUpdater Creating DistributedClusterStateUpdater with useDistributedStateUpdate=true. Solr will be using distributed cluster state updates.
  2> 1596866 INFO  (jetty-launcher-10498-thread-1) [n: c: s: r: x: t:] o.a.s.c.ZkContainer Zookeeper client=127.0.0.1:33785/solr
  2> 1596866 INFO  (jetty-launcher-10498-thread-1) [n: c: s: r: x: t:] o.a.s.c.DistributedClusterStateUpdater Creating DistributedClusterStateUpdater with useDistributedStateUpdate=true. Solr will be using distributed cluster state updates.
  2> 1596868 INFO  (jetty-launcher-10498-thread-3) [n:127.0.0.1:40923_solr c: s: r: x: t:] o.a.s.c.c.ConnectionManager Waiting up to 15000ms for client to connect to ZooKeeper
  2> 1596868 INFO  (jetty-launcher-10498-thread-2) [n: c: s: r: x: t:] o.a.s.c.ZkContainer Zookeeper client=127.0.0.1:33785/solr
  2> 1596869 INFO  (jetty-launcher-10498-thread-2) [n: c: s: r: x: t:] o.a.s.c.DistributedClusterStateUpdater Creating DistributedClusterStateUpdater with useDistributedStateUpdate=true. Solr will be using distributed cluster state updates.
  2> 1596873 INFO  (jetty-launcher-10498-thread-2) [n:127.0.0.1:46409_solr c: s: r: x: t:] o.a.s.c.c.ConnectionManager Waiting up to 15000ms for client to connect to ZooKeeper
  2> 1596875 INFO  (jetty-launcher-10498-thread-1) [n:127.0.0.1:39019_solr c: s: r: x: t:] o.a.s.c.c.ConnectionManager Waiting up to 15000ms for client to connect to ZooKeeper
  2> 1596881 INFO  (zkConnectionManagerCallback-10528-thread-1) [n: c: s: r: x: t:] o.a.s.c.c.ConnectionManager zkClient has connected
  2> 1596881 INFO  (jetty-launcher-10498-thread-3) [n:127.0.0.1:40923_solr c: s: r: x: t:] o.a.s.c.c.ConnectionManager Client is connected to ZooKeeper
  2> 1596884 INFO  (zkConnectionManagerCallback-10534-thread-1) [n: c: s: r: x: t:] o.a.s.c.c.ConnectionManager zkClient has connected
  2> 1596884 INFO  (jetty-launcher-10498-thread-2) [n:127.0.0.1:46409_solr c: s: r: x: t:] o.a.s.c.c.ConnectionManager Client is connected to ZooKeeper
  2> 1596888 INFO  (zkConnectionManagerCallback-10531-thread-1) [n: c: s: r: x: t:] o.a.s.c.c.ConnectionManager zkClient has connected
  2> 1596888 INFO  (jetty-launcher-10498-thread-1) [n:127.0.0.1:39019_solr c: s: r: x: t:] o.a.s.c.c.ConnectionManager Client is connected to ZooKeeper
  2> 1596902 WARN  (jetty-launcher-10498-thread-3) [n:127.0.0.1:40923_solr c: s: r: x: t:] o.a.s.c.ZkController Contents of zookeeper /security.json are world-readable; consider setting up ACLs as described in https://solr.apache.org/guide/solr/latest/deployment-guide/zookeeper-access-control.html
  2> 1596904 INFO  (jetty-launcher-10498-thread-3) [n:127.0.0.1:40923_solr c: s: r: x: t:] o.a.s.c.DistributedClusterStateUpdater Creating DistributedClusterStateUpdater with useDistributedStateUpdate=true. Solr will be using distributed cluster state updates.
  2> 1596905 INFO  (jetty-launcher-10498-thread-3) [n:127.0.0.1:40923_solr c: s: r: x: t:] o.a.s.c.OverseerElectionContext I am going to be the leader 127.0.0.1:40923_solr
  2> 1596906 INFO  (jetty-launcher-10498-thread-3) [n:127.0.0.1:40923_solr c: s: r: x: t:] o.a.s.c.Overseer Overseer (id=72149434023673862-127.0.0.1:40923_solr-n_0000000000) starting
  2> 1596936 WARN  (jetty-launcher-10498-thread-2) [n:127.0.0.1:46409_solr c: s: r: x: t:] o.a.s.c.ZkController Contents of zookeeper /security.json are world-readable; consider setting up ACLs as described in https://solr.apache.org/guide/solr/latest/deployment-guide/zookeeper-access-control.html
  2> 1597331 INFO  (jetty-launcher-10498-thread-3) [n:127.0.0.1:40923_solr c: s: r: x: t:] o.a.s.c.ZkController Register node as live in ZooKeeper:/live_nodes/127.0.0.1:40923_solr
  2> 1597522 INFO  (OverseerStateUpdate-72149434023673862-127.0.0.1:40923_solr-n_0000000000) [n:127.0.0.1:40923_solr c: s: r: x: t:] o.a.s.c.Overseer Starting to work on the main queue : 127.0.0.1:40923_solr
  2> 1597623 INFO  (jetty-launcher-10498-thread-2) [n:127.0.0.1:46409_solr c: s: r: x: t:] o.a.s.c.c.ZkStateReader Updated live nodes from ZooKeeper... (0) -> (1)
  2> 1597627 INFO  (OverseerStateUpdate-72149434023673862-127.0.0.1:40923_solr-n_0000000000) [n:127.0.0.1:40923_solr c: s: r: x: t:] o.a.s.c.c.ZkStateReader Updated live nodes from ZooKeeper... (0) -> (1)
  2> 1597638 WARN  (jetty-launcher-10498-thread-3) [n:127.0.0.1:40923_solr c: s: r: x: t:] o.a.s.c.CoreContainer Not all security plugins configured!  authentication=disabled authorization=disabled.  Solr is only as secure as you make it. Consider configuring authentication/authorization before exposing Solr to users internal or external.  See https://s.apache.org/solrsecurity for more info
  2> 1597657 INFO  (jetty-launcher-10498-thread-2) [n:127.0.0.1:46409_solr c: s: r: x: t:] o.a.s.c.DistributedClusterStateUpdater Creating DistributedClusterStateUpdater with useDistributedStateUpdate=true. Solr will be using distributed cluster state updates.
  2> 1597689 INFO  (jetty-launcher-10498-thread-2) [n:127.0.0.1:46409_solr c: s: r: x: t:] o.a.s.c.ZkController Publish node=127.0.0.1:46409_solr as DOWN
  2> 1597692 INFO  (jetty-launcher-10498-thread-2) [n:127.0.0.1:46409_solr c: s: r: x: t:] o.a.s.c.ZkController Register node as live in ZooKeeper:/live_nodes/127.0.0.1:46409_solr
  2> 1597702 INFO  (zkCallback-10533-thread-1) [n: c: s: r: x: t:] o.a.s.c.c.ZkStateReader Updated live nodes from ZooKeeper... (1) -> (2)
  2> 1597716 INFO  (zkCallback-10527-thread-1) [n: c: s: r: x: t:] o.a.s.c.c.ZkStateReader Updated live nodes from ZooKeeper... (1) -> (2)
  2> 1597717 WARN  (jetty-launcher-10498-thread-1) [n:127.0.0.1:39019_solr c: s: r: x: t:] o.a.s.c.ZkController Contents of zookeeper /security.json are world-readable; consider setting up ACLs as described in https://solr.apache.org/guide/solr/latest/deployment-guide/zookeeper-access-control.html
  2> 1597721 WARN  (jetty-launcher-10498-thread-2) [n:127.0.0.1:46409_solr c: s: r: x: t:] o.a.s.c.CoreContainer Not all security plugins configured!  authentication=disabled authorization=disabled.  Solr is only as secure as you make it. Consider configuring authentication/authorization before exposing Solr to users internal or external.  See https://s.apache.org/solrsecurity for more info
  2> 1597744 INFO  (jetty-launcher-10498-thread-1) [n:127.0.0.1:39019_solr c: s: r: x: t:] o.a.s.c.c.ZkStateReader Updated live nodes from ZooKeeper... (0) -> (2)
  2> 1597801 INFO  (jetty-launcher-10498-thread-1) [n:127.0.0.1:39019_solr c: s: r: x: t:] o.a.s.c.DistributedClusterStateUpdater Creating DistributedClusterStateUpdater with useDistributedStateUpdate=true. Solr will be using distributed cluster state updates.
  2> 1597836 INFO  (jetty-launcher-10498-thread-1) [n:127.0.0.1:39019_solr c: s: r: x: t:] o.a.s.c.ZkController Publish node=127.0.0.1:39019_solr as DOWN
  2> 1597844 INFO  (jetty-launcher-10498-thread-1) [n:127.0.0.1:39019_solr c: s: r: x: t:] o.a.s.c.ZkController Register node as live in ZooKeeper:/live_nodes/127.0.0.1:39019_solr
  2> 1597860 INFO  (zkCallback-10527-thread-1) [n: c: s: r: x: t:] o.a.s.c.c.ZkStateReader Updated live nodes from ZooKeeper... (2) -> (3)
  2> 1597860 INFO  (zkCallback-10530-thread-1) [n: c: s: r: x: t:] o.a.s.c.c.ZkStateReader Updated live nodes from ZooKeeper... (2) -> (3)
  2> 1597864 INFO  (zkCallback-10533-thread-1) [n: c: s: r: x: t:] o.a.s.c.c.ZkStateReader Updated live nodes from ZooKeeper... (2) -> (3)
  2> 1597885 WARN  (jetty-launcher-10498-thread-1) [n:127.0.0.1:39019_solr c: s: r: x: t:] o.a.s.c.CoreContainer Not all security plugins configured!  authentication=disabled authorization=disabled.  Solr is only as secure as you make it. Consider configuring authentication/authorization before exposing Solr to users internal or external.  See https://s.apache.org/solrsecurity for more info
  2> 1597904 INFO  (jetty-launcher-10498-thread-2) [n:127.0.0.1:46409_solr c: s: r: x: t:] o.a.s.c.CorePropertiesLocator Found 0 core definitions underneath /home/jenkins/jenkins-slave/workspace/Solr/Solr-Check-9.x/solr/core/build/tmp/tests-tmp/solr.cluster.placement.impl.PlacementPluginIntegrationTest_AB005F2518CF93B1-001/tempDir-001/node2
  2> 1598405 INFO  (jetty-launcher-10498-thread-3) [n:127.0.0.1:40923_solr c: s: r: x: t:] o.a.s.c.CorePropertiesLocator Found 0 core definitions underneath /home/jenkins/jenkins-slave/workspace/Solr/Solr-Check-9.x/solr/core/build/tmp/tests-tmp/solr.cluster.placement.impl.PlacementPluginIntegrationTest_AB005F2518CF93B1-001/tempDir-001/node3
  2> 1598473 INFO  (jetty-launcher-10498-thread-1) [n:127.0.0.1:39019_solr c: s: r: x: t:] o.a.s.c.CorePropertiesLocator Found 0 core definitions underneath /home/jenkins/jenkins-slave/workspace/Solr/Solr-Check-9.x/solr/core/build/tmp/tests-tmp/solr.cluster.placement.impl.PlacementPluginIntegrationTest_AB005F2518CF93B1-001/tempDir-001/node1
  2> 1598520 INFO  (jetty-launcher-10498-thread-1) [n:127.0.0.1:39019_solr c: s: r: x: t:] o.a.s.j.SolrRequestAuthorizer Creating a new SolrRequestAuthorizer
  2> 1598528 INFO  (jetty-launcher-10498-thread-2) [n:127.0.0.1:46409_solr c: s: r: x: t:] o.a.s.j.SolrRequestAuthorizer Creating a new SolrRequestAuthorizer
  2> 1598660 INFO  (jetty-launcher-10498-thread-3) [n:127.0.0.1:40923_solr c: s: r: x: t:] o.a.s.j.SolrRequestAuthorizer Creating a new SolrRequestAuthorizer
  2> 1598662 INFO  (jetty-launcher-10498-thread-1) [n:127.0.0.1:39019_solr c: s: r: x: t:] o.a.s.e.JettySolrRunner Jetty properties: {hostContext=/solr, hostPort=39019, zkHost=127.0.0.1:33785/solr}
  2> 1598692 INFO  (jetty-launcher-10498-thread-2) [n:127.0.0.1:46409_solr c: s: r: x: t:] o.a.s.e.JettySolrRunner Jetty properties: {hostContext=/solr, hostPort=46409, zkHost=127.0.0.1:33785/solr}
  2> 1598691 INFO  (jetty-launcher-10498-thread-3) [n:127.0.0.1:40923_solr c: s: r: x: t:] o.a.s.e.JettySolrRunner Jetty properties: {hostContext=/solr, hostPort=40923, zkHost=127.0.0.1:33785/solr}
  2> 1598704 INFO  (SUITE-PlacementPluginIntegrationTest-seed#[AB005F2518CF93B1]-worker) [n: c: s: r: x: t:] o.a.s.c.MiniSolrCloudCluster waitForAllNodes: numServers=3
  2> 1598704 INFO  (SUITE-PlacementPluginIntegrationTest-seed#[AB005F2518CF93B1]-worker) [n: c: s: r: x: t:] o.a.s.c.MiniSolrCloudCluster waitForNode: 127.0.0.1:39019_solr
  2> 1598704 WARN  (SUITE-PlacementPluginIntegrationTest-seed#[AB005F2518CF93B1]-worker) [n: c: s: r: x: t:] o.a.s.c.c.SolrZkClient Using default ZkCredentialsInjector. ZkCredentialsInjector is not secure, it creates an empty list of credentials which leads to 'OPEN_ACL_UNSAFE' ACLs to Zookeeper nodes
  2> 1598712 INFO  (SUITE-PlacementPluginIntegrationTest-seed#[AB005F2518CF93B1]-worker) [n: c: s: r: x: t:] o.a.s.c.c.ConnectionManager Waiting up to 15000ms for client to connect to ZooKeeper
  2> 1598721 INFO  (zkConnectionManagerCallback-10557-thread-1) [n: c: s: r: x: t:] o.a.s.c.c.ConnectionManager zkClient has connected
  2> 1598721 INFO  (SUITE-PlacementPluginIntegrationTest-seed#[AB005F2518CF93B1]-worker) [n: c: s: r: x: t:] o.a.s.c.c.ConnectionManager Client is connected to ZooKeeper
  2> 1598721 WARN  (SUITE-PlacementPluginIntegrationTest-seed#[AB005F2518CF93B1]-worker) [n: c: s: r: x: t:] o.a.s.c.c.SolrZkClient Using default ZkACLProvider. DefaultZkACLProvider is not secure, it creates 'OPEN_ACL_UNSAFE' ACLs to Zookeeper nodes
  2> 1598842 INFO  (SUITE-PlacementPluginIntegrationTest-seed#[AB005F2518CF93B1]-worker) [n: c: s: r: x: t:] o.a.s.c.c.ZkStateReader Updated live nodes from ZooKeeper... (0) -> (3)
  2> 1598845 INFO  (SUITE-PlacementPluginIntegrationTest-seed#[AB005F2518CF93B1]-worker) [n: c: s: r: x: t:] o.a.s.c.s.i.ZkClientClusterStateProvider Cluster at 127.0.0.1:33785/solr ready
  2> 1598845 INFO  (SUITE-PlacementPluginIntegrationTest-seed#[AB005F2518CF93B1]-worker) [n: c: s: r: x: t:] o.a.s.c.MiniSolrCloudCluster waitForNode: 127.0.0.1:46409_solr
  2> 1598845 INFO  (SUITE-PlacementPluginIntegrationTest-seed#[AB005F2518CF93B1]-worker) [n: c: s: r: x: t:] o.a.s.c.MiniSolrCloudCluster waitForNode: 127.0.0.1:40923_solr
  2> 1598845 WARN  (SUITE-PlacementPluginIntegrationTest-seed#[AB005F2518CF93B1]-worker) [n: c: s: r: x: t:] o.a.s.c.c.SolrZkClient Using default ZkCredentialsInjector. ZkCredentialsInjector is not secure, it creates an empty list of credentials which leads to 'OPEN_ACL_UNSAFE' ACLs to Zookeeper nodes
  2> 1598849 INFO  (SUITE-PlacementPluginIntegrationTest-seed#[AB005F2518CF93B1]-worker) [n: c: s: r: x: t:] o.a.s.c.c.ConnectionManager Waiting up to 45000ms for client to connect to ZooKeeper
  2> 1598849 INFO  (zkConnectionManagerCallback-10559-thread-1) [n: c: s: r: x: t:] o.a.s.c.c.ConnectionManager zkClient has connected
  2> 1598849 INFO  (SUITE-PlacementPluginIntegrationTest-seed#[AB005F2518CF93B1]-worker) [n: c: s: r: x: t:] o.a.s.c.c.ConnectionManager Client is connected to ZooKeeper
  2> 1598849 WARN  (SUITE-PlacementPluginIntegrationTest-seed#[AB005F2518CF93B1]-worker) [n: c: s: r: x: t:] o.a.s.c.c.SolrZkClient Using default ZkACLProvider. DefaultZkACLProvider is not secure, it creates 'OPEN_ACL_UNSAFE' ACLs to Zookeeper nodes
  2> 1599199 INFO  (TEST-PlacementPluginIntegrationTest.testDefaultConfiguration-seed#[AB005F2518CF93B1]) [n: c: s: r: x: t:] o.a.s.SolrTestCaseJ4 ###Starting testDefaultConfiguration
  2> 1601838 WARN  (TEST-PlacementPluginIntegrationTest.testDefaultConfiguration-seed#[AB005F2518CF93B1]) [n: c: s: r: x: t:] o.a.s.c.CoreContainer Not all security plugins configured!  authentication=disabled authorization=disabled.  Solr is only as secure as you make it. Consider configuring authentication/authorization before exposing Solr to users internal or external.  See https://s.apache.org/solrsecurity for more info
  2> 1601931 INFO  (TEST-PlacementPluginIntegrationTest.testDefaultConfiguration-seed#[AB005F2518CF93B1]) [n: c: s: r: x: t:] o.a.s.c.CorePropertiesLocator Found 0 core definitions underneath /home/jenkins/jenkins-slave/workspace/Solr/Solr-Check-9.x/solr/core/build/resources/test/solr
  2> 1602435 INFO  (TEST-PlacementPluginIntegrationTest.testDefaultConfiguration-seed#[AB005F2518CF93B1]) [n: c: s: r: x: t:] o.a.s.j.SolrRequestAuthorizer Creating a new SolrRequestAuthorizer
  2> 1602474 INFO  (TEST-PlacementPluginIntegrationTest.testDefaultConfiguration-seed#[AB005F2518CF93B1]) [n: c: s: r: x: t:] o.a.s.c.CoreContainer Shutting down CoreContainer instance=1859302543
  2> 1602508 INFO  (TEST-PlacementPluginIntegrationTest.testDefaultConfiguration-seed#[AB005F2518CF93B1]) [n: c: s: r: x: t:] o.a.s.m.SolrMetricManager Closing metric reporters for registry=solr.node tag=null
  2> 1602526 INFO  (TEST-PlacementPluginIntegrationTest.testDefaultConfiguration-seed#[AB005F2518CF93B1]) [n: c: s: r: x: t:] o.a.s.m.SolrMetricManager Closing metric reporters for registry=solr.jvm tag=null
  2> 1602548 INFO  (TEST-PlacementPluginIntegrationTest.testDefaultConfiguration-seed#[AB005F2518CF93B1]) [n: c: s: r: x: t:] o.a.s.m.SolrMetricManager Closing metric reporters for registry=solr.jetty tag=null
  2> 1602578 INFO  (TEST-PlacementPluginIntegrationTest.testDefaultConfiguration-seed#[AB005F2518CF93B1]) [n: c: s: r: x: t:] o.a.s.c.c.ZkStateReader Updated live nodes from ZooKeeper... (0) -> (3)
  2> 1602611 INFO  (qtp2101145143-13419-null-10562) [n:127.0.0.1:40923_solr c: s: r: x: t:null-10562] o.a.s.s.HttpSolrCall [admin] webapp=null path=/cluster/plugin params={wt=javabin&version=2} status=0 QTime=15
  2> 1602611 INFO  (TEST-PlacementPluginIntegrationTest.testDefaultConfiguration-seed#[AB005F2518CF93B1]) [n: c: s: r: x: t:] o.a.s.SolrTestCaseJ4 ###Ending testDefaultConfiguration
  2> 1602656 INFO  (TEST-PlacementPluginIntegrationTest.testAttributeFetcherImpl-seed#[AB005F2518CF93B1]) [n: c: s: r: x: t:] o.a.s.SolrTestCaseJ4 ###Starting testAttributeFetcherImpl
  2> 1602680 INFO  (OverseerThreadFactory-10543-thread-1) [n: c:PlacementPluginIntegrationTest_collection s: r: x: t:] o.a.s.c.a.c.CreateCollectionCmd Create collection PlacementPluginIntegrationTest_collection
  2> 1603143 INFO  (OverseerThreadFactory-10543-thread-1) [n: c:PlacementPluginIntegrationTest_collection s: r: x: t:] o.a.s.c.o.SliceMutator createReplica() {
  2>   "core":"PlacementPluginIntegrationTest_collection_shard2_replica_n1",
  2>   "node_name":"127.0.0.1:40923_solr",
  2>   "base_url":"http://127.0.0.1:40923/solr",
  2>   "collection":"PlacementPluginIntegrationTest_collection",
  2>   "shard":"shard2",
  2>   "state":"down",
  2>   "type":"NRT",
  2>   "operation":"ADDREPLICA",
  2>   "waitForFinalState":"false"} 
  2> 1603144 INFO  (OverseerThreadFactory-10543-thread-1) [n: c:PlacementPluginIntegrationTest_collection s: r: x: t:] o.a.s.c.o.SliceMutator createReplica() {
  2>   "core":"PlacementPluginIntegrationTest_collection_shard1_replica_n2",
  2>   "node_name":"127.0.0.1:39019_solr",
  2>   "base_url":"http://127.0.0.1:39019/solr",
  2>   "collection":"PlacementPluginIntegrationTest_collection",
  2>   "shard":"shard1",
  2>   "state":"down",
  2>   "type":"NRT",
  2>   "operation":"ADDREPLICA",
  2>   "waitForFinalState":"false"} 
  2> 1603145 INFO  (OverseerThreadFactory-10543-thread-1) [n: c:PlacementPluginIntegrationTest_collection s: r: x: t:] o.a.s.c.o.SliceMutator createReplica() {
  2>   "core":"PlacementPluginIntegrationTest_collection_shard2_replica_n3",
  2>   "node_name":"127.0.0.1:39019_solr",
  2>   "base_url":"http://127.0.0.1:39019/solr",
  2>   "collection":"PlacementPluginIntegrationTest_collection",
  2>   "shard":"shard2",
  2>   "state":"down",
  2>   "type":"NRT",
  2>   "operation":"ADDREPLICA",
  2>   "waitForFinalState":"false"} 
  2> 1603146 INFO  (OverseerThreadFactory-10543-thread-1) [n: c:PlacementPluginIntegrationTest_collection s: r: x: t:] o.a.s.c.o.SliceMutator createReplica() {
  2>   "core":"PlacementPluginIntegrationTest_collection_shard1_replica_n4",
  2>   "node_name":"127.0.0.1:46409_solr",
  2>   "base_url":"http://127.0.0.1:46409/solr",
  2>   "collection":"PlacementPluginIntegrationTest_collection",
  2>   "shard":"shard1",
  2>   "state":"down",
  2>   "type":"NRT",
  2>   "operation":"ADDREPLICA",
  2>   "waitForFinalState":"false"} 
  2> 1603163 INFO  (qtp2101145143-13421-null-10564) [n:127.0.0.1:40923_solr c: s: r: x:PlacementPluginIntegrationTest_collection_shard2_replica_n1 t:null-10564] o.a.s.h.a.CoreAdminOperation core create command qt=/admin/cores&collection.configName=conf&newCollection=true&collection=PlacementPluginIntegrationTest_collection&version=2&replicaType=NRT&coreNodeName=core_node5&name=PlacementPluginIntegrationTest_collection_shard2_replica_n1&action=CREATE&numShards=2&shard=shard2&wt=javabin
  2> 1603165 INFO  (qtp194948097-13398-null-10564) [n:127.0.0.1:46409_solr c: s: r: x:PlacementPluginIntegrationTest_collection_shard1_replica_n4 t:null-10564] o.a.s.h.a.CoreAdminOperation core create command qt=/admin/cores&collection.configName=conf&newCollection=true&collection=PlacementPluginIntegrationTest_collection&version=2&replicaType=NRT&coreNodeName=core_node8&name=PlacementPluginIntegrationTest_collection_shard1_replica_n4&action=CREATE&numShards=2&shard=shard1&wt=javabin
  2> 1603166 INFO  (qtp903753759-13410-null-10564) [n:127.0.0.1:39019_solr c: s: r: x:PlacementPluginIntegrationTest_collection_shard1_replica_n2 t:null-10564] o.a.s.h.a.CoreAdminOperation core create command qt=/admin/cores&collection.configName=conf&newCollection=true&collection=PlacementPluginIntegrationTest_collection&version=2&replicaType=NRT&coreNodeName=core_node6&name=PlacementPluginIntegrationTest_collection_shard1_replica_n2&action=CREATE&numShards=2&shard=shard1&wt=javabin
  2> 1603167 INFO  (qtp903753759-13408-null-10564) [n:127.0.0.1:39019_solr c: s: r: x:PlacementPluginIntegrationTest_collection_shard2_replica_n3 t:null-10564] o.a.s.h.a.CoreAdminOperation core create command qt=/admin/cores&collection.configName=conf&newCollection=true&collection=PlacementPluginIntegrationTest_collection&version=2&replicaType=NRT&coreNodeName=core_node7&name=PlacementPluginIntegrationTest_collection_shard2_replica_n3&action=CREATE&numShards=2&shard=shard2&wt=javabin
  2> 1603205 INFO  (qtp194948097-13398-null-10564) [n:127.0.0.1:46409_solr c:PlacementPluginIntegrationTest_collection s:shard1 r:core_node8 x:PlacementPluginIntegrationTest_collection_shard1_replica_n4 t:null-10564] o.a.s.c.SolrConfig Using Lucene MatchVersion: 9.9.2
  2> 1603215 INFO  (qtp903753759-13408-null-10564) [n:127.0.0.1:39019_solr c:PlacementPluginIntegrationTest_collection s:shard2 r:core_node7 x:PlacementPluginIntegrationTest_collection_shard2_replica_n3 t:null-10564] o.a.s.c.SolrConfig Using Lucene MatchVersion: 9.9.2
  2> 1603216 INFO  (qtp903753759-13410-null-10564) [n:127.0.0.1:39019_solr c:PlacementPluginIntegrationTest_collection s:shard1 r:core_node6 x:PlacementPluginIntegrationTest_collection_shard1_replica_n2 t:null-10564] o.a.s.c.SolrConfig Using Lucene MatchVersion: 9.9.2
  2> 1603219 INFO  (qtp2101145143-13421-null-10564) [n:127.0.0.1:40923_solr c:PlacementPluginIntegrationTest_collection s:shard2 r:core_node5 x:PlacementPluginIntegrationTest_collection_shard2_replica_n1 t:null-10564] o.a.s.c.SolrConfig Using Lucene MatchVersion: 9.9.2
  2> 1603221 INFO  (qtp903753759-13408-null-10564) [n:127.0.0.1:39019_solr c:PlacementPluginIntegrationTest_collection s:shard2 r:core_node7 x:PlacementPluginIntegrationTest_collection_shard2_replica_n3 t:null-10564] o.a.s.s.IndexSchema Schema name=minimal
  2> 1603221 INFO  (qtp903753759-13408-null-10564) [n:127.0.0.1:39019_solr c:PlacementPluginIntegrationTest_collection s:shard2 r:core_node7 x:PlacementPluginIntegrationTest_collection_shard2_replica_n3 t:null-10564] o.a.s.s.IndexSchema Loaded schema minimal/1.1 with uniqueid field id
  2> 1603221 INFO  (qtp903753759-13408-null-10564) [n:127.0.0.1:39019_solr c:PlacementPluginIntegrationTest_collection s:shard2 r:core_node7 x:PlacementPluginIntegrationTest_collection_shard2_replica_n3 t:null-10564] o.a.s.c.CoreContainer Creating SolrCore 'PlacementPluginIntegrationTest_collection_shard2_replica_n3' using configuration from configset conf, trusted=true
  2> 1603221 INFO  (qtp903753759-13408-null-10564) [n:127.0.0.1:39019_solr c:PlacementPluginIntegrationTest_collection s:shard2 r:core_node7 x:PlacementPluginIntegrationTest_collection_shard2_replica_n3 t:null-10564] o.a.s.c.SolrCore Opening new SolrCore at [/home/jenkins/jenkins-slave/workspace/Solr/Solr-Check-9.x/solr/core/build/tmp/tests-tmp/solr.cluster.placement.impl.PlacementPluginIntegrationTest_AB005F2518CF93B1-001/tempDir-001/node1/PlacementPluginIntegrationTest_collection_shard2_replica_n3], dataDir=[/home/jenkins/jenkins-slave/workspace/Solr/Solr-Check-9.x/solr/core/build/tmp/tests-tmp/solr.cluster.placement.impl.PlacementPluginIntegrationTest_AB005F2518CF93B1-001/tempDir-001/node1/PlacementPluginIntegrationTest_collection_shard2_replica_n3/data/]
  2> 1603229 INFO  (qtp903753759-13410-null-10564) [n:127.0.0.1:39019_solr c:PlacementPluginIntegrationTest_collection s:shard1 r:core_node6 x:PlacementPluginIntegrationTest_collection_shard1_replica_n2 t:null-10564] o.a.s.s.IndexSchema Schema name=minimal
  2> 1603229 INFO  (qtp903753759-13410-null-10564) [n:127.0.0.1:39019_solr c:PlacementPluginIntegrationTest_collection s:shard1 r:core_node6 x:PlacementPluginIntegrationTest_collection_shard1_replica_n2 t:null-10564] o.a.s.s.IndexSchema Loaded schema minimal/1.1 with uniqueid field id
  2> 1603229 INFO  (qtp903753759-13410-null-10564) [n:127.0.0.1:39019_solr c:PlacementPluginIntegrationTest_collection s:shard1 r:core_node6 x:PlacementPluginIntegrationTest_collection_shard1_replica_n2 t:null-10564] o.a.s.c.CoreContainer Creating SolrCore 'PlacementPluginIntegrationTest_collection_shard1_replica_n2' using configuration from configset conf, trusted=true
  2> 1603230 INFO  (qtp903753759-13410-null-10564) [n:127.0.0.1:39019_solr c:PlacementPluginIntegrationTest_collection s:shard1 r:core_node6 x:PlacementPluginIntegrationTest_collection_shard1_replica_n2 t:null-10564] o.a.s.c.SolrCore Opening new SolrCore at [/home/jenkins/jenkins-slave/workspace/Solr/Solr-Check-9.x/solr/core/build/tmp/tests-tmp/solr.cluster.placement.impl.PlacementPluginIntegrationTest_AB005F2518CF93B1-001/tempDir-001/node1/PlacementPluginIntegrationTest_collection_shard1_replica_n2], dataDir=[/home/jenkins/jenkins-slave/workspace/Solr/Solr-Check-9.x/solr/core/build/tmp/tests-tmp/solr.cluster.placement.impl.PlacementPluginIntegrationTest_AB005F2518CF93B1-001/tempDir-001/node1/PlacementPluginIntegrationTest_collection_shard1_replica_n2/data/]
  2> 1603231 INFO  (qtp194948097-13398-null-10564) [n:127.0.0.1:46409_solr c:PlacementPluginIntegrationTest_collection s:shard1 r:core_node8 x:PlacementPluginIntegrationTest_collection_shard1_replica_n4 t:null-10564] o.a.s.s.IndexSchema Schema name=minimal
  2> 1603231 INFO  (qtp194948097-13398-null-10564) [n:127.0.0.1:46409_solr c:PlacementPluginIntegrationTest_collection s:shard1 r:core_node8 x:PlacementPluginIntegrationTest_collection_shard1_replica_n4 t:null-10564] o.a.s.s.IndexSchema Loaded schema minimal/1.1 with uniqueid field id
  2> 1603231 INFO  (qtp194948097-13398-null-10564) [n:127.0.0.1:46409_solr c:PlacementPluginIntegrationTest_collection s:shard1 r:core_node8 x:PlacementPluginIntegrationTest_collection_shard1_replica_n4 t:null-10564] o.a.s.c.CoreContainer Creating SolrCore 'PlacementPluginIntegrationTest_collection_shard1_replica_n4' using configuration from configset conf, trusted=true
  2> 1603232 INFO  (qtp194948097-13398-null-10564) [n:127.0.0.1:46409_solr c:PlacementPluginIntegrationTest_collection s:shard1 r:core_node8 x:PlacementPluginIntegrationTest_collection_shard1_replica_n4 t:null-10564] o.a.s.c.SolrCore Opening new SolrCore at [/home/jenkins/jenkins-slave/workspace/Solr/Solr-Check-9.x/solr/core/build/tmp/tests-tmp/solr.cluster.placement.impl.PlacementPluginIntegrationTest_AB005F2518CF93B1-001/tempDir-001/node2/PlacementPluginIntegrationTest_collection_shard1_replica_n4], dataDir=[/home/jenkins/jenkins-slave/workspace/Solr/Solr-Check-9.x/solr/core/build/tmp/tests-tmp/solr.cluster.placement.impl.PlacementPluginIntegrationTest_AB005F2518CF93B1-001/tempDir-001/node2/PlacementPluginIntegrationTest_collection_shard1_replica_n4/data/]
  2> 1603239 INFO  (qtp2101145143-13421-null-10564) [n:127.0.0.1:40923_solr c:PlacementPluginIntegrationTest_collection s:shard2 r:core_node5 x:PlacementPluginIntegrationTest_collection_shard2_replica_n1 t:null-10564] o.a.s.s.IndexSchema Schema name=minimal
  2> 1603239 INFO  (qtp2101145143-13421-null-10564) [n:127.0.0.1:40923_solr c:PlacementPluginIntegrationTest_collection s:shard2 r:core_node5 x:PlacementPluginIntegrationTest_collection_shard2_replica_n1 t:null-10564] o.a.s.s.IndexSchema Loaded schema minimal/1.1 with uniqueid field id
  2> 1603239 INFO  (qtp2101145143-13421-null-10564) [n:127.0.0.1:40923_solr c:PlacementPluginIntegrationTest_collection s:shard2 r:core_node5 x:PlacementPluginIntegrationTest_collection_shard2_replica_n1 t:null-10564] o.a.s.c.CoreContainer Creating SolrCore 'PlacementPluginIntegrationTest_collection_shard2_replica_n1' using configuration from configset conf, trusted=true
  2> 1603239 INFO  (qtp2101145143-13421-null-10564) [n:127.0.0.1:40923_solr c:PlacementPluginIntegrationTest_collection s:shard2 r:core_node5 x:PlacementPluginIntegrationTest_collection_shard2_replica_n1 t:null-10564] o.a.s.c.SolrCore Opening new SolrCore at [/home/jenkins/jenkins-slave/workspace/Solr/Solr-Check-9.x/solr/core/build/tmp/tests-tmp/solr.cluster.placement.impl.PlacementPluginIntegrationTest_AB005F2518CF93B1-001/tempDir-001/node3/PlacementPluginIntegrationTest_collection_shard2_replica_n1], dataDir=[/home/jenkins/jenkins-slave/workspace/Solr/Solr-Check-9.x/solr/core/build/tmp/tests-tmp/solr.cluster.placement.impl.PlacementPluginIntegrationTest_AB005F2518CF93B1-001/tempDir-001/node3/PlacementPluginIntegrationTest_collection_shard2_replica_n1/data/]
  2> 1603322 INFO  (qtp903753759-13410-null-10564) [n:127.0.0.1:39019_solr c:PlacementPluginIntegrationTest_collection s:shard1 r:core_node6 x:PlacementPluginIntegrationTest_collection_shard1_replica_n2 t:null-10564] o.a.s.j.SolrRequestAuthorizer Creating a new SolrRequestAuthorizer
  2> 1603349 INFO  (qtp903753759-13410-null-10564) [n:127.0.0.1:39019_solr c:PlacementPluginIntegrationTest_collection s:shard1 r:core_node6 x:PlacementPluginIntegrationTest_collection_shard1_replica_n2 t:null-10564] o.a.s.u.UpdateHandler Using UpdateLog implementation: org.apache.solr.update.UpdateLog
  2> 1603349 INFO  (qtp903753759-13410-null-10564) [n:127.0.0.1:39019_solr c:PlacementPluginIntegrationTest_collection s:shard1 r:core_node6 x:PlacementPluginIntegrationTest_collection_shard1_replica_n2 t:null-10564] o.a.s.u.UpdateLog Initializing UpdateLog: dataDir=null defaultSyncLevel=FLUSH numRecordsToKeep=100 maxNumLogsToKeep=10 numVersionBuckets=65536
  2> 1603364 INFO  (qtp903753759-13410-null-10564) [n:127.0.0.1:39019_solr c:PlacementPluginIntegrationTest_collection s:shard1 r:core_node6 x:PlacementPluginIntegrationTest_collection_shard1_replica_n2 t:null-10564] o.a.s.u.CommitTracker Hard AutoCommit: disabled
  2> 1603364 INFO  (qtp903753759-13410-null-10564) [n:127.0.0.1:39019_solr c:PlacementPluginIntegrationTest_collection s:shard1 r:core_node6 x:PlacementPluginIntegrationTest_collection_shard1_replica_n2 t:null-10564] o.a.s.u.CommitTracker Soft AutoCommit: disabled
  2> 1603369 INFO  (qtp903753759-13408-null-10564) [n:127.0.0.1:39019_solr c:PlacementPluginIntegrationTest_collection s:shard2 r:core_node7 x:PlacementPluginIntegrationTest_collection_shard2_replica_n3 t:null-10564] o.a.s.u.UpdateHandler Using UpdateLog implementation: org.apache.solr.update.UpdateLog
  2> 1603369 INFO  (qtp903753759-13408-null-10564) [n:127.0.0.1:39019_solr c:PlacementPluginIntegrationTest_collection s:shard2 r:core_node7 x:PlacementPluginIntegrationTest_collection_shard2_replica_n3 t:null-10564] o.a.s.u.UpdateLog Initializing UpdateLog: dataDir=null defaultSyncLevel=FLUSH numRecordsToKeep=100 maxNumLogsToKeep=10 numVersionBuckets=65536
  2> 1603370 INFO  (qtp903753759-13408-null-10564) [n:127.0.0.1:39019_solr c:PlacementPluginIntegrationTest_collection s:shard2 r:core_node7 x:PlacementPluginIntegrationTest_collection_shard2_replica_n3 t:null-10564] o.a.s.u.CommitTracker Hard AutoCommit: disabled
  2> 1603370 INFO  (qtp903753759-13408-null-10564) [n:127.0.0.1:39019_solr c:PlacementPluginIntegrationTest_collection s:shard2 r:core_node7 x:PlacementPluginIntegrationTest_collection_shard2_replica_n3 t:null-10564] o.a.s.u.CommitTracker Soft AutoCommit: disabled
  2> 1603381 INFO  (qtp903753759-13410-null-10564) [n:127.0.0.1:39019_solr c:PlacementPluginIntegrationTest_collection s:shard1 r:core_node6 x:PlacementPluginIntegrationTest_collection_shard1_replica_n2 t:null-10564] o.a.s.r.ManagedResourceStorage Configured ZooKeeperStorageIO with znodeBase: /configs/conf
  2> 1603382 INFO  (qtp903753759-13410-null-10564) [n:127.0.0.1:39019_solr c:PlacementPluginIntegrationTest_collection s:shard1 r:core_node6 x:PlacementPluginIntegrationTest_collection_shard1_replica_n2 t:null-10564] o.a.s.r.ManagedResourceStorage Loaded null at path _rest_managed.json using ZooKeeperStorageIO:path=/configs/conf
  2> 1603382 INFO  (qtp903753759-13410-null-10564) [n:127.0.0.1:39019_solr c:PlacementPluginIntegrationTest_collection s:shard1 r:core_node6 x:PlacementPluginIntegrationTest_collection_shard1_replica_n2 t:null-10564] o.a.s.h.ReplicationHandler Commits will be reserved for 10000 ms
  2> 1603385 INFO  (qtp903753759-13408-null-10564) [n:127.0.0.1:39019_solr c:PlacementPluginIntegrationTest_collection s:shard2 r:core_node7 x:PlacementPluginIntegrationTest_collection_shard2_replica_n3 t:null-10564] o.a.s.r.ManagedResourceStorage Configured ZooKeeperStorageIO with znodeBase: /configs/conf
  2> 1603387 INFO  (qtp903753759-13408-null-10564) [n:127.0.0.1:39019_solr c:PlacementPluginIntegrationTest_collection s:shard2 r:core_node7 x:PlacementPluginIntegrationTest_collection_shard2_replica_n3 t:null-10564] o.a.s.r.ManagedResourceStorage Loaded null at path _rest_managed.json using ZooKeeperStorageIO:path=/configs/conf
  2> 1603388 INFO  (qtp903753759-13408-null-10564) [n:127.0.0.1:39019_solr c:PlacementPluginIntegrationTest_collection s:shard2 r:core_node7 x:PlacementPluginIntegrationTest_collection_shard2_replica_n3 t:null-10564] o.a.s.h.ReplicationHandler Commits will be reserved for 10000 ms
  2> 1603389 INFO  (searcherExecutor-10579-thread-1-processing-PlacementPluginIntegrationTest_collection_shard1_replica_n2 null-10564 core_node6 127.0.0.1:39019_solr PlacementPluginIntegrationTest_collection shard1) [n:127.0.0.1:39019_solr c:PlacementPluginIntegrationTest_collection s:shard1 r:core_node6 x:PlacementPluginIntegrationTest_collection_shard1_replica_n2 t:null-10564] o.a.s.c.SolrCore Registered new searcher autowarm time: 0 ms
  2> 1603402 INFO  (searcherExecutor-10577-thread-1-processing-PlacementPluginIntegrationTest_collection_shard2_replica_n3 null-10564 core_node7 127.0.0.1:39019_solr PlacementPluginIntegrationTest_collection shard2) [n:127.0.0.1:39019_solr c:PlacementPluginIntegrationTest_collection s:shard2 r:core_node7 x:PlacementPluginIntegrationTest_collection_shard2_replica_n3 t:null-10564] o.a.s.c.SolrCore Registered new searcher autowarm time: 0 ms
  2> 1603408 INFO  (qtp194948097-13398-null-10564) [n:127.0.0.1:46409_solr c:PlacementPluginIntegrationTest_

[...truncated too long message...]

45 deploying and undeploying a collection level package in 51438ms
ok 46 Affinity placement plugin using sysprop in 71992ms
ok 47 Random placement plugin using ENV in 65851ms
ok 48 Check help command in 19736ms
ok 49 basic post with a type specified in 27337ms
ok 50 basic post with c parameter instead of url parameter in 18565ms
ok 51 basic post WITHOUT a type specified in 52596ms
ok 52 crawling a directory in 22148ms
ok 53 crawling a web site in 22148ms
ok 54 commit and optimize and delete in 16664ms
ok 55 args mode in 31315ms
ok 56 stdin mode in 15198ms
ok 57 post solr log into solr via script in 50428ms
ok 58 post solr log into solr via cli in 35508ms
ok 59 allowPaths - backup in 71916ms
ok 60 start solr with ssl in 74879ms
ok 61 use different hostname when not checking peer-name in 119063ms
ok 62 start solr with ssl and auth in 62458ms
ok 63 start solr with client truststore and security manager in 69564ms
ok 64 start solr with mTLS needed in 210261ms
ok 65 start solr with mTLS wanted in 184104ms
not ok 66 test keystore reload in 109800ms
# (from function `assert_output' in file /home/jenkins/jenkins-slave/workspace/Solr/Solr-Check-9.x/.gradle/node/packaging/node_modules/bats-assert/src/assert.bash, line 247,
#  in test file test/test_ssl.bats, line 540)
#   `assert_output --partial "Created collection 'test'"' failed
# Waiting up to 180 seconds to see Solr running on port 36421 [|]   [/]   [-]   [\]   [|]   [/]   [-]   [\]   [|]   [/]   [-]   [\]
# Started Solr server on port 36421 (pid=3669). Happy searching!
#
#     INFO  - 2024-02-07 00:52:26.923; org.apache.solr.util.configuration.SSLConfigurations; Setting javax.net.ssl.keyStorePassword
# INFO  - 2024-02-07 00:52:26.927; org.apache.solr.util.configuration.SSLConfigurations; Setting javax.net.ssl.trustStorePassword
# INFO  - 2024-02-07 00:52:28.838; org.eclipse.jetty.util.ssl.SslContextFactory; x509=X509@5241cf67(cert1,h=[localhost],a=[/127.0.0.1],w=[]) for Client@55795845[provider=null,keyStore=file:///tmp/bats-run-BN1REM/test/66/ssl/server1.keystore.p12,trustStore=file:///tmp/bats-run-BN1REM/test/66/ssl/server1.keystore.p12]
# Waiting up to 180 seconds to see Solr running on port 36422 [|]   [/]   [-]   [\]   [|]   [/]   [-]   [\]   [|]   [/]
# Started Solr server on port 36422 (pid=4018). Happy searching!
#
#     INFO  - 2024-02-07 00:52:53.572; org.apache.solr.util.configuration.SSLConfigurations; Setting javax.net.ssl.keyStorePassword
# INFO  - 2024-02-07 00:52:53.590; org.apache.solr.util.configuration.SSLConfigurations; Setting javax.net.ssl.trustStorePassword
# INFO  - 2024-02-07 00:52:57.434; org.eclipse.jetty.util.ssl.SslContextFactory; x509=X509@77192705(cert1,h=[localhost],a=[/127.0.0.1],w=[]) for Client@119f1f2a[provider=null,keyStore=file:///tmp/bats-run-BN1REM/test/66/ssl/server2.keystore.p12,trustStore=file:///tmp/bats-run-BN1REM/test/66/ssl/server2.keystore.p12]
#
# -- output does not contain substring --
# substring (1 lines):
#   Created collection 'test'
# output (8 lines):
#   WARNING: Using _default configset with data driven schema functionality. NOT RECOMMENDED for production use.
#            To turn off: bin/solr config -c test -p 36422 -action set-user-property -property update.autoCreateFields -value false
#   INFO  - 2024-02-07 00:53:15.931; org.apache.solr.util.configuration.SSLConfigurations; Setting javax.net.ssl.keyStorePassword
#   INFO  - 2024-02-07 00:53:15.940; org.apache.solr.util.configuration.SSLConfigurations; Setting javax.net.ssl.trustStorePassword
#   WARN  - 2024-02-07 00:53:21.796; org.apache.solr.common.cloud.SolrZkClient; Using default ZkCredentialsInjector. ZkCredentialsInjector is not secure, it creates an empty list of credentials which leads to 'OPEN_ACL_UNSAFE' ACLs to Zookeeper nodes
#   WARN  - 2024-02-07 00:53:21.916; org.apache.solr.common.cloud.SolrZkClient; Using default ZkACLProvider. DefaultZkACLProvider is not secure, it creates 'OPEN_ACL_UNSAFE' ACLs to Zookeeper nodes
#
#   ERROR: Error from server at https://localhost:36421/solr/admin/collections?action=CREATE&name=test&collection.configName=test&numShards=2&nrtReplicas=1&wt=javabin&version=2: Underlying core creation failed while creating collection: test
# --
#
# Please find the SOLR_HOME snapshot for failed test #7 at: /home/jenkins/jenkins-slave/workspace/Solr/Solr-Check-9.x/solr/packaging/build/test-output/failure-snapshots/66-7
# Last output:
# INFO  - 2024-02-07 00:53:38.338; org.apache.solr.util.configuration.SSLConfigurations; Setting javax.net.ssl.keyStorePassword
# INFO  - 2024-02-07 00:53:38.346; org.apache.solr.util.configuration.SSLConfigurations; Setting javax.net.ssl.trustStorePassword
# WARN  - 2024-02-07 00:53:43.137; org.apache.solr.common.cloud.SolrZkClient; Using default ZkCredentialsInjector. ZkCredentialsInjector is not secure, it creates an empty list of credentials which leads to 'OPEN_ACL_UNSAFE' ACLs to Zookeeper nodes
# WARN  - 2024-02-07 00:53:43.432; org.apache.solr.common.cloud.SolrZkClient; Using default ZkACLProvider. DefaultZkACLProvider is not secure, it creates 'OPEN_ACL_UNSAFE' ACLs to Zookeeper nodes
ok 67 SOLR-11740 check 'solr stop' connection in 50859ms
ok 68 stop command for single port in 64964ms
ok 69 status detects locally running solr in 30088ms
ok 70 status does not expose cli parameters to end user in 1348ms
ok 71 listing out files in 10719ms
ok 72 copying files around in 25800ms
ok 73 upconfig in 9413ms
ok 74 zkcli.sh gets 'solrhome' from 'solr.home' system property in 1706ms
ok 75 zkcli.sh gets 'solrhome' from 'solrhome' command line option in 2266ms
ok 76 Cleanup in 2072ms

> Task :solr:packaging:integrationTests FAILED

ERROR: The following test(s) have failed:
  - org.apache.solr.client.solrj.TestLBHttp2SolrClient.testTwoServers (:solr:solrj)
    Test output: /home/jenkins/jenkins-slave/workspace/Solr/Solr-Check-9.x/solr/solrj/build/test-results/test/outputs/OUTPUT-org.apache.solr.client.solrj.TestLBHttp2SolrClient.txt
    Reproduce with: gradlew :solr:solrj:test --tests "org.apache.solr.client.solrj.TestLBHttp2SolrClient.testTwoServers" -Ptests.jvms=4 -Ptests.haltonfailure=false "-Ptests.jvmargs=-XX:TieredStopAtLevel=1 -XX:+UseParallelGC -XX:ActiveProcessorCount=1 -XX:ReservedCodeCacheSize=120m" -Ptests.seed=AB005F2518CF93B1 -Ptests.multiplier=2 -Ptests.badapples=false -Ptests.file.encoding=ISO-8859-1

  - org.apache.solr.cli.PostToolTest.testBasicRun (:solr:core)
    Test output: /home/jenkins/jenkins-slave/workspace/Solr/Solr-Check-9.x/solr/core/build/test-results/test/outputs/OUTPUT-org.apache.solr.cli.PostToolTest.txt
    Reproduce with: gradlew :solr:core:test --tests "org.apache.solr.cli.PostToolTest.testBasicRun" -Ptests.jvms=4 -Ptests.haltonfailure=false "-Ptests.jvmargs=-XX:TieredStopAtLevel=1 -XX:+UseParallelGC -XX:ActiveProcessorCount=1 -XX:ReservedCodeCacheSize=120m" -Ptests.seed=AB005F2518CF93B1 -Ptests.multiplier=2 -Ptests.badapples=false -Ptests.file.encoding=ISO-8859-1

  - org.apache.solr.cluster.placement.impl.PlacementPluginIntegrationTest.testNodeTypeIntegration (:solr:core)
    Test output: /home/jenkins/jenkins-slave/workspace/Solr/Solr-Check-9.x/solr/core/build/test-results/test/outputs/OUTPUT-org.apache.solr.cluster.placement.impl.PlacementPluginIntegrationTest.txt
    Reproduce with: gradlew :solr:core:test --tests "org.apache.solr.cluster.placement.impl.PlacementPluginIntegrationTest.testNodeTypeIntegration" -Ptests.jvms=4 -Ptests.haltonfailure=false "-Ptests.jvmargs=-XX:TieredStopAtLevel=1 -XX:+UseParallelGC -XX:ActiveProcessorCount=1 -XX:ReservedCodeCacheSize=120m" -Ptests.seed=AB005F2518CF93B1 -Ptests.multiplier=2 -Ptests.badapples=false -Ptests.file.encoding=ISO-8859-1

  - org.apache.solr.bench.DockMakerTest.testRealisticUnicode (:solr:benchmark)
    Test output: /home/jenkins/jenkins-slave/workspace/Solr/Solr-Check-9.x/solr/benchmark/build/test-results/test/outputs/OUTPUT-org.apache.solr.bench.DockMakerTest.txt
    Reproduce with: gradlew :solr:benchmark:test --tests "org.apache.solr.bench.DockMakerTest.testRealisticUnicode" -Ptests.jvms=4 -Ptests.haltonfailure=false "-Ptests.jvmargs=-XX:TieredStopAtLevel=1 -XX:+UseParallelGC -XX:ActiveProcessorCount=1 -XX:ReservedCodeCacheSize=120m" -Ptests.seed=AB005F2518CF93B1 -Ptests.multiplier=2 -Ptests.badapples=false -Ptests.file.encoding=ISO-8859-1

WARNING: there were unreferenced files under license folder:
  - /home/jenkins/jenkins-slave/workspace/Solr/Solr-Check-9.x/solr/licenses/jakarta.inject-2.6.1.jar.sha1

FAILURE: Build failed with an exception.

* Where:
Build file '/home/jenkins/jenkins-slave/workspace/Solr/Solr-Check-9.x/solr/packaging/build.gradle' line: 301

* What went wrong:
Execution failed for task ':solr:packaging:integrationTests'.
> Process 'command '/home/jenkins/jenkins-slave/workspace/Solr/Solr-Check-9.x/.gradle/node/packaging/node_modules/bats/bin/bats'' finished with non-zero exit value 1

* Try:
> Run with --stacktrace option to get the stack trace.
> Run with --info or --debug option to get more log output.
> Get more help at https://help.gradle.org.

Deprecated Gradle features were used in this build, making it incompatible with Gradle 9.0.

You can use '--warning-mode all' to show the individual deprecation warnings and determine if they come from your own scripts or plugins.

For more on this, please refer to https://docs.gradle.org/8.4/userguide/command_line_interface.html#sec:command_line_warnings in the Gradle documentation.

BUILD FAILED in 3h 17m 34s
693 actionable tasks: 693 executed

Publishing build scan...
https://ge.apache.org/s/5pkw3jptlor7e

Build step 'Invoke Gradle script' changed build result to FAILURE
Build step 'Invoke Gradle script' marked build as failure
Archiving artifacts
Recording test results
[Checks API] No suitable checks publisher found.
Email was triggered for: Failure - Any
Sending email for trigger: Failure - Any

[JENKINS] Solr » Solr-Check-9.x - Build # 218 - Still Failing!

Posted by Apache Jenkins Server <je...@builds.apache.org>.
Build: https://ci-builds.apache.org/job/Solr/job/Solr-Check-9.x/218/

3 tests failed.
FAILED:  org.apache.solr.cloud.CollectionsAPISolrJTest.testDeleteAliasedCollection

Error Message:
org.junit.ComparisonFailure: SolrDocument{id=1, _version_=1790232259811344384, _root_=1} expected:<[2]> but was:<[1]>

Stack Trace:
org.junit.ComparisonFailure: SolrDocument{id=1, _version_=1790232259811344384, _root_=1} expected:<[2]> but was:<[1]>
	at __randomizedtesting.SeedInfo.seed([CAC03E8425DE12D2:DDC3D50058EBC29]:0)
	at org.junit.Assert.assertEquals(Assert.java:117)
	at org.apache.solr.cloud.CollectionsAPISolrJTest.assertDoc(CollectionsAPISolrJTest.java:1083)
	at org.apache.solr.cloud.CollectionsAPISolrJTest.testDeleteAliasedCollection(CollectionsAPISolrJTest.java:1030)
	at java.base/jdk.internal.reflect.NativeMethodAccessorImpl.invoke0(Native Method)
	at java.base/jdk.internal.reflect.NativeMethodAccessorImpl.invoke(NativeMethodAccessorImpl.java:62)
	at java.base/jdk.internal.reflect.DelegatingMethodAccessorImpl.invoke(DelegatingMethodAccessorImpl.java:43)
	at java.base/java.lang.reflect.Method.invoke(Method.java:566)
	at com.carrotsearch.randomizedtesting.RandomizedRunner.invoke(RandomizedRunner.java:1758)
	at com.carrotsearch.randomizedtesting.RandomizedRunner$8.evaluate(RandomizedRunner.java:946)
	at com.carrotsearch.randomizedtesting.RandomizedRunner$9.evaluate(RandomizedRunner.java:982)
	at com.carrotsearch.randomizedtesting.RandomizedRunner$10.evaluate(RandomizedRunner.java:996)
	at com.carrotsearch.randomizedtesting.rules.SystemPropertiesRestoreRule$1.evaluate(SystemPropertiesRestoreRule.java:80)
	at org.junit.rules.RunRules.evaluate(RunRules.java:20)
	at org.apache.lucene.tests.util.TestRuleSetupTeardownChained$1.evaluate(TestRuleSetupTeardownChained.java:48)
	at org.apache.lucene.tests.util.AbstractBeforeAfterRule$1.evaluate(AbstractBeforeAfterRule.java:43)
	at org.apache.lucene.tests.util.TestRuleThreadAndTestName$1.evaluate(TestRuleThreadAndTestName.java:45)
	at org.apache.lucene.tests.util.TestRuleIgnoreAfterMaxFailures$1.evaluate(TestRuleIgnoreAfterMaxFailures.java:60)
	at org.apache.lucene.tests.util.TestRuleMarkFailure$1.evaluate(TestRuleMarkFailure.java:44)
	at org.junit.rules.RunRules.evaluate(RunRules.java:20)
	at com.carrotsearch.randomizedtesting.rules.StatementAdapter.evaluate(StatementAdapter.java:36)
	at com.carrotsearch.randomizedtesting.ThreadLeakControl$StatementRunner.run(ThreadLeakControl.java:390)
	at com.carrotsearch.randomizedtesting.ThreadLeakControl.forkTimeoutingTask(ThreadLeakControl.java:843)
	at com.carrotsearch.randomizedtesting.ThreadLeakControl$3.evaluate(ThreadLeakControl.java:490)
	at com.carrotsearch.randomizedtesting.RandomizedRunner.runSingleTest(RandomizedRunner.java:955)
	at com.carrotsearch.randomizedtesting.RandomizedRunner$5.evaluate(RandomizedRunner.java:840)
	at com.carrotsearch.randomizedtesting.RandomizedRunner$6.evaluate(RandomizedRunner.java:891)
	at com.carrotsearch.randomizedtesting.RandomizedRunner$7.evaluate(RandomizedRunner.java:902)
	at com.carrotsearch.randomizedtesting.rules.StatementAdapter.evaluate(StatementAdapter.java:36)
	at com.carrotsearch.randomizedtesting.rules.StatementAdapter.evaluate(StatementAdapter.java:36)
	at org.apache.lucene.tests.util.AbstractBeforeAfterRule$1.evaluate(AbstractBeforeAfterRule.java:43)
	at org.apache.lucene.tests.util.AbstractBeforeAfterRule$1.evaluate(AbstractBeforeAfterRule.java:43)
	at com.carrotsearch.randomizedtesting.rules.SystemPropertiesRestoreRule$1.evaluate(SystemPropertiesRestoreRule.java:80)
	at org.junit.rules.RunRules.evaluate(RunRules.java:20)
	at org.apache.lucene.tests.util.AbstractBeforeAfterRule$1.evaluate(AbstractBeforeAfterRule.java:43)
	at com.carrotsearch.randomizedtesting.rules.StatementAdapter.evaluate(StatementAdapter.java:36)
	at org.apache.lucene.tests.util.TestRuleStoreClassName$1.evaluate(TestRuleStoreClassName.java:38)
	at com.carrotsearch.randomizedtesting.rules.NoShadowingOrOverridesOnMethodsRule$1.evaluate(NoShadowingOrOverridesOnMethodsRule.java:40)
	at com.carrotsearch.randomizedtesting.rules.NoShadowingOrOverridesOnMethodsRule$1.evaluate(NoShadowingOrOverridesOnMethodsRule.java:40)
	at com.carrotsearch.randomizedtesting.rules.StatementAdapter.evaluate(StatementAdapter.java:36)
	at com.carrotsearch.randomizedtesting.rules.StatementAdapter.evaluate(StatementAdapter.java:36)
	at org.apache.lucene.tests.util.TestRuleAssertionsRequired$1.evaluate(TestRuleAssertionsRequired.java:53)
	at org.apache.lucene.tests.util.AbstractBeforeAfterRule$1.evaluate(AbstractBeforeAfterRule.java:43)
	at org.apache.lucene.tests.util.TestRuleMarkFailure$1.evaluate(TestRuleMarkFailure.java:44)
	at org.apache.lucene.tests.util.TestRuleIgnoreAfterMaxFailures$1.evaluate(TestRuleIgnoreAfterMaxFailures.java:60)
	at org.apache.lucene.tests.util.TestRuleIgnoreTestSuites$1.evaluate(TestRuleIgnoreTestSuites.java:47)
	at org.junit.rules.RunRules.evaluate(RunRules.java:20)
	at com.carrotsearch.randomizedtesting.rules.StatementAdapter.evaluate(StatementAdapter.java:36)
	at com.carrotsearch.randomizedtesting.ThreadLeakControl$StatementRunner.run(ThreadLeakControl.java:390)
	at com.carrotsearch.randomizedtesting.ThreadLeakControl.lambda$forkTimeoutingTask$0(ThreadLeakControl.java:850)
	at java.base/java.lang.Thread.run(Thread.java:829)


FAILED:  org.apache.solr.cloud.FullSolrCloudDistribCmdsTest.testDeleteByIdImplicitRouter

Error Message:
java.lang.AssertionError: expected:<COMPLETED> but was:<FAILED>

Stack Trace:
java.lang.AssertionError: expected:<COMPLETED> but was:<FAILED>
	at __randomizedtesting.SeedInfo.seed([CAC03E8425DE12D2:15A2061DE0C1CE94]:0)
	at org.junit.Assert.fail(Assert.java:89)
	at org.junit.Assert.failNotEquals(Assert.java:835)
	at org.junit.Assert.assertEquals(Assert.java:120)
	at org.junit.Assert.assertEquals(Assert.java:146)
	at org.apache.solr.cloud.FullSolrCloudDistribCmdsTest.testDeleteByIdImplicitRouter(FullSolrCloudDistribCmdsTest.java:160)
	at java.base/jdk.internal.reflect.NativeMethodAccessorImpl.invoke0(Native Method)
	at java.base/jdk.internal.reflect.NativeMethodAccessorImpl.invoke(NativeMethodAccessorImpl.java:62)
	at java.base/jdk.internal.reflect.DelegatingMethodAccessorImpl.invoke(DelegatingMethodAccessorImpl.java:43)
	at java.base/java.lang.reflect.Method.invoke(Method.java:566)
	at com.carrotsearch.randomizedtesting.RandomizedRunner.invoke(RandomizedRunner.java:1758)
	at com.carrotsearch.randomizedtesting.RandomizedRunner$8.evaluate(RandomizedRunner.java:946)
	at com.carrotsearch.randomizedtesting.RandomizedRunner$9.evaluate(RandomizedRunner.java:982)
	at com.carrotsearch.randomizedtesting.RandomizedRunner$10.evaluate(RandomizedRunner.java:996)
	at com.carrotsearch.randomizedtesting.rules.SystemPropertiesRestoreRule$1.evaluate(SystemPropertiesRestoreRule.java:80)
	at org.junit.rules.RunRules.evaluate(RunRules.java:20)
	at org.apache.lucene.tests.util.TestRuleSetupTeardownChained$1.evaluate(TestRuleSetupTeardownChained.java:48)
	at org.apache.lucene.tests.util.AbstractBeforeAfterRule$1.evaluate(AbstractBeforeAfterRule.java:43)
	at org.apache.lucene.tests.util.TestRuleThreadAndTestName$1.evaluate(TestRuleThreadAndTestName.java:45)
	at org.apache.lucene.tests.util.TestRuleIgnoreAfterMaxFailures$1.evaluate(TestRuleIgnoreAfterMaxFailures.java:60)
	at org.apache.lucene.tests.util.TestRuleMarkFailure$1.evaluate(TestRuleMarkFailure.java:44)
	at org.junit.rules.RunRules.evaluate(RunRules.java:20)
	at com.carrotsearch.randomizedtesting.rules.StatementAdapter.evaluate(StatementAdapter.java:36)
	at com.carrotsearch.randomizedtesting.ThreadLeakControl$StatementRunner.run(ThreadLeakControl.java:390)
	at com.carrotsearch.randomizedtesting.ThreadLeakControl.forkTimeoutingTask(ThreadLeakControl.java:843)
	at com.carrotsearch.randomizedtesting.ThreadLeakControl$3.evaluate(ThreadLeakControl.java:490)
	at com.carrotsearch.randomizedtesting.RandomizedRunner.runSingleTest(RandomizedRunner.java:955)
	at com.carrotsearch.randomizedtesting.RandomizedRunner$5.evaluate(RandomizedRunner.java:840)
	at com.carrotsearch.randomizedtesting.RandomizedRunner$6.evaluate(RandomizedRunner.java:891)
	at com.carrotsearch.randomizedtesting.RandomizedRunner$7.evaluate(RandomizedRunner.java:902)
	at com.carrotsearch.randomizedtesting.rules.StatementAdapter.evaluate(StatementAdapter.java:36)
	at com.carrotsearch.randomizedtesting.rules.StatementAdapter.evaluate(StatementAdapter.java:36)
	at org.apache.lucene.tests.util.AbstractBeforeAfterRule$1.evaluate(AbstractBeforeAfterRule.java:43)
	at org.apache.lucene.tests.util.AbstractBeforeAfterRule$1.evaluate(AbstractBeforeAfterRule.java:43)
	at com.carrotsearch.randomizedtesting.rules.SystemPropertiesRestoreRule$1.evaluate(SystemPropertiesRestoreRule.java:80)
	at org.junit.rules.RunRules.evaluate(RunRules.java:20)
	at org.apache.lucene.tests.util.AbstractBeforeAfterRule$1.evaluate(AbstractBeforeAfterRule.java:43)
	at com.carrotsearch.randomizedtesting.rules.StatementAdapter.evaluate(StatementAdapter.java:36)
	at org.apache.lucene.tests.util.TestRuleStoreClassName$1.evaluate(TestRuleStoreClassName.java:38)
	at com.carrotsearch.randomizedtesting.rules.NoShadowingOrOverridesOnMethodsRule$1.evaluate(NoShadowingOrOverridesOnMethodsRule.java:40)
	at com.carrotsearch.randomizedtesting.rules.NoShadowingOrOverridesOnMethodsRule$1.evaluate(NoShadowingOrOverridesOnMethodsRule.java:40)
	at com.carrotsearch.randomizedtesting.rules.StatementAdapter.evaluate(StatementAdapter.java:36)
	at com.carrotsearch.randomizedtesting.rules.StatementAdapter.evaluate(StatementAdapter.java:36)
	at org.apache.lucene.tests.util.TestRuleAssertionsRequired$1.evaluate(TestRuleAssertionsRequired.java:53)
	at org.apache.lucene.tests.util.AbstractBeforeAfterRule$1.evaluate(AbstractBeforeAfterRule.java:43)
	at org.apache.lucene.tests.util.TestRuleMarkFailure$1.evaluate(TestRuleMarkFailure.java:44)
	at org.apache.lucene.tests.util.TestRuleIgnoreAfterMaxFailures$1.evaluate(TestRuleIgnoreAfterMaxFailures.java:60)
	at org.apache.lucene.tests.util.TestRuleIgnoreTestSuites$1.evaluate(TestRuleIgnoreTestSuites.java:47)
	at org.junit.rules.RunRules.evaluate(RunRules.java:20)
	at com.carrotsearch.randomizedtesting.rules.StatementAdapter.evaluate(StatementAdapter.java:36)
	at com.carrotsearch.randomizedtesting.ThreadLeakControl$StatementRunner.run(ThreadLeakControl.java:390)
	at com.carrotsearch.randomizedtesting.ThreadLeakControl.lambda$forkTimeoutingTask$0(ThreadLeakControl.java:850)
	at java.base/java.lang.Thread.run(Thread.java:829)


FAILED:  org.apache.solr.cli.PostToolTest.testBasicRun

Error Message:
java.lang.AssertionError: expected:<0> but was:<1>

Stack Trace:
java.lang.AssertionError: expected:<0> but was:<1>
	at __randomizedtesting.SeedInfo.seed([CAC03E8425DE12D2:8B6C9802E85BA91]:0)
	at org.junit.Assert.fail(Assert.java:89)
	at org.junit.Assert.failNotEquals(Assert.java:835)
	at org.junit.Assert.assertEquals(Assert.java:647)
	at org.junit.Assert.assertEquals(Assert.java:633)
	at org.apache.solr.cli.PostToolTest.testBasicRun(PostToolTest.java:63)
	at java.base/jdk.internal.reflect.NativeMethodAccessorImpl.invoke0(Native Method)
	at java.base/jdk.internal.reflect.NativeMethodAccessorImpl.invoke(NativeMethodAccessorImpl.java:62)
	at java.base/jdk.internal.reflect.DelegatingMethodAccessorImpl.invoke(DelegatingMethodAccessorImpl.java:43)
	at java.base/java.lang.reflect.Method.invoke(Method.java:566)
	at com.carrotsearch.randomizedtesting.RandomizedRunner.invoke(RandomizedRunner.java:1758)
	at com.carrotsearch.randomizedtesting.RandomizedRunner$8.evaluate(RandomizedRunner.java:946)
	at com.carrotsearch.randomizedtesting.RandomizedRunner$9.evaluate(RandomizedRunner.java:982)
	at com.carrotsearch.randomizedtesting.RandomizedRunner$10.evaluate(RandomizedRunner.java:996)
	at com.carrotsearch.randomizedtesting.rules.SystemPropertiesRestoreRule$1.evaluate(SystemPropertiesRestoreRule.java:80)
	at org.junit.rules.RunRules.evaluate(RunRules.java:20)
	at org.apache.lucene.tests.util.TestRuleSetupTeardownChained$1.evaluate(TestRuleSetupTeardownChained.java:48)
	at org.apache.lucene.tests.util.AbstractBeforeAfterRule$1.evaluate(AbstractBeforeAfterRule.java:43)
	at org.apache.lucene.tests.util.TestRuleThreadAndTestName$1.evaluate(TestRuleThreadAndTestName.java:45)
	at org.apache.lucene.tests.util.TestRuleIgnoreAfterMaxFailures$1.evaluate(TestRuleIgnoreAfterMaxFailures.java:60)
	at org.apache.lucene.tests.util.TestRuleMarkFailure$1.evaluate(TestRuleMarkFailure.java:44)
	at org.junit.rules.RunRules.evaluate(RunRules.java:20)
	at com.carrotsearch.randomizedtesting.rules.StatementAdapter.evaluate(StatementAdapter.java:36)
	at com.carrotsearch.randomizedtesting.ThreadLeakControl$StatementRunner.run(ThreadLeakControl.java:390)
	at com.carrotsearch.randomizedtesting.ThreadLeakControl.forkTimeoutingTask(ThreadLeakControl.java:843)
	at com.carrotsearch.randomizedtesting.ThreadLeakControl$3.evaluate(ThreadLeakControl.java:490)
	at com.carrotsearch.randomizedtesting.RandomizedRunner.runSingleTest(RandomizedRunner.java:955)
	at com.carrotsearch.randomizedtesting.RandomizedRunner$5.evaluate(RandomizedRunner.java:840)
	at com.carrotsearch.randomizedtesting.RandomizedRunner$6.evaluate(RandomizedRunner.java:891)
	at com.carrotsearch.randomizedtesting.RandomizedRunner$7.evaluate(RandomizedRunner.java:902)
	at com.carrotsearch.randomizedtesting.rules.StatementAdapter.evaluate(StatementAdapter.java:36)
	at com.carrotsearch.randomizedtesting.rules.StatementAdapter.evaluate(StatementAdapter.java:36)
	at org.apache.lucene.tests.util.AbstractBeforeAfterRule$1.evaluate(AbstractBeforeAfterRule.java:43)
	at org.apache.lucene.tests.util.AbstractBeforeAfterRule$1.evaluate(AbstractBeforeAfterRule.java:43)
	at com.carrotsearch.randomizedtesting.rules.SystemPropertiesRestoreRule$1.evaluate(SystemPropertiesRestoreRule.java:80)
	at org.junit.rules.RunRules.evaluate(RunRules.java:20)
	at org.apache.lucene.tests.util.AbstractBeforeAfterRule$1.evaluate(AbstractBeforeAfterRule.java:43)
	at com.carrotsearch.randomizedtesting.rules.StatementAdapter.evaluate(StatementAdapter.java:36)
	at org.apache.lucene.tests.util.TestRuleStoreClassName$1.evaluate(TestRuleStoreClassName.java:38)
	at com.carrotsearch.randomizedtesting.rules.NoShadowingOrOverridesOnMethodsRule$1.evaluate(NoShadowingOrOverridesOnMethodsRule.java:40)
	at com.carrotsearch.randomizedtesting.rules.NoShadowingOrOverridesOnMethodsRule$1.evaluate(NoShadowingOrOverridesOnMethodsRule.java:40)
	at com.carrotsearch.randomizedtesting.rules.StatementAdapter.evaluate(StatementAdapter.java:36)
	at com.carrotsearch.randomizedtesting.rules.StatementAdapter.evaluate(StatementAdapter.java:36)
	at org.apache.lucene.tests.util.TestRuleAssertionsRequired$1.evaluate(TestRuleAssertionsRequired.java:53)
	at org.apache.lucene.tests.util.AbstractBeforeAfterRule$1.evaluate(AbstractBeforeAfterRule.java:43)
	at org.apache.lucene.tests.util.TestRuleMarkFailure$1.evaluate(TestRuleMarkFailure.java:44)
	at org.apache.lucene.tests.util.TestRuleIgnoreAfterMaxFailures$1.evaluate(TestRuleIgnoreAfterMaxFailures.java:60)
	at org.apache.lucene.tests.util.TestRuleIgnoreTestSuites$1.evaluate(TestRuleIgnoreTestSuites.java:47)
	at org.junit.rules.RunRules.evaluate(RunRules.java:20)
	at com.carrotsearch.randomizedtesting.rules.StatementAdapter.evaluate(StatementAdapter.java:36)
	at com.carrotsearch.randomizedtesting.ThreadLeakControl$StatementRunner.run(ThreadLeakControl.java:390)
	at com.carrotsearch.randomizedtesting.ThreadLeakControl.lambda$forkTimeoutingTask$0(ThreadLeakControl.java:850)
	at java.base/java.lang.Thread.run(Thread.java:829)




Build Log:
[...truncated 1061 lines...]
  2> SimplePostTool: FATAL: Connection error (is Solr running at https://127.0.0.1:41417/solr/testBasicRun/update ?): javax.net.ssl.SSLHandshakeException: PKIX path building failed: sun.security.provider.certpath.SunCertPathBuilderException: unable to find valid certification path to requested target
  2> 
  2> ERROR: System/Runtime.exit(2) or halt(2) calls are not allowed because they terminate the test runner's JVM.
  2> 
   >     java.lang.AssertionError: expected:<0> but was:<1>
   >         at __randomizedtesting.SeedInfo.seed([CAC03E8425DE12D2:8B6C9802E85BA91]:0)
   >         at org.junit.Assert.fail(Assert.java:89)
   >         at org.junit.Assert.failNotEquals(Assert.java:835)
   >         at org.junit.Assert.assertEquals(Assert.java:647)
   >         at org.junit.Assert.assertEquals(Assert.java:633)
   >         at org.apache.solr.cli.PostToolTest.testBasicRun(PostToolTest.java:63)
   >         at java.base/jdk.internal.reflect.NativeMethodAccessorImpl.invoke0(Native Method)
   >         at java.base/jdk.internal.reflect.NativeMethodAccessorImpl.invoke(NativeMethodAccessorImpl.java:62)
   >         at java.base/jdk.internal.reflect.DelegatingMethodAccessorImpl.invoke(DelegatingMethodAccessorImpl.java:43)
   >         at java.base/java.lang.reflect.Method.invoke(Method.java:566)
   >         at com.carrotsearch.randomizedtesting.RandomizedRunner.invoke(RandomizedRunner.java:1758)
   >         at com.carrotsearch.randomizedtesting.RandomizedRunner$8.evaluate(RandomizedRunner.java:946)
   >         at com.carrotsearch.randomizedtesting.RandomizedRunner$9.evaluate(RandomizedRunner.java:982)
   >         at com.carrotsearch.randomizedtesting.RandomizedRunner$10.evaluate(RandomizedRunner.java:996)
   >         at com.carrotsearch.randomizedtesting.rules.SystemPropertiesRestoreRule$1.evaluate(SystemPropertiesRestoreRule.java:80)
   >         at org.junit.rules.RunRules.evaluate(RunRules.java:20)
   >         at org.apache.lucene.tests.util.TestRuleSetupTeardownChained$1.evaluate(TestRuleSetupTeardownChained.java:48)
   >         at org.apache.lucene.tests.util.AbstractBeforeAfterRule$1.evaluate(AbstractBeforeAfterRule.java:43)
   >         at org.apache.lucene.tests.util.TestRuleThreadAndTestName$1.evaluate(TestRuleThreadAndTestName.java:45)
   >         at org.apache.lucene.tests.util.TestRuleIgnoreAfterMaxFailures$1.evaluate(TestRuleIgnoreAfterMaxFailures.java:60)
   >         at org.apache.lucene.tests.util.TestRuleMarkFailure$1.evaluate(TestRuleMarkFailure.java:44)
   >         at org.junit.rules.RunRules.evaluate(RunRules.java:20)
   >         at com.carrotsearch.randomizedtesting.rules.StatementAdapter.evaluate(StatementAdapter.java:36)
   >         at com.carrotsearch.randomizedtesting.ThreadLeakControl$StatementRunner.run(ThreadLeakControl.java:390)
   >         at com.carrotsearch.randomizedtesting.ThreadLeakControl.forkTimeoutingTask(ThreadLeakControl.java:843)
   >         at com.carrotsearch.randomizedtesting.ThreadLeakControl$3.evaluate(ThreadLeakControl.java:490)
   >         at com.carrotsearch.randomizedtesting.RandomizedRunner.runSingleTest(RandomizedRunner.java:955)
   >         at com.carrotsearch.randomizedtesting.RandomizedRunner$5.evaluate(RandomizedRunner.java:840)
   >         at com.carrotsearch.randomizedtesting.RandomizedRunner$6.evaluate(RandomizedRunner.java:891)
   >         at com.carrotsearch.randomizedtesting.RandomizedRunner$7.evaluate(RandomizedRunner.java:902)
   >         at com.carrotsearch.randomizedtesting.rules.StatementAdapter.evaluate(StatementAdapter.java:36)
   >         at com.carrotsearch.randomizedtesting.rules.StatementAdapter.evaluate(StatementAdapter.java:36)
   >         at org.apache.lucene.tests.util.AbstractBeforeAfterRule$1.evaluate(AbstractBeforeAfterRule.java:43)
   >         at org.apache.lucene.tests.util.AbstractBeforeAfterRule$1.evaluate(AbstractBeforeAfterRule.java:43)
   >         at com.carrotsearch.randomizedtesting.rules.SystemPropertiesRestoreRule$1.evaluate(SystemPropertiesRestoreRule.java:80)
   >         at org.junit.rules.RunRules.evaluate(RunRules.java:20)
   >         at org.apache.lucene.tests.util.AbstractBeforeAfterRule$1.evaluate(AbstractBeforeAfterRule.java:43)
   >         at com.carrotsearch.randomizedtesting.rules.StatementAdapter.evaluate(StatementAdapter.java:36)
   >         at org.apache.lucene.tests.util.TestRuleStoreClassName$1.evaluate(TestRuleStoreClassName.java:38)
   >         at com.carrotsearch.randomizedtesting.rules.NoShadowingOrOverridesOnMethodsRule$1.evaluate(NoShadowingOrOverridesOnMethodsRule.java:40)
   >         at com.carrotsearch.randomizedtesting.rules.NoShadowingOrOverridesOnMethodsRule$1.evaluate(NoShadowingOrOverridesOnMethodsRule.java:40)
   >         at com.carrotsearch.randomizedtesting.rules.StatementAdapter.evaluate(StatementAdapter.java:36)
   >         at com.carrotsearch.randomizedtesting.rules.StatementAdapter.evaluate(StatementAdapter.java:36)
   >         at org.apache.lucene.tests.util.TestRuleAssertionsRequired$1.evaluate(TestRuleAssertionsRequired.java:53)
   >         at org.apache.lucene.tests.util.AbstractBeforeAfterRule$1.evaluate(AbstractBeforeAfterRule.java:43)
   >         at org.apache.lucene.tests.util.TestRuleMarkFailure$1.evaluate(TestRuleMarkFailure.java:44)
   >         at org.apache.lucene.tests.util.TestRuleIgnoreAfterMaxFailures$1.evaluate(TestRuleIgnoreAfterMaxFailures.java:60)
   >         at org.apache.lucene.tests.util.TestRuleIgnoreTestSuites$1.evaluate(TestRuleIgnoreTestSuites.java:47)
   >         at org.junit.rules.RunRules.evaluate(RunRules.java:20)
   >         at com.carrotsearch.randomizedtesting.rules.StatementAdapter.evaluate(StatementAdapter.java:36)
   >         at com.carrotsearch.randomizedtesting.ThreadLeakControl$StatementRunner.run(ThreadLeakControl.java:390)
   >         at com.carrotsearch.randomizedtesting.ThreadLeakControl.lambda$forkTimeoutingTask$0(ThreadLeakControl.java:850)
   >         at java.base/java.lang.Thread.run(Thread.java:829)
  2> NOTE: reproduce with: gradlew test --tests PostToolTest.testBasicRun -Dtests.seed=CAC03E8425DE12D2 -Dtests.multiplier=2 -Dtests.locale=fo -Dtests.timezone=America/Catamarca -Dtests.asserts=true -Dtests.file.encoding=UTF-8
  2> 379628 ERROR (DistributedCollectionApiCommandExecutor-345-thread-2-processing-127.0.0.1:41417_solr null-811 testRunWithCollectionParam) [n:127.0.0.1:41417_solr c:testRunWithCollectionParam s: r: x: t:null-811] o.a.s.c.a.c.CollectionHandlingUtils Collection testRunWithCollectionParam, operation CREATE failed
  2>           => org.apache.solr.common.SolrException: Can not find the specified config set: conf1
  2> 	at org.apache.solr.cloud.api.collections.CollectionHandlingUtils.validateConfigOrThrowSolrException(CollectionHandlingUtils.java:390)
  2> org.apache.solr.common.SolrException: Can not find the specified config set: conf1
  2> 	at org.apache.solr.cloud.api.collections.CollectionHandlingUtils.validateConfigOrThrowSolrException(CollectionHandlingUtils.java:390) [main/:?]
  2> 	at org.apache.solr.cloud.api.collections.CreateCollectionCmd.call(CreateCollectionCmd.java:133) ~[main/:?]
  2> 	at org.apache.solr.cloud.api.collections.CollApiCmds$TraceAwareCommand.call(CollApiCmds.java:225) ~[main/:?]
  2> 	at org.apache.solr.cloud.api.collections.DistributedCollectionConfigSetCommandRunner$CollectionCommandRunner.call(DistributedCollectionConfigSetCommandRunner.java:432) [main/:?]
  2> 	at org.apache.solr.cloud.api.collections.DistributedCollectionConfigSetCommandRunner$CollectionCommandRunner.call(DistributedCollectionConfigSetCommandRunner.java:365) [main/:?]
  2> 	at java.base/java.util.concurrent.FutureTask.run(FutureTask.java:264) [?:?]
  2> 	at org.apache.solr.common.util.ExecutorUtil$MDCAwareThreadPoolExecutor.lambda$execute$0(ExecutorUtil.java:312) [solr-solrj-9.6.0-SNAPSHOT.jar:9.6.0-SNAPSHOT 633c299a5dfd2eaa1f69adba2eab76bb1941d02a [snapshot build, details omitted]]
  2> 	at java.base/java.util.concurrent.ThreadPoolExecutor.runWorker(ThreadPoolExecutor.java:1128) [?:?]
  2> 	at java.base/java.util.concurrent.ThreadPoolExecutor$Worker.run(ThreadPoolExecutor.java:628) [?:?]
  2> 	at java.base/java.lang.Thread.run(Thread.java:829) [?:?]
  1> Posting files to [base] url http://localhost:41417/solr/testRunWithCollectionParam/update...
  1> Entering auto mode. File endings considered are xml,json,jsonl,csv,pdf,doc,docx,ppt,pptx,xls,xlsx,odt,odp,ods,ott,otp,ots,rtf,htm,html,txt,log
  1> Entering recursive mode, max depth=1, delay=0s
  1> POSTing file temp14137661218570649219json (application/octet-stream) to [base]/extract
  2> SimplePostTool: WARNING: IOException while reading response: java.net.SocketException: Unexpected end of file from server
  1> 1 files indexed.
  1> Time spent: 0:00:00.319
  2> 380656 INFO  (jetty-closer-356-thread-1) [n: c: s: r: x: t:] o.e.j.s.Server Stopped Server@858358d{STOPPING}[10.0.19,sto=0]
  2> 380660 INFO  (jetty-closer-356-thread-1) [n: c: s: r: x: t:] o.e.j.s.AbstractConnector Stopped ServerConnector@43a488a7{ssl, (ssl, alpn, http/1.1, h2)}{127.0.0.1:0}
  2> 380661 INFO  (jetty-closer-356-thread-1) [n: c: s: r: x: t:] o.e.j.s.h.ContextHandler Stopped o.e.j.s.ServletContextHandler@353a294a{/solr,file:///home/jenkins/jenkins-slave/workspace/Solr/Solr-Check-9.x/solr/core/build/tmp/tests-cwd/,STOPPED}
  2> 381419 WARN  (ZkTestServer Run Thread) [n: c: s: r: x: t:] o.a.s.c.ZkTestServer Watch limit violations: 
  2> Maximum concurrent create/delete watches above limit:
  2> 
  2> 	2	/solr/aliases.json
  2> 
  2> Maximum concurrent data watches above limit:
  2> 
  2> 	2	/solr/clusterprops.json
  2> 
  2> Maximum concurrent children watches above limit:
  2> 
  2> 	4	/solr/live_nodes
  2> 	2	/solr/collections
  2> 
  2> NOTE: leaving temporary files on disk at: /home/jenkins/jenkins-slave/workspace/Solr/Solr-Check-9.x/solr/core/build/tmp/tests-tmp/solr.cli.PostToolTest_CAC03E8425DE12D2-001
  2> NOTE: test params are: codec=Asserting(Lucene99), sim=Asserting(RandomSimilarity(queryNorm=false): {}), locale=fo, timezone=America/Catamarca
  2> NOTE: Linux 4.15.0-213-generic amd64/Eclipse Adoptium 11.0.16.1 (64-bit)/cpus=1,threads=2,free=189782048,total=343932928
  2> NOTE: All tests run in this JVM: [AnalysisAfterCoreReloadTest, DisMaxRequestHandlerTest, MinimalSchemaTest, SolrTestCaseJ4DeleteCoreTest, TestDistributedGrouping, TestGroupingSearch, TestRandomFaceting, TestTrie, TestCharFilters, TestWordDelimiterFilterFactory, ApiToolTest, PostToolTest]

WARNING: Test org.apache.solr.client.solrj.impl.ConnectionReuseTest wrote 12,065,327 bytes of output.

org.apache.solr.cloud.CollectionsAPISolrJTest > testDeleteAliasedCollection FAILED
    org.junit.ComparisonFailure: SolrDocument{id=1, _version_=1790232259811344384, _root_=1} expected:<[2]> but was:<[1]>
        at __randomizedtesting.SeedInfo.seed([CAC03E8425DE12D2:DDC3D50058EBC29]:0)
        at org.junit.Assert.assertEquals(Assert.java:117)
        at org.apache.solr.cloud.CollectionsAPISolrJTest.assertDoc(CollectionsAPISolrJTest.java:1083)
        at org.apache.solr.cloud.CollectionsAPISolrJTest.testDeleteAliasedCollection(CollectionsAPISolrJTest.java:1030)
        at java.base/jdk.internal.reflect.NativeMethodAccessorImpl.invoke0(Native Method)
        at java.base/jdk.internal.reflect.NativeMethodAccessorImpl.invoke(NativeMethodAccessorImpl.java:62)
        at java.base/jdk.internal.reflect.DelegatingMethodAccessorImpl.invoke(DelegatingMethodAccessorImpl.java:43)
        at java.base/java.lang.reflect.Method.invoke(Method.java:566)
        at com.carrotsearch.randomizedtesting.RandomizedRunner.invoke(RandomizedRunner.java:1758)
        at com.carrotsearch.randomizedtesting.RandomizedRunner$8.evaluate(RandomizedRunner.java:946)
        at com.carrotsearch.randomizedtesting.RandomizedRunner$9.evaluate(RandomizedRunner.java:982)
        at com.carrotsearch.randomizedtesting.RandomizedRunner$10.evaluate(RandomizedRunner.java:996)
        at com.carrotsearch.randomizedtesting.rules.SystemPropertiesRestoreRule$1.evaluate(SystemPropertiesRestoreRule.java:80)
        at org.junit.rules.RunRules.evaluate(RunRules.java:20)
        at org.apache.lucene.tests.util.TestRuleSetupTeardownChained$1.evaluate(TestRuleSetupTeardownChained.java:48)
        at org.apache.lucene.tests.util.AbstractBeforeAfterRule$1.evaluate(AbstractBeforeAfterRule.java:43)
        at org.apache.lucene.tests.util.TestRuleThreadAndTestName$1.evaluate(TestRuleThreadAndTestName.java:45)
        at org.apache.lucene.tests.util.TestRuleIgnoreAfterMaxFailures$1.evaluate(TestRuleIgnoreAfterMaxFailures.java:60)
        at org.apache.lucene.tests.util.TestRuleMarkFailure$1.evaluate(TestRuleMarkFailure.java:44)
        at org.junit.rules.RunRules.evaluate(RunRules.java:20)
        at com.carrotsearch.randomizedtesting.rules.StatementAdapter.evaluate(StatementAdapter.java:36)
        at com.carrotsearch.randomizedtesting.ThreadLeakControl$StatementRunner.run(ThreadLeakControl.java:390)
        at com.carrotsearch.randomizedtesting.ThreadLeakControl.forkTimeoutingTask(ThreadLeakControl.java:843)
        at com.carrotsearch.randomizedtesting.ThreadLeakControl$3.evaluate(ThreadLeakControl.java:490)
        at com.carrotsearch.randomizedtesting.RandomizedRunner.runSingleTest(RandomizedRunner.java:955)
        at com.carrotsearch.randomizedtesting.RandomizedRunner$5.evaluate(RandomizedRunner.java:840)
        at com.carrotsearch.randomizedtesting.RandomizedRunner$6.evaluate(RandomizedRunner.java:891)
        at com.carrotsearch.randomizedtesting.RandomizedRunner$7.evaluate(RandomizedRunner.java:902)
        at com.carrotsearch.randomizedtesting.rules.StatementAdapter.evaluate(StatementAdapter.java:36)
        at com.carrotsearch.randomizedtesting.rules.StatementAdapter.evaluate(StatementAdapter.java:36)
        at org.apache.lucene.tests.util.AbstractBeforeAfterRule$1.evaluate(AbstractBeforeAfterRule.java:43)
        at org.apache.lucene.tests.util.AbstractBeforeAfterRule$1.evaluate(AbstractBeforeAfterRule.java:43)
        at com.carrotsearch.randomizedtesting.rules.SystemPropertiesRestoreRule$1.evaluate(SystemPropertiesRestoreRule.java:80)
        at org.junit.rules.RunRules.evaluate(RunRules.java:20)
        at org.apache.lucene.tests.util.AbstractBeforeAfterRule$1.evaluate(AbstractBeforeAfterRule.java:43)
        at com.carrotsearch.randomizedtesting.rules.StatementAdapter.evaluate(StatementAdapter.java:36)
        at org.apache.lucene.tests.util.TestRuleStoreClassName$1.evaluate(TestRuleStoreClassName.java:38)
        at com.carrotsearch.randomizedtesting.rules.NoShadowingOrOverridesOnMethodsRule$1.evaluate(NoShadowingOrOverridesOnMethodsRule.java:40)
        at com.carrotsearch.randomizedtesting.rules.NoShadowingOrOverridesOnMethodsRule$1.evaluate(NoShadowingOrOverridesOnMethodsRule.java:40)
        at com.carrotsearch.randomizedtesting.rules.StatementAdapter.evaluate(StatementAdapter.java:36)
        at com.carrotsearch.randomizedtesting.rules.StatementAdapter.evaluate(StatementAdapter.java:36)
        at org.apache.lucene.tests.util.TestRuleAssertionsRequired$1.evaluate(TestRuleAssertionsRequired.java:53)
        at org.apache.lucene.tests.util.AbstractBeforeAfterRule$1.evaluate(AbstractBeforeAfterRule.java:43)
        at org.apache.lucene.tests.util.TestRuleMarkFailure$1.evaluate(TestRuleMarkFailure.java:44)
        at org.apache.lucene.tests.util.TestRuleIgnoreAfterMaxFailures$1.evaluate(TestRuleIgnoreAfterMaxFailures.java:60)
        at org.apache.lucene.tests.util.TestRuleIgnoreTestSuites$1.evaluate(TestRuleIgnoreTestSuites.java:47)
        at org.junit.rules.RunRules.evaluate(RunRules.java:20)
        at com.carrotsearch.randomizedtesting.rules.StatementAdapter.evaluate(StatementAdapter.java:36)
        at com.carrotsearch.randomizedtesting.ThreadLeakControl$StatementRunner.run(ThreadLeakControl.java:390)
        at com.carrotsearch.randomizedtesting.ThreadLeakControl.lambda$forkTimeoutingTask$0(ThreadLeakControl.java:850)
        at java.base/java.lang.Thread.run(Thread.java:829)

org.apache.solr.cloud.CollectionsAPISolrJTest > test suite's output saved to /home/jenkins/jenkins-slave/workspace/Solr/Solr-Check-9.x/solr/core/build/test-results/test/outputs/OUTPUT-org.apache.solr.cloud.CollectionsAPISolrJTest.txt, copied below:
  2> 472086 INFO  (SUITE-CollectionsAPISolrJTest-seed#[CAC03E8425DE12D2]-worker) [n: c: s: r: x: t:] o.a.s.SolrTestCase Setting 'solr.default.confdir' system property to test-framework derived value of '/home/jenkins/jenkins-slave/workspace/Solr/Solr-Check-9.x/solr/server/solr/configsets/_default/conf'
  2> 472086 INFO  (SUITE-CollectionsAPISolrJTest-seed#[CAC03E8425DE12D2]-worker) [n: c: s: r: x: t:] o.a.s.u.ErrorLogMuter Closing ErrorLogMuter-regex-19241 after mutting 0 log messages
  2> 472086 INFO  (SUITE-CollectionsAPISolrJTest-seed#[CAC03E8425DE12D2]-worker) [n: c: s: r: x: t:] o.a.s.u.ErrorLogMuter Creating ErrorLogMuter-regex-19242 for ERROR logs matching regex: ignore_exception
  2> 472087 INFO  (SUITE-CollectionsAPISolrJTest-seed#[CAC03E8425DE12D2]-worker) [n: c: s: r: x: t:] o.a.s.SolrTestCaseJ4 Created dataDir: /home/jenkins/jenkins-slave/workspace/Solr/Solr-Check-9.x/solr/core/build/tmp/tests-tmp/solr.cloud.CollectionsAPISolrJTest_CAC03E8425DE12D2-001/data-dir-18-001
  2> 472087 INFO  (SUITE-CollectionsAPISolrJTest-seed#[CAC03E8425DE12D2]-worker) [n: c: s: r: x: t:] o.a.s.SolrTestCaseJ4 Using PointFields (NUMERIC_POINTS_SYSPROP=true) w/NUMERIC_DOCVALUES_SYSPROP=true
  2> 472088 INFO  (SUITE-CollectionsAPISolrJTest-seed#[CAC03E8425DE12D2]-worker) [n: c: s: r: x: t:] o.a.s.SolrTestCaseJ4 Randomized ssl (true) and clientAuth (true) via: @org.apache.solr.util.RandomizeSSL(reason="", ssl=0.0/0.0, value=0.0/0.0, clientAuth=0.0/0.0)
  2> 472095 INFO  (SUITE-CollectionsAPISolrJTest-seed#[CAC03E8425DE12D2]-worker) [n: c: s: r: x: t:] o.a.s.SolrTestCaseJ4 SecureRandom sanity checks: test.solr.allowed.securerandom=null & java.security.egd=file:/dev/./urandom
  2> 472096 INFO  (SUITE-CollectionsAPISolrJTest-seed#[CAC03E8425DE12D2]-worker) [n: c: s: r: x: t:] o.a.s.u.t.SimplePropagator Always-on trace id generation enabled.
  2> 472096 INFO  (SUITE-CollectionsAPISolrJTest-seed#[CAC03E8425DE12D2]-worker) [n: c: s: r: x: t:] o.a.s.c.MiniSolrCloudCluster Starting cluster of 4 servers in /home/jenkins/jenkins-slave/workspace/Solr/Solr-Check-9.x/solr/core/build/tmp/tests-tmp/solr.cloud.CollectionsAPISolrJTest_CAC03E8425DE12D2-001/tempDir-001
  2> 472096 INFO  (SUITE-CollectionsAPISolrJTest-seed#[CAC03E8425DE12D2]-worker) [n: c: s: r: x: t:] o.a.s.c.ZkTestServer STARTING ZK TEST SERVER
  2> 472100 INFO  (ZkTestServer Run Thread) [n: c: s: r: x: t:] o.a.s.c.ZkTestServer client port: /127.0.0.1:0
  2> 472101 INFO  (ZkTestServer Run Thread) [n: c: s: r: x: t:] o.a.s.c.ZkTestServer Starting server
  2> 472102 WARN  (ZkTestServer Run Thread) [n: c: s: r: x: t:] o.a.z.s.ServerCnxnFactory maxCnxns is not configured, using default value 0.
  2> 472198 INFO  (SUITE-CollectionsAPISolrJTest-seed#[CAC03E8425DE12D2]-worker) [n: c: s: r: x: t:] o.a.s.c.ZkTestServer start zk server on port: 41509
  2> 472596 WARN  (SUITE-CollectionsAPISolrJTest-seed#[CAC03E8425DE12D2]-worker) [n: c: s: r: x: t:] o.a.s.c.c.SolrZkClient Using default ZkCredentialsInjector. ZkCredentialsInjector is not secure, it creates an empty list of credentials which leads to 'OPEN_ACL_UNSAFE' ACLs to Zookeeper nodes
  2> 472597 INFO  (SUITE-CollectionsAPISolrJTest-seed#[CAC03E8425DE12D2]-worker) [n: c: s: r: x: t:] o.a.s.c.c.ConnectionManager Waiting up to 30000ms for client to connect to ZooKeeper
  2> 472607 INFO  (zkConnectionManagerCallback-729-thread-1) [n: c: s: r: x: t:] o.a.s.c.c.ConnectionManager zkClient has connected
  2> 472607 INFO  (SUITE-CollectionsAPISolrJTest-seed#[CAC03E8425DE12D2]-worker) [n: c: s: r: x: t:] o.a.s.c.c.ConnectionManager Client is connected to ZooKeeper
  2> 472607 WARN  (SUITE-CollectionsAPISolrJTest-seed#[CAC03E8425DE12D2]-worker) [n: c: s: r: x: t:] o.a.s.c.c.SolrZkClient Using default ZkACLProvider. DefaultZkACLProvider is not secure, it creates 'OPEN_ACL_UNSAFE' ACLs to Zookeeper nodes
  2> 472618 WARN  (SUITE-CollectionsAPISolrJTest-seed#[CAC03E8425DE12D2]-worker) [n: c: s: r: x: t:] o.a.s.c.c.SolrZkClient Using default ZkCredentialsInjector. ZkCredentialsInjector is not secure, it creates an empty list of credentials which leads to 'OPEN_ACL_UNSAFE' ACLs to Zookeeper nodes
  2> 472620 INFO  (SUITE-CollectionsAPISolrJTest-seed#[CAC03E8425DE12D2]-worker) [n: c: s: r: x: t:] o.a.s.c.c.ConnectionManager Waiting up to 30000ms for client to connect to ZooKeeper
  2> 472640 INFO  (zkConnectionManagerCallback-731-thread-1) [n: c: s: r: x: t:] o.a.s.c.c.ConnectionManager zkClient has connected
  2> 472641 INFO  (SUITE-CollectionsAPISolrJTest-seed#[CAC03E8425DE12D2]-worker) [n: c: s: r: x: t:] o.a.s.c.c.ConnectionManager Client is connected to ZooKeeper
  2> 472641 WARN  (SUITE-CollectionsAPISolrJTest-seed#[CAC03E8425DE12D2]-worker) [n: c: s: r: x: t:] o.a.s.c.c.SolrZkClient Using default ZkACLProvider. DefaultZkACLProvider is not secure, it creates 'OPEN_ACL_UNSAFE' ACLs to Zookeeper nodes
  2> 472641 WARN  (SUITE-CollectionsAPISolrJTest-seed#[CAC03E8425DE12D2]-worker) [n: c: s: r: x: t:] o.a.s.c.c.SolrZkClient Using default ZkCredentialsInjector. ZkCredentialsInjector is not secure, it creates an empty list of credentials which leads to 'OPEN_ACL_UNSAFE' ACLs to Zookeeper nodes
  2> 472644 INFO  (SUITE-CollectionsAPISolrJTest-seed#[CAC03E8425DE12D2]-worker) [n: c: s: r: x: t:] o.a.s.c.c.ConnectionManager Waiting up to 15000ms for client to connect to ZooKeeper
  2> 472672 INFO  (zkConnectionManagerCallback-733-thread-1) [n: c: s: r: x: t:] o.a.s.c.c.ConnectionManager zkClient has connected
  2> 472676 INFO  (SUITE-CollectionsAPISolrJTest-seed#[CAC03E8425DE12D2]-worker) [n: c: s: r: x: t:] o.a.s.c.c.ConnectionManager Client is connected to ZooKeeper
  2> 472676 WARN  (SUITE-CollectionsAPISolrJTest-seed#[CAC03E8425DE12D2]-worker) [n: c: s: r: x: t:] o.a.s.c.c.SolrZkClient Using default ZkACLProvider. DefaultZkACLProvider is not secure, it creates 'OPEN_ACL_UNSAFE' ACLs to Zookeeper nodes
  2> 472814 INFO  (jetty-launcher-734-thread-2) [n: c: s: r: x: t:] o.a.s.e.JettySolrRunner Start Jetty (configured port=0, binding port=0)
  2> 472814 INFO  (jetty-launcher-734-thread-2) [n: c: s: r: x: t:] o.a.s.e.JettySolrRunner Trying to start Jetty on port 0 try number 2 ...
  2> 472814 INFO  (jetty-launcher-734-thread-2) [n: c: s: r: x: t:] o.e.j.s.Server jetty-10.0.19; built: 2023-12-15T20:38:32.477Z; git: 8492d1c78f122bb30cce20aecfa07e7283facd47; jvm 11.0.16.1+1
  2> 472831 INFO  (jetty-launcher-734-thread-1) [n: c: s: r: x: t:] o.a.s.e.JettySolrRunner Start Jetty (configured port=0, binding port=0)
  2> 472831 INFO  (jetty-launcher-734-thread-1) [n: c: s: r: x: t:] o.a.s.e.JettySolrRunner Trying to start Jetty on port 0 try number 2 ...
  2> 472831 INFO  (jetty-launcher-734-thread-1) [n: c: s: r: x: t:] o.e.j.s.Server jetty-10.0.19; built: 2023-12-15T20:38:32.477Z; git: 8492d1c78f122bb30cce20aecfa07e7283facd47; jvm 11.0.16.1+1
  2> 472833 INFO  (jetty-launcher-734-thread-3) [n: c: s: r: x: t:] o.a.s.e.JettySolrRunner Start Jetty (configured port=0, binding port=0)
  2> 472834 INFO  (jetty-launcher-734-thread-3) [n: c: s: r: x: t:] o.a.s.e.JettySolrRunner Trying to start Jetty on port 0 try number 2 ...
  2> 472834 INFO  (jetty-launcher-734-thread-3) [n: c: s: r: x: t:] o.e.j.s.Server jetty-10.0.19; built: 2023-12-15T20:38:32.477Z; git: 8492d1c78f122bb30cce20aecfa07e7283facd47; jvm 11.0.16.1+1
  2> 472834 INFO  (jetty-launcher-734-thread-4) [n: c: s: r: x: t:] o.a.s.e.JettySolrRunner Start Jetty (configured port=0, binding port=0)
  2> 472834 INFO  (jetty-launcher-734-thread-4) [n: c: s: r: x: t:] o.a.s.e.JettySolrRunner Trying to start Jetty on port 0 try number 2 ...
  2> 472834 INFO  (jetty-launcher-734-thread-4) [n: c: s: r: x: t:] o.e.j.s.Server jetty-10.0.19; built: 2023-12-15T20:38:32.477Z; git: 8492d1c78f122bb30cce20aecfa07e7283facd47; jvm 11.0.16.1+1
  2> 472892 INFO  (jetty-launcher-734-thread-3) [n: c: s: r: x: t:] o.e.j.s.s.DefaultSessionIdManager Session workerName=node0
  2> 472896 INFO  (jetty-launcher-734-thread-3) [n: c: s: r: x: t:] o.e.j.s.h.ContextHandler Started o.e.j.s.ServletContextHandler@16bc89d{/solr,file:///home/jenkins/jenkins-slave/workspace/Solr/Solr-Check-9.x/solr/core/build/tmp/tests-cwd/,AVAILABLE}
  2> 472901 INFO  (jetty-launcher-734-thread-3) [n: c: s: r: x: t:] o.e.j.s.AbstractConnector Started ServerConnector@3f80db81{ssl, (ssl, alpn, http/1.1, h2)}{127.0.0.1:40615}
  2> 472901 INFO  (jetty-launcher-734-thread-3) [n: c: s: r: x: t:] o.e.j.s.Server Started Server@43ff423e{STARTING}[10.0.19,sto=0] @472949ms
  2> 472901 ERROR (jetty-launcher-734-thread-3) [n: c: s: r: x: t:] o.a.s.u.StartupLoggingUtils Missing Java Option solr.log.dir. Logging may be missing or incomplete.
  2> 472901 INFO  (jetty-launcher-734-thread-3) [n: c: s: r: x: t:] o.a.s.s.CoreContainerProvider Using logger factory org.apache.logging.slf4j.Log4jLoggerFactory
  2> 472901 INFO  (jetty-launcher-734-thread-3) [n: c: s: r: x: t:] o.a.s.s.CoreContainerProvider  ___      _       Welcome to Apache Solr™ version 9.6.0
  2> 472901 INFO  (jetty-launcher-734-thread-3) [n: c: s: r: x: t:] o.a.s.s.CoreContainerProvider / __| ___| |_ _   Starting in cloud mode on port null
  2> 472901 INFO  (jetty-launcher-734-thread-3) [n: c: s: r: x: t:] o.a.s.s.CoreContainerProvider \__ \/ _ \ | '_|  Install dir: /home/jenkins/jenkins-slave/workspace/Solr/Solr-Check-9.x/solr
  2> 472901 INFO  (jetty-launcher-734-thread-3) [n: c: s: r: x: t:] o.a.s.s.CoreContainerProvider |___/\___/_|_|    Start time: 2024-02-07T09:33:57.020524Z
  2> 472901 INFO  (jetty-launcher-734-thread-3) [n: c: s: r: x: t:] o.a.s.s.CoreContainerProvider Solr Home: /home/jenkins/jenkins-slave/workspace/Solr/Solr-Check-9.x/solr/core/build/tmp/tests-tmp/solr.cloud.CollectionsAPISolrJTest_CAC03E8425DE12D2-001/tempDir-001/node2 (source: servlet config: solr.solr.home)
  2> 472901 WARN  (jetty-launcher-734-thread-3) [n: c: s: r: x: t:] o.a.s.c.c.SolrZkClient Using default ZkCredentialsInjector. ZkCredentialsInjector is not secure, it creates an empty list of credentials which leads to 'OPEN_ACL_UNSAFE' ACLs to Zookeeper nodes
  2> 472927 INFO  (jetty-launcher-734-thread-1) [n: c: s: r: x: t:] o.e.j.s.s.DefaultSessionIdManager Session workerName=node0
  2> 472931 INFO  (jetty-launcher-734-thread-1) [n: c: s: r: x: t:] o.e.j.s.h.ContextHandler Started o.e.j.s.ServletContextHandler@4e40b431{/solr,file:///home/jenkins/jenkins-slave/workspace/Solr/Solr-Check-9.x/solr/core/build/tmp/tests-cwd/,AVAILABLE}
  2> 472937 INFO  (jetty-launcher-734-thread-1) [n: c: s: r: x: t:] o.e.j.s.AbstractConnector Started ServerConnector@2d891e3e{ssl, (ssl, alpn, http/1.1, h2)}{127.0.0.1:39761}
  2> 472937 INFO  (jetty-launcher-734-thread-1) [n: c: s: r: x: t:] o.e.j.s.Server Started Server@7019bee4{STARTING}[10.0.19,sto=0] @472986ms
  2> 472937 ERROR (jetty-launcher-734-thread-1) [n: c: s: r: x: t:] o.a.s.u.StartupLoggingUtils Missing Java Option solr.log.dir. Logging may be missing or incomplete.
  2> 472937 INFO  (jetty-launcher-734-thread-1) [n: c: s: r: x: t:] o.a.s.s.CoreContainerProvider Using logger factory org.apache.logging.slf4j.Log4jLoggerFactory
  2> 472937 INFO  (jetty-launcher-734-thread-1) [n: c: s: r: x: t:] o.a.s.s.CoreContainerProvider  ___      _       Welcome to Apache Solr™ version 9.6.0
  2> 472937 INFO  (jetty-launcher-734-thread-1) [n: c: s: r: x: t:] o.a.s.s.CoreContainerProvider / __| ___| |_ _   Starting in cloud mode on port null
  2> 472937 INFO  (jetty-launcher-734-thread-1) [n: c: s: r: x: t:] o.a.s.s.CoreContainerProvider \__ \/ _ \ | '_|  Install dir: /home/jenkins/jenkins-slave/workspace/Solr/Solr-Check-9.x/solr
  2> 472937 INFO  (jetty-launcher-734-thread-1) [n: c: s: r: x: t:] o.a.s.s.CoreContainerProvider |___/\___/_|_|    Start time: 2024-02-07T09:33:57.056721Z
  2> 472937 INFO  (jetty-launcher-734-thread-1) [n: c: s: r: x: t:] o.a.s.s.CoreContainerProvider Solr Home: /home/jenkins/jenkins-slave/workspace/Solr/Solr-Check-9.x/solr/core/build/tmp/tests-tmp/solr.cloud.CollectionsAPISolrJTest_CAC03E8425DE12D2-001/tempDir-001/node3 (source: servlet config: solr.solr.home)
  2> 472937 WARN  (jetty-launcher-734-thread-1) [n: c: s: r: x: t:] o.a.s.c.c.SolrZkClient Using default ZkCredentialsInjector. ZkCredentialsInjector is not secure, it creates an empty list of credentials which leads to 'OPEN_ACL_UNSAFE' ACLs to Zookeeper nodes
  2> 472953 INFO  (jetty-launcher-734-thread-3) [n: c: s: r: x: t:] o.a.s.c.c.ConnectionManager Waiting up to 30000ms for client to connect to ZooKeeper
  2> 472959 INFO  (jetty-launcher-734-thread-4) [n: c: s: r: x: t:] o.e.j.s.s.DefaultSessionIdManager Session workerName=node0
  2> 472959 INFO  (jetty-launcher-734-thread-4) [n: c: s: r: x: t:] o.e.j.s.h.ContextHandler Started o.e.j.s.ServletContextHandler@23184dcf{/solr,file:///home/jenkins/jenkins-slave/workspace/Solr/Solr-Check-9.x/solr/core/build/tmp/tests-cwd/,AVAILABLE}
  2> 472960 INFO  (jetty-launcher-734-thread-4) [n: c: s: r: x: t:] o.e.j.s.AbstractConnector Started ServerConnector@792a0355{ssl, (ssl, alpn, http/1.1, h2)}{127.0.0.1:33591}
  2> 472960 INFO  (jetty-launcher-734-thread-4) [n: c: s: r: x: t:] o.e.j.s.Server Started Server@682566b6{STARTING}[10.0.19,sto=0] @473009ms
  2> 472960 ERROR (jetty-launcher-734-thread-4) [n: c: s: r: x: t:] o.a.s.u.StartupLoggingUtils Missing Java Option solr.log.dir. Logging may be missing or incomplete.
  2> 472960 INFO  (jetty-launcher-734-thread-4) [n: c: s: r: x: t:] o.a.s.s.CoreContainerProvider Using logger factory org.apache.logging.slf4j.Log4jLoggerFactory
  2> 472960 INFO  (jetty-launcher-734-thread-4) [n: c: s: r: x: t:] o.a.s.s.CoreContainerProvider  ___      _       Welcome to Apache Solr™ version 9.6.0
  2> 472960 INFO  (jetty-launcher-734-thread-4) [n: c: s: r: x: t:] o.a.s.s.CoreContainerProvider / __| ___| |_ _   Starting in cloud mode on port null
  2> 472960 INFO  (jetty-launcher-734-thread-4) [n: c: s: r: x: t:] o.a.s.s.CoreContainerProvider \__ \/ _ \ | '_|  Install dir: /home/jenkins/jenkins-slave/workspace/Solr/Solr-Check-9.x/solr
  2> 472960 INFO  (jetty-launcher-734-thread-4) [n: c: s: r: x: t:] o.a.s.s.CoreContainerProvider |___/\___/_|_|    Start time: 2024-02-07T09:33:57.079792Z
  2> 472960 INFO  (jetty-launcher-734-thread-4) [n: c: s: r: x: t:] o.a.s.s.CoreContainerProvider Solr Home: /home/jenkins/jenkins-slave/workspace/Solr/Solr-Check-9.x/solr/core/build/tmp/tests-tmp/solr.cloud.CollectionsAPISolrJTest_CAC03E8425DE12D2-001/tempDir-001/node4 (source: servlet config: solr.solr.home)
  2> 472961 WARN  (jetty-launcher-734-thread-4) [n: c: s: r: x: t:] o.a.s.c.c.SolrZkClient Using default ZkCredentialsInjector. ZkCredentialsInjector is not secure, it creates an empty list of credentials which leads to 'OPEN_ACL_UNSAFE' ACLs to Zookeeper nodes
  2> 472961 INFO  (jetty-launcher-734-thread-2) [n: c: s: r: x: t:] o.e.j.s.s.DefaultSessionIdManager Session workerName=node0
  2> 472965 INFO  (jetty-launcher-734-thread-2) [n: c: s: r: x: t:] o.e.j.s.h.ContextHandler Started o.e.j.s.ServletContextHandler@44a57979{/solr,file:///home/jenkins/jenkins-slave/workspace/Solr/Solr-Check-9.x/solr/core/build/tmp/tests-cwd/,AVAILABLE}
  2> 472967 INFO  (jetty-launcher-734-thread-2) [n: c: s: r: x: t:] o.e.j.s.AbstractConnector Started ServerConnector@3bd2e65f{ssl, (ssl, alpn, http/1.1, h2)}{127.0.0.1:41495}
  2> 472967 INFO  (jetty-launcher-734-thread-2) [n: c: s: r: x: t:] o.e.j.s.Server Started Server@7f867d91{STARTING}[10.0.19,sto=0] @473015ms
  2> 472967 ERROR (jetty-launcher-734-thread-2) [n: c: s: r: x: t:] o.a.s.u.StartupLoggingUtils Missing Java Option solr.log.dir. Logging may be missing or incomplete.
  2> 472967 INFO  (jetty-launcher-734-thread-2) [n: c: s: r: x: t:] o.a.s.s.CoreContainerProvider Using logger factory org.apache.logging.slf4j.Log4jLoggerFactory
  2> 472967 INFO  (jetty-launcher-734-thread-2) [n: c: s: r: x: t:] o.a.s.s.CoreContainerProvider  ___      _       Welcome to Apache Solr™ version 9.6.0
  2> 472967 INFO  (jetty-launcher-734-thread-2) [n: c: s: r: x: t:] o.a.s.s.CoreContainerProvider / __| ___| |_ _   Starting in cloud mode on port null
  2> 472967 INFO  (jetty-launcher-734-thread-2) [n: c: s: r: x: t:] o.a.s.s.CoreContainerProvider \__ \/ _ \ | '_|  Install dir: /home/jenkins/jenkins-slave/workspace/Solr/Solr-Check-9.x/solr
  2> 472967 INFO  (jetty-launcher-734-thread-2) [n: c: s: r: x: t:] o.a.s.s.CoreContainerProvider |___/\___/_|_|    Start time: 2024-02-07T09:33:57.086462Z
  2> 472967 INFO  (jetty-launcher-734-thread-2) [n: c: s: r: x: t:] o.a.s.s.CoreContainerProvider Solr Home: /home/jenkins/jenkins-slave/workspace/Solr/Solr-Check-9.x/solr/core/build/tmp/tests-tmp/solr.cloud.CollectionsAPISolrJTest_CAC03E8425DE12D2-001/tempDir-001/node1 (source: servlet config: solr.solr.home)
  2> 472967 WARN  (jetty-launcher-734-thread-2) [n: c: s: r: x: t:] o.a.s.c.c.SolrZkClient Using default ZkCredentialsInjector. ZkCredentialsInjector is not secure, it creates an empty list of credentials which leads to 'OPEN_ACL_UNSAFE' ACLs to Zookeeper nodes
  2> 472968 INFO  (jetty-launcher-734-thread-1) [n: c: s: r: x: t:] o.a.s.c.c.ConnectionManager Waiting up to 30000ms for client to connect to ZooKeeper
  2> 472980 INFO  (jetty-launcher-734-thread-2) [n: c: s: r: x: t:] o.a.s.c.c.ConnectionManager Waiting up to 30000ms for client to connect to ZooKeeper
  2> 473005 INFO  (jetty-launcher-734-thread-4) [n: c: s: r: x: t:] o.a.s.c.c.ConnectionManager Waiting up to 30000ms for client to connect to ZooKeeper
  2> 473014 INFO  (zkConnectionManagerCallback-736-thread-1) [n: c: s: r: x: t:] o.a.s.c.c.ConnectionManager zkClient has connected
  2> 473014 INFO  (jetty-launcher-734-thread-3) [n: c: s: r: x: t:] o.a.s.c.c.ConnectionManager Client is connected to ZooKeeper
  2> 473015 WARN  (jetty-launcher-734-thread-3) [n: c: s: r: x: t:] o.a.s.c.c.SolrZkClient Using default ZkACLProvider. DefaultZkACLProvider is not secure, it creates 'OPEN_ACL_UNSAFE' ACLs to Zookeeper nodes
  2> 473020 INFO  (jetty-launcher-734-thread-3) [n: c: s: r: x: t:] o.a.s.c.NodeConfig solr.xml found in ZooKeeper. Loading...
  2> 473024 INFO  (jetty-launcher-734-thread-3) [n: c: s: r: x: t:] o.a.s.c.SolrXmlConfig Metrics collection is disabled.
  2> 473024 INFO  (zkConnectionManagerCallback-742-thread-1) [n: c: s: r: x: t:] o.a.s.c.c.ConnectionManager zkClient has connected
  2> 473025 INFO  (zkConnectionManagerCallback-738-thread-1) [n: c: s: r: x: t:] o.a.s.c.c.ConnectionManager zkClient has connected
  2> 473025 INFO  (jetty-launcher-734-thread-1) [n: c: s: r: x: t:] o.a.s.c.c.ConnectionManager Client is connected to ZooKeeper
  2> 473025 INFO  (jetty-launcher-734-thread-2) [n: c: s: r: x: t:] o.a.s.c.c.ConnectionManager Client is connected to ZooKeeper
  2> 473025 WARN  (jetty-launcher-734-thread-1) [n: c: s: r: x: t:] o.a.s.c.c.SolrZkClient Using default ZkACLProvider. DefaultZkACLProvider is not secure, it creates 'OPEN_ACL_UNSAFE' ACLs to Zookeeper nodes
  2> 473025 WARN  (jetty-launcher-734-thread-2) [n: c: s: r: x: t:] o.a.s.c.c.SolrZkClient Using default ZkACLProvider. DefaultZkACLProvider is not secure, it creates 'OPEN_ACL_UNSAFE' ACLs to Zookeeper nodes
  2> 473034 INFO  (jetty-launcher-734-thread-1) [n: c: s: r: x: t:] o.a.s.c.NodeConfig solr.xml found in ZooKeeper. Loading...
  2> 473034 INFO  (zkConnectionManagerCallback-740-thread-1) [n: c: s: r: x: t:] o.a.s.c.c.ConnectionManager zkClient has connected
  2> 473034 INFO  (jetty-launcher-734-thread-4) [n: c: s: r: x: t:] o.a.s.c.c.ConnectionManager Client is connected to ZooKeeper
  2> 473034 WARN  (jetty-launcher-734-thread-4) [n: c: s: r: x: t:] o.a.s.c.c.SolrZkClient Using default ZkACLProvider. DefaultZkACLProvider is not secure, it creates 'OPEN_ACL_UNSAFE' ACLs to Zookeeper nodes
  2> 473041 INFO  (jetty-launcher-734-thread-2) [n: c: s: r: x: t:] o.a.s.c.NodeConfig solr.xml found in ZooKeeper. Loading...
  2> 473042 INFO  (jetty-launcher-734-thread-1) [n: c: s: r: x: t:] o.a.s.c.SolrXmlConfig Metrics collection is disabled.
  2> 473042 INFO  (jetty-launcher-734-thread-2) [n: c: s: r: x: t:] o.a.s.c.SolrXmlConfig Metrics collection is disabled.
  2> 473057 INFO  (jetty-launcher-734-thread-4) [n: c: s: r: x: t:] o.a.s.c.NodeConfig solr.xml found in ZooKeeper. Loading...
  2> 473069 INFO  (jetty-launcher-734-thread-4) [n: c: s: r: x: t:] o.a.s.c.SolrXmlConfig Metrics collection is disabled.
  2> 473143 WARN  (jetty-launcher-734-thread-3) [n: c: s: r: x: t:] o.e.j.u.s.S.config Trusting all certificates configured for Client@7c47940a[provider=null,keyStore=null,trustStore=null]
  2> 473143 WARN  (jetty-launcher-734-thread-3) [n: c: s: r: x: t:] o.e.j.u.s.S.config No Client EndPointIdentificationAlgorithm configured for Client@7c47940a[provider=null,keyStore=null,trustStore=null]
  2> 473173 WARN  (jetty-launcher-734-thread-2) [n: c: s: r: x: t:] o.e.j.u.s.S.config Trusting all certificates configured for Client@101bb5b9[provider=null,keyStore=null,trustStore=null]
  2> 473173 WARN  (jetty-launcher-734-thread-2) [n: c: s: r: x: t:] o.e.j.u.s.S.config No Client EndPointIdentificationAlgorithm configured for Client@101bb5b9[provider=null,keyStore=null,trustStore=null]
  2> 473173 WARN  (jetty-launcher-734-thread-1) [n: c: s: r: x: t:] o.e.j.u.s.S.config Trusting all certificates configured for Client@6e1af14d[provider=null,keyStore=null,trustStore=null]
  2> 473174 WARN  (jetty-launcher-734-thread-1) [n: c: s: r: x: t:] o.e.j.u.s.S.config No Client EndPointIdentificationAlgorithm configured for Client@6e1af14d[provider=null,keyStore=null,trustStore=null]
  2> 473185 WARN  (jetty-launcher-734-thread-3) [n: c: s: r: x: t:] o.e.j.u.s.S.config Trusting all certificates configured for Client@549177a0[provider=null,keyStore=null,trustStore=null]
  2> 473185 WARN  (jetty-launcher-734-thread-3) [n: c: s: r: x: t:] o.e.j.u.s.S.config No Client EndPointIdentificationAlgorithm configured for Client@549177a0[provider=null,keyStore=null,trustStore=null]
  2> 473191 INFO  (jetty-launcher-734-thread-3) [n: c: s: r: x: t:] o.a.s.c.ZkContainer Zookeeper client=127.0.0.1:41509/solr
  2> 473191 INFO  (jetty-launcher-734-thread-3) [n: c: s: r: x: t:] o.a.s.c.DistributedClusterStateUpdater Creating DistributedClusterStateUpdater with useDistributedStateUpdate=false. Solr will be using Overseer based cluster state updates.
  2> 473196 WARN  (jetty-launcher-734-thread-4) [n: c: s: r: x: t:] o.e.j.u.s.S.config Trusting all certificates configured for Client@7e734b9c[provider=null,keyStore=null,trustStore=null]
  2> 473196 INFO  (jetty-launcher-734-thread-3) [n:127.0.0.1:40615_solr c: s: r: x: t:] o.a.s.c.c.ConnectionManager Waiting up to 15000ms for client to connect to ZooKeeper
  2> 473196 WARN  (jetty-launcher-734-thread-4) [n: c: s: r: x: t:] o.e.j.u.s.S.config No Client EndPointIdentificationAlgorithm configured for Client@7e734b9c[provider=null,keyStore=null,trustStore=null]
  2> 473201 WARN  (jetty-launcher-734-thread-1) [n: c: s: r: x: t:] o.e.j.u.s.S.config Trusting all certificates configured for Client@3a285d7f[provider=null,keyStore=null,trustStore=null]
  2> 473599 WARN  (jetty-launcher-734-thread-2) [n: c: s: r: x: t:] o.e.j.u.s.S.config Trusting all certificates configured for Client@22c3a958[provider=null,keyStore=null,trustStore=null]
  2> 473602 WARN  (jetty-launcher-734-thread-1) [n: c: s: r: x: t:] o.e.j.u.s.S.config No Client EndPointIdentificationAlgorithm configured for Client@3a285d7f[provider=null,keyStore=null,trustStore=null]
  2> 473602 WARN  (jetty-launcher-734-thread-2) [n: c: s: r: x: t:] o.e.j.u.s.S.config No Client EndPointIdentificationAlgorithm configured for Client@22c3a958[provider=null,keyStore=null,trustStore=null]
  2> 473608 INFO  (jetty-launcher-734-thread-1) [n: c: s: r: x: t:] o.a.s.c.ZkContainer Zookeeper client=127.0.0.1:41509/solr
  2> 473608 INFO  (jetty-launcher-734-thread-1) [n: c: s: r: x: t:] o.a.s.c.DistributedClusterStateUpdater Creating DistributedClusterStateUpdater with useDistributedStateUpdate=false. Solr will be using Overseer based cluster state updates.
  2> 473612 INFO  (zkConnectionManagerCallback-769-thread-1) [n: c: s: r: x: t:] o.a.s.c.c.ConnectionManager zkClient has connected
  2> 473613 INFO  (jetty-launcher-734-thread-3) [n:127.0.0.1:40615_solr c: s: r: x: t:] o.a.s.c.c.ConnectionManager Client is connected to ZooKeeper
  2> 473625 WARN  (jetty-launcher-734-thread-4) [n: c: s: r: x: t:] o.e.j.u.s.S.config Trusting all certificates configured for Client@452e1177[provider=null,keyStore=null,trustStore=null]
  2> 473625 WARN  (jetty-launcher-734-thread-4) [n: c: s: r: x: t:] o.e.j.u.s.S.config No Client EndPointIdentificationAlgorithm configured for Client@452e1177[provider=null,keyStore=null,trustStore=null]
  2> 473629 INFO  (jetty-launcher-734-thread-1) [n:127.0.0.1:39761_solr c: s: r: x: t:] o.a.s.c.c.ConnectionManager Waiting up to 15000ms for client to connect to ZooKeeper
  2> 473636 INFO  (jetty-launcher-734-thread-4) [n: c: s: r: x: t:] o.a.s.c.ZkContainer Zookeeper client=127.0.0.1:41509/solr
  2> 473636 INFO  (jetty-launcher-734-thread-4) [n: c: s: r: x: t:] o.a.s.c.DistributedClusterStateUpdater Creating DistributedClusterStateUpdater with useDistributedStateUpdate=false. Solr will be using Overseer based cluster state updates.
  2> 473652 INFO  (jetty-launcher-734-thread-4) [n:127.0.0.1:33591_solr c: s: r: x: t:] o.a.s.c.c.ConnectionManager Waiting up to 15000ms for client to connect to ZooKeeper
  2> 473664 INFO  (zkConnectionManagerCallback-775-thread-1) [n: c: s: r: x: t:] o.a.s.c.c.ConnectionManager zkClient has connected
  2> 473664 INFO  (jetty-launcher-734-thread-1) [n:127.0.0.1:39761_solr c: s: r: x: t:] o.a.s.c.c.ConnectionManager Client is connected to ZooKeeper
  2> 473669 INFO  (jetty-launcher-734-thread-2) [n: c: s: r: x: t:] o.a.s.c.ZkContainer Zookeeper client=127.0.0.1:41509/solr
  2> 473669 INFO  (jetty-launcher-734-thread-2) [n: c: s: r: x: t:] o.a.s.c.DistributedClusterStateUpdater Creating DistributedClusterStateUpdater with useDistributedStateUpdate=false. Solr will be using Overseer based cluster state updates.
  2> 473676 INFO  (zkConnectionManagerCallback-781-thread-1) [n: c: s: r: x: t:] o.a.s.c.c.ConnectionManager zkClient has connected
  2> 473677 INFO  (jetty-launcher-734-thread-2) [n:127.0.0.1:41495_solr c: s: r: x: t:] o.a.s.c.c.ConnectionManager Waiting up to 15000ms for client to connect to ZooKeeper
  2> 473679 INFO  (jetty-launcher-734-thread-4) [n:127.0.0.1:33591_solr c: s: r: x: t:] o.a.s.c.c.ConnectionManager Client is connected to ZooKeeper
  2> 473697 INFO  (zkConnectionManagerCallback-784-thread-1) [n: c: s: r: x: t:] o.a.s.c.c.ConnectionManager zkClient has connected
  2> 473697 INFO  (jetty-launcher-734-thread-2) [n:127.0.0.1:41495_solr c: s: r: x: t:] o.a.s.c.c.ConnectionManager Client is connected to ZooKeeper
  2> 473716 WARN  (jetty-launcher-734-thread-1) [n:127.0.0.1:39761_solr c: s: r: x: t:] o.a.s.c.ZkController Contents of zookeeper /security.json are world-readable; consider setting up ACLs as described in https://solr.apache.org/guide/solr/latest/deployment-guide/zookeeper-access-control.html
  2> 473718 INFO  (jetty-launcher-734-thread-1) [n:127.0.0.1:39761_solr c: s: r: x: t:] o.a.s.c.DistributedClusterStateUpdater Creating DistributedClusterStateUpdater with useDistributedStateUpdate=false. Solr will be using Overseer based cluster state updates.
  2> 473720 INFO  (jetty-launcher-734-thread-1) [n:127.0.0.1:39761_solr c: s: r: x: t:] o.a.s.c.OverseerElectionContext I am going to be the leader 127.0.0.1:39761_solr
  2> 473721 INFO  (jetty-launcher-734-thread-1) [n:127.0.0.1:39761_solr c: s: r: x: t:] o.a.s.c.Overseer Overseer (id=72152051641221128-127.0.0.1:39761_solr-n_0000000000) starting
  2> 473728 INFO  (jetty-launcher-734-thread-1) [n:127.0.0.1:39761_solr c: s: r: x: t:] o.a.s.c.ZkController Register node as live in ZooKeeper:/live_nodes/127.0.0.1:39761_solr
  2> 473753 INFO  (zkCallback-774-thread-1) [n: c: s: r: x: t:] o.a.s.c.c.ZkStateReader Updated live nodes from ZooKeeper... (0) -> (1)
  2> 473754 WARN  (jetty-launcher-734-thread-1) [n:127.0.0.1:39761_solr c: s: r: x: t:] o.a.s.c.CoreContainer Not all security plugins configured!  authentication=disabled authorization=disabled.  Solr is only as secure as you make it. Consider configuring authentication/authorization before exposing Solr to users internal or external.  See https://s.apache.org/solrsecurity for more info
  2> 473756 WARN  (jetty-launcher-734-thread-3) [n:127.0.0.1:40615_solr c: s: r: x: t:] o.a.s.c.ZkController Contents of zookeeper /security.json are world-readable; consider setting up ACLs as described in https://solr.apache.org/guide/solr/latest/deployment-guide/zookeeper-access-control.html
  2> 473757 INFO  (jetty-launcher-734-thread-3) [n:127.0.0.1:40615_solr c: s: r: x: t:] o.a.s.c.c.ZkStateReader Updated live nodes from ZooKeeper... (0) -> (1)
  2> 473766 INFO  (jetty-launcher-734-thread-3) [n:127.0.0.1:40615_solr c: s: r: x: t:] o.a.s.c.DistributedClusterStateUpdater Creating DistributedClusterStateUpdater with useDistributedStateUpdate=false. Solr will be using Overseer based cluster state updates.
  2> 473767 INFO  (OverseerStateUpdate-72152051641221128-127.0.0.1:39761_solr-n_0000000000) [n:127.0.0.1:39761_solr c: s: r: x: t:] o.a.s.c.Overseer Starting to work on the main queue : 127.0.0.1:39761_solr
  2> 473767 WARN  (jetty-launcher-734-thread-2) [n:127.0.0.1:41495_solr c: s: r: x: t:] o.a.s.c.ZkController Contents of zookeeper /security.json are world-readable; consider setting up ACLs as described in https://solr.apache.org/guide/solr/latest/deployment-guide/zookeeper-access-control.html
  2> 473769 INFO  (jetty-launcher-734-thread-2) [n:127.0.0.1:41495_solr c: s: r: x: t:] o.a.s.c.c.ZkStateReader Updated live nodes from ZooKeeper... (0) -> (1)
  2> 473785 INFO  (jetty-launcher-734-thread-3) [n:127.0.0.1:40615_solr c: s: r: x: t:] o.a.s.c.ZkController Publish node=127.0.0.1:40615_solr as DOWN
  2> 473790 INFO  (jetty-launcher-734-thread-2) [n:127.0.0.1:41495_solr c: s: r: x: t:] o.a.s.c.DistributedClusterStateUpdater Creating DistributedClusterStateUpdater with useDistributedStateUpdate=false. Solr will be using Overseer based cluster state updates.
  2> 473809 INFO  (jetty-launcher-734-thread-3) [n:127.0.0.1:40615_solr c: s: r: x: t:] o.a.s.c.ZkController Register node as live in ZooKeeper:/live_nodes/127.0.0.1:40615_solr
  2> 473814 INFO  (jetty-launcher-734-thread-2) [n:127.0.0.1:41495_solr c: s: r: x: t:] o.a.s.c.ZkController Publish node=127.0.0.1:41495_solr as DOWN
  2> 473825 INFO  (zkCallback-774-thread-1) [n: c: s: r: x: t:] o.a.s.c.c.ZkStateReader Updated live nodes from ZooKeeper... (1) -> (2)
  2> 473829 INFO  (jetty-launcher-734-thread-2) [n:127.0.0.1:41495_solr c: s: r: x: t:] o.a.s.c.ZkController Register node as live in ZooKeeper:/live_nodes/127.0.0.1:41495_solr
  2> 473834 INFO  (zkCallback-774-thread-1) [n: c: s: r: x: t:] o.a.s.c.c.ZkStateReader Updated live nodes from ZooKeeper... (2) -> (3)
  2> 473835 INFO  (zkCallback-768-thread-1) [n: c: s: r: x: t:] o.a.s.c.c.ZkStateReader Updated live nodes from ZooKeeper... (1) -> (3)
  2> 473836 INFO  (zkCallback-783-thread-1) [n: c: s: r: x: t:] o.a.s.c.c.ZkStateReader Updated live nodes from ZooKeeper... (1) -> (2)
  2> 473840 INFO  (zkCallback-783-thread-2) [n: c: s: r: x: t:] o.a.s.c.c.ZkStateReader Updated live nodes from ZooKeeper... (2) -> (3)
  2> 473849 WARN  (jetty-launcher-734-thread-2) [n:127.0.0.1:41495_solr c: s: r: x: t:] o.a.s.c.CoreContainer Not all security plugins configured!  authentication=disabled authorization=disabled.  Solr is only as secure as you make it. Consider configuring authentication/authorization before exposing Solr to users internal or external.  See https://s.apache.org/solrsecurity for more info
  2> 473864 WARN  (jetty-launcher-734-thread-3) [n:127.0.0.1:40615_solr c: s: r: x: t:] o.a.s.c.CoreContainer Not all security plugins configured!  authentication=disabled authorization=disabled.  Solr is only as secure as you make it. Consider configuring authentication/authorization before exposing Solr to users internal or external.  See https://s.apache.org/solrsecurity for more info
  2> 473864 WARN  (jetty-launcher-734-thread-4) [n:127.0.0.1:33591_solr c: s: r: x: t:] o.a.s.c.ZkController Contents of zookeeper /security.json are world-readable; consider setting up ACLs as described in https://solr.apache.org/guide/solr/latest/deployment-guide/zookeeper-access-control.html
  2> 473870 INFO  (jetty-launcher-734-thread-2) [n:127.0.0.1:41495_solr c: s: r: x: t:] o.a.s.c.CorePropertiesLocator Found 0 core definitions underneath /home/jenkins/jenkins-slave/workspace/Solr/Solr-Check-9.x/solr/core/build/tmp/tests-tmp/solr.cloud.CollectionsAPISolrJTest_CAC03E8425DE12D2-001/tempDir-001/node1
  2> 473892 INFO  (jetty-launcher-734-thread-4) [n:127.0.0.1:33591_solr c: s: r: x: t:] o.a.s.c.c.ZkStateReader Updated live nodes from ZooKeeper... (0) -> (3)
  2> 473894 INFO  (jetty-launcher-734-thread-3) [n:127.0.0.1:40615_solr c: s: r: x: t:] o.a.s.c.CorePropertiesLocator Found 0 core definitions underneath /home/jenkins/jenkins-slave/workspace/Solr/Solr-Check-9.x/solr/core/build/tmp/tests-tmp/solr.cloud.CollectionsAPISolrJTest_CAC03E8425DE12D2-001/tempDir-001/node2
  2> 473956 INFO  (jetty-launcher-734-thread-4) [n:127.0.0.1:33591_solr c: s: r: x: t:] o.a.s.c.DistributedClusterStateUpdater Creating DistributedClusterStateUpdater with useDistributedStateUpdate=false. Solr will be using Overseer based cluster state updates.
  2> 474003 INFO  (jetty-launcher-734-thread-4) [n:127.0.0.1:33591_solr c: s: r: x: t:] o.a.s.c.ZkController Publish node=127.0.0.1:33591_solr as DOWN
  2> 474405 INFO  (jetty-launcher-734-thread-2) [n:127.0.0.1:41495_solr c: s: r: x: t:] o.a.s.j.SolrRequestAuthorizer Creating a new SolrRequestAuthorizer
  2> 474418 INFO  (jetty-launcher-734-thread-3) [n:127.0.0.1:40615_solr c: s: r: x: t:] o.a.s.j.SolrRequestAuthorizer Creating a new SolrRequestAuthorizer
  2> 474523 INFO  (jetty-launcher-734-thread-4) [n:127.0.0.1:33591_solr c: s: r: x: t:] o.a.s.c.ZkController Register node as live in ZooKeeper:/live_nodes/127.0.0.1:33591_solr
  2> 474527 INFO  (zkCallback-768-thread-1) [n: c: s: r: x: t:] o.a.s.c.c.ZkStateReader Updated live nodes from ZooKeeper... (3) -> (4)
  2> 474527 INFO  (zkCallback-783-thread-2) [n: c: s: r: x: t:] o.a.s.c.c.ZkStateReader Updated live nodes from ZooKeeper... (3) -> (4)
  2> 474527 INFO  (zkCallback-774-thread-1) [n: c: s: r: x: t:] o.a.s.c.c.ZkStateReader Updated live nodes from ZooKeeper... (3) -> (4)
  2> 474531 WARN  (jetty-launcher-734-thread-4) [n:127.0.0.1:33591_solr c: s: r: x: t:] o.a.s.c.CoreContainer Not all security plugins configured!  authentication=disabled authorization=disabled.  Solr is only as secure as you make it. Consider configuring authentication/authorization before exposing Solr to users internal or external.  See https://s.apache.org/solrsecurity for more info
  2> 474561 INFO  (jetty-launcher-734-thread-2) [n:127.0.0.1:41495_solr c: s: r: x: t:] o.a.s.e.JettySolrRunner Jetty properties: {hostContext=/solr, hostPort=41495, zkHost=127.0.0.1:41509/solr}
  2> 474577 INFO  (jetty-launcher-734-thread-3) [n:127.0.0.1:40615_solr c: s: r: x: t:] o.a.s.e.JettySolrRunner Jetty properties: {hostContext=/solr, hostPort=40615, zkHost=127.0.0.1:41509/solr}
  2> 474578 INFO  (zkCallback-780-thread-1) [n: c: s: r: x: t:] o.a.s.c.c.ZkStateReader Updated live nodes from ZooKeeper... (3) -> (4)
  2> 474590 INFO  (jetty-launcher-734-thread-1) [n:127.0.0.1:39761_solr c: s: r: x: t:] o.a.s.c.CorePropertiesLocator Found 0 core definitions underneath /home/jenkins/jenkins-slave/workspace/Solr/Solr-Check-9.x/solr/core/build/tmp/tests-tmp/solr.cloud.CollectionsAPISolrJTest_CAC03E8425DE12D2-001/tempDir-001/node3
  2> 474591 INFO  (jetty-launcher-734-thread-4) [n:127.0.0.1:33591_solr c: s: r: x: t:] o.a.s.c.CorePropertiesLocator Found 0 core definitions underneath /home/jenkins/jenkins-slave/workspace/Solr/Solr-Check-9.x/solr/core/build/tmp/tests-tmp/solr.cloud.CollectionsAPISolrJTest_CAC03E8425DE12D2-001/tempDir-001/node4
  2> 474685 INFO  (jetty-launcher-734-thread-1) [n:127.0.0.1:39761_solr c: s: r: x: t:] o.a.s.j.SolrRequestAuthorizer Creating a new SolrRequestAuthorizer
  2> 474698 INFO  (jetty-launcher-734-thread-4) [n:127.0.0.1:33591_solr c: s: r: x: t:] o.a.s.j.SolrRequestAuthorizer Creating a new SolrRequestAuthorizer
  2> 474729 INFO  (jetty-launcher-734-thread-1) [n:127.0.0.1:39761_solr c: s: r: x: t:] o.a.s.e.JettySolrRunner Jetty properties: {hostContext=/solr, hostPort=39761, zkHost=127.0.0.1:41509/solr}
  2> 474745 INFO  (jetty-launcher-734-thread-4) [n:127.0.0.1:33591_solr c: s: r: x: t:] o.a.s.e.JettySolrRunner Jetty properties: {hostContext=/solr, hostPort=33591, zkHost=127.0.0.1:41509/solr}
  2> 474752 INFO  (SUITE-CollectionsAPISolrJTest-seed#[CAC03E8425DE12D2]-worker) [n: c: s: r: x: t:] o.a.s.c.MiniSolrCloudCluster waitForAllNodes: numServers=4
  2> 474752 INFO  (SUITE-CollectionsAPISolrJTest-seed#[CAC03E8425DE12D2]-worker) [n: c: s: r: x: t:] o.a.s.c.MiniSolrCloudCluster waitForNode: 127.0.0.1:41495_solr
  2> 474753 WARN  (SUITE-CollectionsAPISolrJTest-seed#[CAC03E8425DE12D2]-worker) [n: c: s: r: x: t:] o.a.s.c.c.SolrZkClient Using default ZkCredentialsInjector. ZkCredentialsInjector is not secure, it creates an empty list of credentials which leads to 'OPEN_ACL_UNSAFE' ACLs to Zookeeper nodes
  2> 474756 INFO  (SUITE-CollectionsAPISolrJTest-seed#[CAC03E8425DE12D2]-worker) [n: c: s: r: x: t:] o.a.s.c.c.ConnectionManager Waiting up to 15000ms for client to connect to ZooKeeper
  2> 474785 INFO  (zkConnectionManagerCallback-810-thread-1) [n: c: s: r: x: t:] o.a.s.c.c.ConnectionManager zkClient has connected
  2> 474785 INFO  (SUITE-CollectionsAPISolrJTest-seed#[CAC03E8425DE12D2]-worker) [n: c: s: r: x: t:] o.a.s.c.c.ConnectionManager Client is connected to ZooKeeper
  2> 474785 WARN  (SUITE-CollectionsAPISolrJTest-seed#[CAC03E8425DE12D2]-worker) [n: c: s: r: x: t:] o.a.s.c.c.SolrZkClient Using default ZkACLProvider. DefaultZkACLProvider is not secure, it creates 'OPEN_ACL_UNSAFE' ACLs to Zookeeper nodes
  2> 474809 INFO  (SUITE-CollectionsAPISolrJTest-seed#[CAC03E8425DE12D2]-worker) [n: c: s: r: x: t:] o.a.s.c.c.ZkStateReader Updated live nodes from ZooKeeper... (0) -> (4)
  2> 474817 INFO  (SUITE-CollectionsAPISolrJTest-seed#[CAC03E8425DE12D2]-worker) [n: c: s: r: x: t:] o.a.s.c.s.i.ZkClientClusterStateProvider Cluster at 127.0.0.1:41509/solr ready
  2> 474817 INFO  (SUITE-CollectionsAPISolrJTest-seed#[CAC03E8425DE12D2]-worker) [n: c: s: r: x: t:] o.a.s.c.MiniSolrCloudCluster waitForNode: 127.0.0.1:40615_solr
  2> 474817 INFO  (SUITE-CollectionsAPISolrJTest-seed#[CAC03E8425DE12D2]-worker) [n: c: s: r: x: t:] o.a.s.c.MiniSolrCloudCluster waitForNode: 127.0.0.1:39761_solr
  2> 474817 INFO  (SUITE-CollectionsAPISolrJTest-seed#[CAC03E8425DE12D2]-worker) [n: c: s: r: x: t:] o.a.s.c.MiniSolrCloudCluster waitForNode: 127.0.0.1:33591_solr
  2> 474817 WARN  (SUITE-CollectionsAPISolrJTest-seed#[CAC03E8425DE12D2]-worker) [n: c: s: r: x: t:] o.a.s.c.c.SolrZkClient Using default ZkCredentialsInjector. ZkCredentialsInjector is not secure, it creates an empty list of credentials which leads to 'OPEN_ACL_UNSAFE' ACLs to Zookeeper nodes
  2> 474821 INFO  (SUITE-CollectionsAPISolrJTest-seed#[CAC03E8425DE12D2]-worker) [n: c: s: r: x: t:] o.a.s.c.c.ConnectionManager Waiting up to 45000ms for client to connect to ZooKeeper
  2> 474852 INFO  (zkConnectionManagerCallback-812-thread-1) [n: c: s: r: x: t:] o.a.s.c.c.ConnectionManager zkClient has connected
  2> 474856 INFO  (SUITE-CollectionsAPISolrJTest-seed#[CAC03E8425DE12D2]-worker) [n: c: s: r: x: t:] o.a.s.c.c.ConnectionManager Client is connected to ZooKeeper
  2> 474856 WARN  (SUITE-CollectionsAPISolrJTest-seed#[CAC03E8425DE12D2]-worker) [n: c: s: r: x: t:] o.a.s.c.c.SolrZkClient Using default ZkACLProvider. DefaultZkACLProvider is not secure, it creates 'OPEN_ACL_UNSAFE' ACLs to Zookeeper nodes
  2> 475396 WARN  (SUITE-CollectionsAPISolrJTest-seed#[CAC03E8425DE12D2]-worker) [n: c: s: r: x: t:] o.a.s.c.c.SolrZkClient Using default ZkCredentialsInjector. ZkCredentialsInjector is not secure, it creates an empty list of credentials which leads to 'OPEN_ACL_UNSAFE' ACLs to Zookeeper nodes
  2> 475409 INFO  (SUITE-CollectionsAPISolrJTest-seed#[CAC03E8425DE12D2]-worker) [n: c: s: r: x: t:] o.a.s.c.c.ConnectionManager Waiting up to 45000ms for client to connect to ZooKeeper
  2> 475415 INFO  (zkConnectionManagerCallback-814-thread-1) [n: c: s: r: x: t:] o.a.s.c.c.ConnectionManager zkClient has connected
  2> 475415 INFO  (SUITE-CollectionsAPISolrJTest-seed#[CAC03E8425DE12D2]-worker) [n: c: s: r: x: t:] o.a.s.c.c.ConnectionManager Client is connected to ZooKeeper
  2> 475415 WARN  (SUITE-CollectionsAPISolrJTest-seed#[CAC03E8425DE12D2]-worker) [n: c: s: r: x: t:] o.a.s.c.c.SolrZkClient Using default ZkACLProvider. DefaultZkACLProvider is not secure, it creates 'OPEN_ACL_UNSAFE' ACLs to Zookeeper nodes
  2> 475570 INFO  (TEST-CollectionsAPISolrJTest.testCollectionProp-seed#[CAC03E8425DE12D2]) [n: c: s: r: x: t:] o.a.s.SolrTestCaseJ4 ###Starting testCollectionProp
  2> 475708 INFO  (OverseerThreadFactory-793-thread-1) [n: c:testCollectionProp s: r: x: t:] o.a.s.c.a.c.CreateCollectionCmd Create collection testCollectionProp
  2> 476237 INFO  (OverseerStateUpdate-72152051641221128-127.0.0.1:39761_solr-n_0000000000) [n:127.0.0.1:39761_solr c: s: r: x: t:] o.a.s.c.o.SliceMutator createReplica() {
  2>   "core":"testCollectionProp_shard2_replica_n1",
  2>   "node_name":"127.0.0.1:41495_solr",
  2>   "base_url":"https://127.0.0.1:41495/solr",
  2>   "collection":"testCollectionProp",
  2>   "shard":"shard2",
  2>   "state":"down",
  2>   "type":"NRT",
  2>   "operation":"ADDREPLICA",
  2>   "waitForFinalState":"false"} 
  2> 476283 INFO  (OverseerStateUpdate-72152051641221128-127.0.0.1:39761_solr-n_0000000000) [n:127.0.0.1:39761_solr c: s: r: x: t:] o.a.s.c.o.SliceMutator createReplica() {
  2>   "core":"testCollectionProp_shard1_replica_n3",
  2>   "node_name":"127.0.0.1:40615_solr",
  2>   "base_url":"https://127.0.0.1:40615/solr",
  2>   "collection":"testCollectionProp",
  2>   "shard":"shard1",
  2>   "state":"down",
  2>   "type":"NRT",
  2>   "operation":"ADDREPLICA",
  2>   "waitForFinalState":"false"} 
  2> 476336 INFO  (OverseerStateUpdate-72152051641221128-127.0.0.1:39761_solr-n_0000000000) [n:127.0.0.1:39761_solr c: s: r: x: t:] o.a.s.c.o.SliceMutator createReplica() {
  2>   "core":"testCollectionProp_shard2_replica_n4",
  2>   "node_name":"127.0.0.1:39761_solr",
  2>   "base_url":"https://127.0.0.1:39761/solr",
  2>   "collection":"testCollectionProp",
  2>   "shard":"shard2",
  2>   "state":"down",
  2>   "type":"NRT",
  2>   "operation":"ADDREPLICA",
  2>   "waitForFinalState":"false"} 
  2> 476377 INFO  (OverseerStateUpdate-72152051641221128-127.0.0.1:39761_solr-n_0000000000) [n:127.0.0.1:39761_solr c: s: r: x: t:] o.a.s.c.o.SliceMutator createReplica() {
  2>   "core":"testCollectionProp_shard1_replica_n6",
  2>   "node_name":"127.0.0.1:33591_solr",
  2>   "base_url":"https://127.0.0.1:33591/solr",
  2>   "collection":"testCollectionProp",
  2>   "shard":"shard1",
  2>   "state":"down",
  2>   "type":"NRT",
  2>   "operation":"ADDREPLICA",
  2>   "waitForFinalState":"false"} 
  2> 476499 INFO  (zkCallback-774-thread-1) [n: c: s: r: x: t:] o.a.s.c.c.ZkStateReader A cluster state change: [WatchedEvent state:SyncConnected type:NodeDataChanged path:/collections/testCollectionProp/state.json zxid: 171] for collection [testCollectionProp] has occurred - updating... (live nodes size: [4])
  2> 477261 INFO  (qtp1459552910-1190-null-1300) [n:127.0.0.1:33591_solr c: s: r: x:testCollectionProp_shard1_replica_n6 t:null-1300] o.a.s.h.a.CoreAdminOperation core create command qt=/admin/cores&collection.configName=conf&newCollection=true&collection=testCollectionProp&version=2&replicaType=NRT&coreNodeName=core_node8&name=testCollectionProp_shard1_replica_n6&action=CREATE&numShards=2&shard=shard1&wt=javabin
  2> 477275 INFO  (qtp274059919-1164-null-1300) [n:127.0.0.1:40615_solr c: s: r: x:testCollectionProp_shard1_replica_n3 t:null-1300] o.a.s.h.a.CoreAdminOperation core create command qt=/admin/cores&collection.configName=conf&newCollection=true&collection=testCollectionProp&version=2&replicaType=NRT&coreNodeName=core_node5&name=testCollectionProp_shard1_replica_n3&action=CREATE&numShards=2&shard=shard1&wt=javabin
  2> 477276 INFO  (qtp336064475-1182-null-1300) [n:127.0.0.1:41495_solr c: s: r: x:testCollectionProp_shard2_replica_n1 t:null-1300] o.a.s.h.a.CoreAdminOperation core create command qt=/admin/cores&collection.configName=conf&newCollection=true&collection=testCollectionProp&version=2&replicaType=NRT&coreNodeName=core_node2&name=testCollectionProp_shard2_replica_n1&action=CREATE&numShards=2&shard=shard2&wt=javabin
  2> 477281 INFO  (qtp39585137-1177-null-1300) [n:127.0.0.1:39761_solr c: s: r: x:testCollectionProp_shard2_replica_n4 t:null-1300] o.a.s.h.a.CoreAdminOperation core create command qt=/admin/cores&collection.configName=conf&newCollection=true&collection=testCollectionProp&version=2&replicaType=NRT&coreNodeName=core_node7&name=testCollectionProp_shard2_replica_n4&action=CREATE&numShards=2&shard=shard2&wt=javabin
  2> 477325 INFO  (qtp39585137-1177-null-1300) [n:127.0.0.1:39761_solr c:testCollectionProp s:shard2 r:core_node7 x:testCollectionProp_shard2_replica_n4 t:null-1300] o.a.s.c.SolrConfig Using Lucene MatchVersion: 9.9.2
  2> 477333 INFO  (qtp336064475-1182-null-1300) [n:127.0.0.1:41495_solr c:testCollectionProp s:shard2 r:core_node2 x:testCollectionProp_shard2_replica_n1 t:null-1300] o.a.s.c.SolrConfig Using Lucene MatchVersion: 9.9.2
  2> 477333 INFO  (qtp1459552910-1190-null-1300) [n:127.0.0.1:33591_solr c:testCollectionProp s:shard1 r:core_node8 x:testCollectionProp_shard1_replica_n6 t:null-1300] o.a.s.c.SolrConfig Using Lucene MatchVersion: 9.9.2
  2> 477337 INFO  (qtp39585137-1177-null-1300) [n:127.0.0.1:39761_solr c:testCollectionProp s:shard2 r:core_node7 x:testCollectionProp_shard2_replica_n4 t:null-1300] o.a.s.s.IndexSchema Schema name=minimal
  2> 477339 INFO  (qtp1459552910-1190-null-1300) [n:127.0.0.1:33591_solr c:testCollectionProp s:shard1 r:core_node8 x:testCollectionProp_shard1_replica_n6 t:null-1300] o.a.s.s.IndexSchema Schema name=minimal
  2> 477339 INFO  (qtp1459552910-1190-null-1300) [n:127.0.0.1:33591_solr c:testCollectionProp s:shard1 r:core_node8 x:testCollectionProp_shard1_replica_n6 t:null-1300] o.a.s.s.IndexSchema Loaded schema minimal/1.1 with uniqueid field id
  2> 477339 INFO  (qtp1459552910-1190-null-1300) [n:127.0.0.1:33591_solr c:testCollectionProp s:shard1 r:core_node8 x:testCollectionProp_shard1_replica_n6 t:null-1300] o.a.s.c.CoreContainer Creating SolrCore 'testCollectionProp_shard1_replica_n6' using configuration from configset conf, trusted=true
  2> 477340 INFO  (qtp1459552910-1190-null-1300) [n:127.0.0.1:33591_solr c:testCollectionProp s:shard1 r:core_node8 x:testCollectionProp_shard1_replica_n6 t:null-1300] o.a.s.c.SolrCore Opening new SolrCore at [/home/jenkins/jenkins-slave/workspace/Solr/Solr-Check-9.x/solr/core/build/tmp/tests-tmp/solr.cloud.CollectionsAPISolrJTest_CAC03E8425DE12D2-001/tempDir-001/node4/testCollectionProp_shard1_replica_n6], dataDir=[/home/jenkins/jenkins-slave/workspace/Solr/Solr-Check-9.x/solr/core/build/tmp/tests-tmp/solr.cloud.CollectionsAPISolrJTest_CAC03E8425DE12D2-001/tempDir-001/node4/testCollectionProp_shard1_replica_n6/data/]
  2> 477341 INFO  (qtp39585137-1177-null-1300) [n:127.0.0.1:39761_solr c:testCollectionProp s:shard2 r:core_node7 x:testCollectionProp_shard2_replica_n4 t:null-1300] o.a.s.s.IndexSchema Loaded schema minimal/1.1 with uniqueid field id
  2> 477343 INFO  (qtp39585137-1177-null-1300) [n:127.0.0.1:39761_solr c:testCollectionProp s:shard2 r:core_node7 x:testCollectionProp_shard2_replica_n4 t:null-1300] o.a.s.c.CoreContainer Creating SolrCore 'testCollectionProp_shard2_replica_n4' using configuration from configset conf, trusted=true
  2> 477343 INFO  (qtp39585137-1177-null-1300) [n:127.0.0.1:39761_solr c:testCollectionProp s:shard2 r:core_node7 x:testCollectionProp_shard2_replica_n4 t:null-1300] o.a.s.c.SolrCore Opening new SolrCore at [/home/jenkins/jenkins-slave/workspace/Solr/Solr-Check-9.x/solr/core/build/tmp/tests-tmp/solr.cloud.CollectionsAPISolrJTest_CAC03E8425DE12D2-001/tempDir-001/node3/testCollectionProp_shard2_replica_n4], dataDir=[/home/jenkins/jenkins-slave/workspace/Solr/Solr-Check-9.x/solr/core/build/tmp/tests-tmp/solr.cloud.CollectionsAPISolrJTest_CAC03E8425DE12D2-001/tempDir-001/node3/testCollectionProp_shard2_replica_n4/data/]
  2> 477340 INFO  (qtp336064475-1182-null-1300) [n:127.0.0.1:41495_solr c:testCollectionProp s:shard2 r:core_node2 x:testCollectionProp_shard2_replica_n1 t:null-1300] o.a.s.s.IndexSchema Schema name=minimal
  2> 477345 INFO  (qtp336064475-1182-null-1300) [n:127.0.0.1:41495_solr c:testCollectionProp s:shard2 r:core_node2 x:testCollectionProp_shard2_replica_n1 t:null-1300] o.a.s.s.IndexSchema Loaded schema minimal/1.1 with uniqueid field id
  2> 477345 INFO  (qtp336064475-1182-null-1300) [n:127.0.0.1:41495_solr c:testCollectionProp s:shard2 r:core_node2 x:testCollectionProp_shard2_replica_n1 t:null-1300] o.a.s.c.CoreContainer Creating SolrCore 'testCollectionProp_shard2_replica_n1' using configuration from configset conf, trusted=true
  2> 477346 INFO  (qtp336064475-1182-null-1300) [n:127.0.0.1:41495_solr c:testCollectionProp s:shard2 r:core_node2 x:testCollectionProp_shard2_replica_n1 t:null-1300] o.a.s.c.SolrCore Opening new SolrCore at [/home/jenkins/jenkins-slave/workspace/Solr/Solr-Check-9.x/solr/core/build/tmp/tests-tmp/solr.cloud.CollectionsAPISolrJTest_CAC03E8425DE12D2-001/tempDir-001/node1/testCollectionProp_shard2_replica_n1], dataDir=[/home/jenkins/jenkins-slave/workspace/Solr/Solr-Check-9.x/solr/core/build/tmp/tests-tmp/solr.cloud.CollectionsAPISolrJTest_CAC03E8425DE12D2-001/tempDir-001/node1/testCollectionProp_shard2_replica_n1/data/]
  2> 477473 INFO  (qtp274059919-1164-null-1300) [n:127.0.0.1:40615_solr c:testCollectionProp s:shard1 r:core_node5 x:testCollectionProp_shard1_replica_n3 t:null-1300] o.a.s.c.SolrConfig Using Lucene MatchVersion: 9.9.2
  2> 477478 INFO  (qtp1459552910-1190-null-1300) [n:127.0.0.1:33591_solr c:testCollectionProp s:shard1 r:core_node8 x:testCollectionProp_shard1_replica_n6 t:null-1300] o.a.s.j.SolrRequestAuthorizer Creating a new SolrRequestAuthorizer
  2> 477489 INFO  (qtp1459552910-1190-null-1300) [n:127.0.0.1:33591_solr c:testCollectionProp s:shard1 r:core_node8 x:testCollectionProp_shard1_replica_n6 t:null-1300] o.a.s.u.UpdateHandler Using UpdateLog implementation: org.apache.solr.update.UpdateLog
  2> 477489 INFO  (qtp1459552910-1190-null-1300) [n:127.0.0.1:33591_solr c:testCollectionProp s:shard1 r:core_node8 x:testCollectionProp_shard1_replica_n6 t:null-1300] o.a.s.u.UpdateLog Initializing UpdateLog: dataDir=null defaultSyncLevel=FLUSH numRecordsToKeep=100 maxNumLogsToKeep=10 numVersionBuckets=65536
  2> 477489 INFO  (qtp274059919-1164-null-1300) [n:127.0.0.1:40615_solr c:testCollectionProp s:shard1 r:core_node5 x:testCollectionProp_shard1_replica_n3 t:null-1300] o.a.s.s.IndexSchema Schema name=minimal
  2> 477489 INFO  (qtp274059919-1164-null-1300) [n:127.0.0.1:40615_solr c:testCollectionProp s:shard1 r:core_node5 x:testCollectionProp_shard1_replica_n3 t:null-1300] o.a.s.s.IndexSchema Loaded schema minimal/1.1 with uniqueid field id
  2> 477489 INFO  (qtp274059919-1164-null-1300) [n:127.0.0.1:40615_solr c:testCollectionProp s:shard1 r:core_node5 x:testCollectionProp_shard1_replica_n3 t:null-1300] o.a.s.c.CoreContainer Creating SolrCore 'testCollectionProp_shard1_replica_n3' using configuration from configset conf, trusted=true
  2> 477489 INFO  (qtp1459552910-1190-null-1300) [n:127.0.0.1:33591_solr c:testCollectionProp s:shard1 r:core_node8 x:testCollectionProp_shard1_replica_n6 t:null-1300] o.a.s.u.CommitTracker Hard AutoCommit: disabled
  2> 477490 INFO  (qtp1459552910-1190-null-1300) [n:127.0.0.1:33591_solr c:testCollectionProp s:shard1 r:core_node8 x:testCollectionProp_shard1_replica_n6 t:null-1300] o.a.s.u.CommitTracker Soft AutoCommit: disabled
  2> 477490 INFO  (qtp274059919-1164-null-1300) [n:127.0.0.1:40615_solr c:testCollectionProp s:shard1 r:core_node5 x:testCollectionProp_shard1_replica_n3 t:null-1300] o.a.s.c.SolrCore Opening new SolrCore at [/home/jenkins/jenkins-slave/workspace/Solr/Solr-Check-9.x/solr/core/build/tmp/tests-tmp/solr.cloud.CollectionsAPISolrJTest_CAC03E8425DE12D2-001/tempDir-001/node2/testCollectionProp_shard1_replica_n3], dataDir=[/home/jenkins/jenkins-slave/workspace/Solr/Solr-Check-9.x/solr/core/build/tmp/tests-tmp/solr.cloud.CollectionsAPISolrJTest_CAC03E8425DE12D2-001/tempDir-001/node2/testCollectionProp_shard1_replica_n3/data/]
  2> 477509 INFO  (qtp39585137-1177-null-1300) [n:127.0.0.1:39761_solr c:testCollectionProp s:shard2 r:core_node7 x:testCollectionProp_shard2_replica_n4 t:null-1300] o.a.s.j.SolrRequestAuthorizer Creating a new SolrRequestAuthorizer
  2> 477510 INFO  (qtp336064475-1182-null-1300) [n:127.0.0.1:41495_solr c:testCollectionProp s:shard2 r:core_node2 x:testCollectionProp_shard2_replica_n1 t:null-1300] o.a.s.j.SolrRequestAuthorizer Creating a new SolrRequestAuthorizer
  2> 477521 INFO  (qtp1459552910-1190-null-1300) [n:127.0.0.1:33591_solr c:testCollectionProp s:shard1 r:core_node8 x:testCollectionProp_shard1_replica_n6 t:null-1300] o.a.s.r.ManagedResourceStorage Configured ZooKeeperStorageIO with znodeBase: /configs/conf
  2> 477529 INFO  (qtp336064475-1182-null-1300) [n:127.0.0.1:41495_solr c:testCollectionProp s:shard2 r:core_node2 x:testCollectionProp_shard2_replica_n1 t:null-1300] o.a.s.u.UpdateHandler Using UpdateLog implementation: org.apache.solr.update.UpdateLog
  2> 477529 INFO  (qtp1459552910-1190-null-1300) [n:127.0.0.1:33591_solr c:testCollectionProp s:shard1 r:core_node8 x:testCollectionProp_shard1_replica_n6 t:null-1300] o.a.s.r.ManagedResourceStorage Loaded null at path _rest_managed.json using ZooKeeperStorageIO:path=/configs/conf
  2> 477530 INFO  (qtp1459552910-1190-null-1300) [n:127.0.0.1:33591_solr c:testCollectionProp s:shard1 r:core_node8 x:testCollectionProp_shard1_replica_n6 t:null-1300] o.a.s.h.ReplicationHandler Commits will be reserved for 10000 ms
  2> 477530 INFO  (qtp336064475-1182-null-1300) [n:127.0.0.1:41495_solr c:testCollectionProp s:shard2 r:core_node2 x:testCollectionProp_shard2_replica_n1 t:null-1300] o.a.s.u.UpdateLog Initializing UpdateLog: dataDir=null defaultSyncLevel=FLUSH numRecordsToKeep=100 maxNumLogsToKeep=10 numVersionBuckets=65536
  2> 477532 INFO  (qtp39585137-1177-null-1300) [n:127.0.0.1:39761_solr c:testCollectionProp s:shard2 r:core_node7 x:testCollectionProp_shard2_replica_n4 t:null-1300] o.a.s.u.UpdateHandler Using UpdateLog implementation: org.apache.solr.update.UpdateLog
  2> 477532 INFO  (qtp336064475-1182-null-1300) [n:127.0.0.1:41495_solr c:testCollectionProp s:shard2 r:core_node2 x:testCollectionProp_shard2_replica_n1 t:null-1300] o.a.s.u.CommitTracker Hard AutoCommit: disabled
  2> 477532 INFO  (qtp336064475-1182-null-1300) [n:127.0.0.1:41495_solr c:testCollectionProp s:shard2 r:core_node2 x:testCollectionProp_shard2_replica_n1 t:null-1300] o.a.s.u.CommitTracker Soft AutoCommit: disabled
  2> 477544 INFO  (searcherExecutor-818-thread-1-processing-testCollectionProp_shard1_replica_n6 null-1300 core_node8 127.0.0.1:33591_solr testCollectionProp shard1) [n:127.0.0.1:33591_solr c:testCollectionProp s:shard1 r:core_node8 x:testCollectionProp_shard1_replica_n6 t:null-1300] o.a.s.c.SolrCore Registered new searcher autowarm time: 0 ms
  2> 477544 INFO  (qtp274059919-1164-null-1300) [n:127.0.0.1:40615_solr c:testCollectionProp s:shard1 r:core_node5 x:testCollectionProp_shard1_replica_n3 t:null-1300] o.a.s.j.SolrRequestAuthorizer Creating a new SolrRequestAuthorizer
  2> 477532 INFO  (qtp39585137-1177-null-1300) [n:127.0.0.1:39761_solr c:testCollectionProp s:shard2 r:core_node7 x:testCollectionProp_shard2_replica_n4 t:null-1300] o.a.s.u.UpdateLog Initializing UpdateLog: dataDir=null defaultSyncLevel=FLUSH numRecordsToKeep=100 maxNumLogsToKeep=10 numVersionBuckets=65536
  2> 477549 INFO  (qtp39585137-1177-null-1300) [n:127.0.0.1:39761_solr c:testCollectionProp s:shard2 r:core_node7 x:testCollectionProp_shard2_replica_n4 t:null-1300] o.a.s.u.CommitTracker Hard AutoCommit: disabled
  2> 477549 INFO  (qtp39585137-1177-null-1300) [n:127.0.0.1:39761_solr c:testCollectionProp s:shard2 r:core_node7 x:testCollectionProp_shard2_replica_n4 t:null-1300] o.a.s.u.CommitTracker Soft AutoCommit: disabled
  2> 477561 INFO  (qtp274059919-1164-null-1300) [n:127.0.0.1:40615_solr c:testCollectionProp s:shard1 r:core_node5 x:testCollectionProp_shard1_replica_n3 t:null-1300] o.a.s.u.UpdateHandler Using UpdateLog implementation: org.apache.solr.update.UpdateLog
  2> 477561 INFO  (qtp274059919-1164-null-1300) [n:127.0.0.1:40615_solr c:testCollectionProp s:shard1 r:core_node5 x:testCollectionProp_shard1_replica_n3 t:null-1300] o.a.s.u.UpdateLog Initializing UpdateLog: dataDir=null defaultSyncLevel=FLUSH numRecordsToKeep=100 maxNumLogsToKeep=10 numVersionBuckets=65536
  2> 477562 INFO  (qtp274059919-1164-null-1300) [n:127.0.0.1:40615_solr c:testCollectionProp s:shard1 r:core_node5 x:testCollectionProp_shard1_replica_n3 t:null-1300] o.a.s.u.CommitTracker Hard AutoCommit: disabled
  2> 477562 INFO  (qtp274059919-1164-null-1300) [n:127.0.0.1:40615_solr c:testCollectionProp s:shard1 r:core_node5 x:testCollectionProp_shard1_replica_n3 t:null-1300] o.a.s.u.CommitTracker Soft AutoCommit: disabled
  2> 477569 INFO  (qtp39585137-1177-null-1300) [n:127.0.0.1:39761_solr c:testCollectionProp s:shard2 r:core_node7 x:testCollectionProp_shard2_replica_n4 t:null-1300] o.a.s.r.ManagedResourceStorage Configured ZooKeeperStorageIO with znodeBase: /configs/conf
  2> 477571 INFO  (qtp336064475-1182-null-1300) [n:127.0.0.1:41495_solr c:testCollectionProp s:shard2 r:core_node2 x:testCollectionProp_shard

[...truncated too long message...]

host:43815_solr
# 2024-02-07 11:50:42.639 INFO  (main) [c: s: r: x: t:] o.a.s.c.Overseer Overseer (id=72152589277528064-localhost:43815_solr-n_0000000000) starting
# 2024-02-07 11:50:42.984 INFO  (main) [c: s: r: x: t:] o.a.s.c.ZkController Register node as live in ZooKeeper:/live_nodes/localhost:43815_solr
# 2024-02-07 11:50:42.990 INFO  (OverseerStateUpdate-72152589277528064-localhost:43815_solr-n_0000000000) [c: s: r: x: t:] o.a.s.c.Overseer Starting to work on the main queue : localhost:43815_solr
ok 42 icu collation in analysis-extras module in 51695ms
ok 43 package detects no running solr in 908ms
ok 44 lifecycle of package in 37279ms
ok 45 deploying and undeploying a collection level package in 56582ms
ok 46 Affinity placement plugin using sysprop in 71464ms
ok 47 Random placement plugin using ENV in 73080ms
ok 48 Check help command in 20413ms
ok 49 basic post with a type specified in 25923ms
ok 50 basic post with c parameter instead of url parameter in 17659ms
ok 51 basic post WITHOUT a type specified in 52935ms
ok 52 crawling a directory in 21393ms
ok 53 crawling a web site in 22192ms
ok 54 commit and optimize and delete in 16836ms
ok 55 args mode in 27755ms
ok 56 stdin mode in 15228ms
ok 57 post solr log into solr via script in 46219ms
ok 58 post solr log into solr via cli in 33412ms
ok 59 allowPaths - backup in 70406ms
ok 60 start solr with ssl in 74166ms
ok 61 use different hostname when not checking peer-name in 121044ms
ok 62 start solr with ssl and auth in 67948ms
ok 63 start solr with client truststore and security manager in 75567ms
ok 64 start solr with mTLS needed in 209606ms
ok 65 start solr with mTLS wanted in 178240ms
not ok 66 test keystore reload in 101640ms
# (from function `assert_output' in file /home/jenkins/jenkins-slave/workspace/Solr/Solr-Check-9.x/.gradle/node/packaging/node_modules/bats-assert/src/assert.bash, line 247,
#  in test file test/test_ssl.bats, line 540)
#   `assert_output --partial "Created collection 'test'"' failed
# Waiting up to 180 seconds to see Solr running on port 43815 [|]   [/]   [-]   [\]   [|]   [/]   [-]   [\]   [|]   [/]   [-]   [\]   [|]   [/]
# Started Solr server on port 43815 (pid=6929). Happy searching!
#
#     INFO  - 2024-02-07 12:15:04.600; org.apache.solr.util.configuration.SSLConfigurations; Setting javax.net.ssl.keyStorePassword
# INFO  - 2024-02-07 12:15:04.612; org.apache.solr.util.configuration.SSLConfigurations; Setting javax.net.ssl.trustStorePassword
# INFO  - 2024-02-07 12:15:07.167; org.eclipse.jetty.util.ssl.SslContextFactory; x509=X509@475835b1(cert1,h=[localhost],a=[/127.0.0.1],w=[]) for Client@5dbe30be[provider=null,keyStore=file:///tmp/bats-run-uIHNbi/test/66/ssl/server1.keystore.p12,trustStore=file:///tmp/bats-run-uIHNbi/test/66/ssl/server1.keystore.p12]
# Waiting up to 180 seconds to see Solr running on port 43816 [|]   [/]   [-]   [\]   [|]   [/]   [-]   [\]   [|]   [/]
# Started Solr server on port 43816 (pid=7497). Happy searching!
#
#     INFO  - 2024-02-07 12:15:29.109; org.apache.solr.util.configuration.SSLConfigurations; Setting javax.net.ssl.keyStorePassword
# INFO  - 2024-02-07 12:15:29.114; org.apache.solr.util.configuration.SSLConfigurations; Setting javax.net.ssl.trustStorePassword
# INFO  - 2024-02-07 12:15:30.460; org.eclipse.jetty.util.ssl.SslContextFactory; x509=X509@4fad94a7(cert1,h=[localhost],a=[/127.0.0.1],w=[]) for Client@89c10b7[provider=null,keyStore=file:///tmp/bats-run-uIHNbi/test/66/ssl/server2.keystore.p12,trustStore=file:///tmp/bats-run-uIHNbi/test/66/ssl/server2.keystore.p12]
#
# -- output does not contain substring --
# substring (1 lines):
#   Created collection 'test'
# output (8 lines):
#   WARNING: Using _default configset with data driven schema functionality. NOT RECOMMENDED for production use.
#            To turn off: bin/solr config -c test -p 43816 -action set-user-property -property update.autoCreateFields -value false
#   INFO  - 2024-02-07 12:15:45.982; org.apache.solr.util.configuration.SSLConfigurations; Setting javax.net.ssl.keyStorePassword
#   INFO  - 2024-02-07 12:15:45.987; org.apache.solr.util.configuration.SSLConfigurations; Setting javax.net.ssl.trustStorePassword
#   WARN  - 2024-02-07 12:15:51.456; org.apache.solr.common.cloud.SolrZkClient; Using default ZkCredentialsInjector. ZkCredentialsInjector is not secure, it creates an empty list of credentials which leads to 'OPEN_ACL_UNSAFE' ACLs to Zookeeper nodes
#   WARN  - 2024-02-07 12:15:51.576; org.apache.solr.common.cloud.SolrZkClient; Using default ZkACLProvider. DefaultZkACLProvider is not secure, it creates 'OPEN_ACL_UNSAFE' ACLs to Zookeeper nodes
#
#   ERROR: Error from server at https://localhost:43815/solr/admin/collections?action=CREATE&name=test&collection.configName=test&numShards=2&nrtReplicas=1&wt=javabin&version=2: Underlying core creation failed while creating collection: test
# --
#
# Please find the SOLR_HOME snapshot for failed test #7 at: /home/jenkins/jenkins-slave/workspace/Solr/Solr-Check-9.x/solr/packaging/build/test-output/failure-snapshots/66-7
# Last output:
# INFO  - 2024-02-07 12:16:09.388; org.apache.solr.util.configuration.SSLConfigurations; Setting javax.net.ssl.keyStorePassword
# INFO  - 2024-02-07 12:16:09.393; org.apache.solr.util.configuration.SSLConfigurations; Setting javax.net.ssl.trustStorePassword
# WARN  - 2024-02-07 12:16:13.723; org.apache.solr.common.cloud.SolrZkClient; Using default ZkCredentialsInjector. ZkCredentialsInjector is not secure, it creates an empty list of credentials which leads to 'OPEN_ACL_UNSAFE' ACLs to Zookeeper nodes
# WARN  - 2024-02-07 12:16:16.123; org.apache.solr.common.cloud.SolrZkClient; Using default ZkACLProvider. DefaultZkACLProvider is not secure, it creates 'OPEN_ACL_UNSAFE' ACLs to Zookeeper nodes
ok 67 SOLR-11740 check 'solr stop' connection in 44742ms
ok 68 stop command for single port in 57496ms
ok 69 status detects locally running solr in 27685ms
ok 70 status does not expose cli parameters to end user in 998ms
ok 71 listing out files in 10385ms
ok 72 copying files around in 30896ms
ok 73 upconfig in 8874ms
ok 74 zkcli.sh gets 'solrhome' from 'solr.home' system property in 1920ms
ok 75 zkcli.sh gets 'solrhome' from 'solrhome' command line option in 2426ms
ok 76 Cleanup in 2695ms

> Task :solr:packaging:integrationTests FAILED

ERROR: The following test(s) have failed:
  - org.apache.solr.cli.PostToolTest.testBasicRun (:solr:core)
    Test output: /home/jenkins/jenkins-slave/workspace/Solr/Solr-Check-9.x/solr/core/build/test-results/test/outputs/OUTPUT-org.apache.solr.cli.PostToolTest.txt
    Reproduce with: gradlew :solr:core:test --tests "org.apache.solr.cli.PostToolTest.testBasicRun" -Ptests.jvms=4 -Ptests.haltonfailure=false "-Ptests.jvmargs=-XX:TieredStopAtLevel=1 -XX:+UseParallelGC -XX:ActiveProcessorCount=1 -XX:ReservedCodeCacheSize=120m" -Ptests.seed=CAC03E8425DE12D2 -Ptests.multiplier=2 -Ptests.badapples=false -Ptests.file.encoding=ISO-8859-1

  - org.apache.solr.cloud.CollectionsAPISolrJTest.testDeleteAliasedCollection (:solr:core)
    Test output: /home/jenkins/jenkins-slave/workspace/Solr/Solr-Check-9.x/solr/core/build/test-results/test/outputs/OUTPUT-org.apache.solr.cloud.CollectionsAPISolrJTest.txt
    Reproduce with: gradlew :solr:core:test --tests "org.apache.solr.cloud.CollectionsAPISolrJTest.testDeleteAliasedCollection" -Ptests.jvms=4 -Ptests.haltonfailure=false "-Ptests.jvmargs=-XX:TieredStopAtLevel=1 -XX:+UseParallelGC -XX:ActiveProcessorCount=1 -XX:ReservedCodeCacheSize=120m" -Ptests.seed=CAC03E8425DE12D2 -Ptests.multiplier=2 -Ptests.badapples=false -Ptests.file.encoding=ISO-8859-1

  - org.apache.solr.cloud.FullSolrCloudDistribCmdsTest.testDeleteByIdImplicitRouter (:solr:core)
    Test output: /home/jenkins/jenkins-slave/workspace/Solr/Solr-Check-9.x/solr/core/build/test-results/test/outputs/OUTPUT-org.apache.solr.cloud.FullSolrCloudDistribCmdsTest.txt
    Reproduce with: gradlew :solr:core:test --tests "org.apache.solr.cloud.FullSolrCloudDistribCmdsTest.testDeleteByIdImplicitRouter" -Ptests.jvms=4 -Ptests.haltonfailure=false "-Ptests.jvmargs=-XX:TieredStopAtLevel=1 -XX:+UseParallelGC -XX:ActiveProcessorCount=1 -XX:ReservedCodeCacheSize=120m" -Ptests.seed=CAC03E8425DE12D2 -Ptests.multiplier=2 -Ptests.badapples=false -Ptests.file.encoding=ISO-8859-1

WARNING: there were unreferenced files under license folder:
  - /home/jenkins/jenkins-slave/workspace/Solr/Solr-Check-9.x/solr/licenses/jakarta.inject-2.6.1.jar.sha1

FAILURE: Build failed with an exception.

* Where:
Build file '/home/jenkins/jenkins-slave/workspace/Solr/Solr-Check-9.x/solr/packaging/build.gradle' line: 301

* What went wrong:
Execution failed for task ':solr:packaging:integrationTests'.
> Process 'command '/home/jenkins/jenkins-slave/workspace/Solr/Solr-Check-9.x/.gradle/node/packaging/node_modules/bats/bin/bats'' finished with non-zero exit value 1

* Try:
> Run with --stacktrace option to get the stack trace.
> Run with --info or --debug option to get more log output.
> Get more help at https://help.gradle.org.

Deprecated Gradle features were used in this build, making it incompatible with Gradle 9.0.

You can use '--warning-mode all' to show the individual deprecation warnings and determine if they come from your own scripts or plugins.

For more on this, please refer to https://docs.gradle.org/8.4/userguide/command_line_interface.html#sec:command_line_warnings in the Gradle documentation.

BUILD FAILED in 3h 15m 52s
693 actionable tasks: 693 executed

Publishing build scan...
https://ge.apache.org/s/a6jqzcgwmzf6e

Build step 'Invoke Gradle script' changed build result to FAILURE
Build step 'Invoke Gradle script' marked build as failure
Archiving artifacts
Recording test results
[Checks API] No suitable checks publisher found.
Email was triggered for: Failure - Any
Sending email for trigger: Failure - Any