You are viewing a plain text version of this content. The canonical link for it is here.
Posted to dev@uima.apache.org by Apache Jenkins Server <je...@builds.apache.org> on 2016/12/20 19:31:28 UTC

Build failed in Jenkins: UIMA-v3-sdk #23

See <https://builds.apache.org/job/UIMA-v3-sdk/23/changes>

Changes:

[schor] [UIMA-5225] set the semver back to ignore compatibility so the rest of the build runs.

------------------------------------------
[...truncated 4219 lines...]
[INFO] Apache UIMA Aggregate: aggregate-uimaj-eclipse-plugins SKIPPED
[INFO] Apache UIMA SDK Documentation - overview and setup . SKIPPED
[INFO] Apache UIMA SDK Documentation - references ......... SKIPPED
[INFO] Apache UIMA SDK Documentation - tools .............. SKIPPED
[INFO] Apache UIMA SDK Documentation - tutorials and user's guides SKIPPED
[INFO] Apache UIMA SDK Documentation - tutorials and user's guides SKIPPED
[INFO] Apache UIMA Aggregate: aggregate-uimaj-docbooks .... SKIPPED
[INFO] Apache UIMA Maven: PearPackagingMavenPlugin ........ SKIPPED
[INFO] Apache UIMA Maven: jcasgen-maven-plugin ............ SKIPPED
[INFO] Apache UIMA Base: uimaj-bootstrap .................. SKIPPED
[INFO] Apache UIMA Aggregate: aggregate-uimaj ............. SKIPPED
[INFO] Apache UIMA Base: uimaj-json: JSON ................. SKIPPED
[INFO] Apache UIMA Java SDK: uimaj ........................ SKIPPED
[INFO] ------------------------------------------------------------------------
[INFO] BUILD FAILURE
[INFO] ------------------------------------------------------------------------
[INFO] Total time: 01:16 min
[INFO] Finished at: 2016-12-20T18:57:36+00:00
[INFO] Final Memory: 72M/743M
[INFO] ------------------------------------------------------------------------
Waiting for Jenkins to finish collecting data
[ERROR] Failed to execute goal org.apache.maven.plugins:maven-compiler-plugin:3.1:compile (default-compile) on project uimaj-core: Compilation failure: Compilation failure:
[ERROR] <https://builds.apache.org/job/UIMA-v3-sdk/ws/uimaj-core/src/main/java/org/apache/uima/cas/impl/FeatureStructureImpl.java>:[53,50] cannot find symbol
[ERROR] symbol:   method getHeapValue(int)
[ERROR] location: class org.apache.uima.cas.impl.CASImpl
[ERROR] <https://builds.apache.org/job/UIMA-v3-sdk/ws/uimaj-core/src/main/java/org/apache/uima/cas/impl/FeatureStructureImpl.java>:[57,35] cannot find symbol
[ERROR] symbol:   method getHeapValue(int)
[ERROR] location: class org.apache.uima.cas.impl.CASImpl
[ERROR] <https://builds.apache.org/job/UIMA-v3-sdk/ws/uimaj-core/src/main/java/org/apache/uima/cas/impl/FeatureStructureImpl.java>:[68,55] cannot find symbol
[ERROR] symbol:   method getHeapValue(int)
[ERROR] location: class org.apache.uima.cas.impl.CASImpl
[ERROR] <https://builds.apache.org/job/UIMA-v3-sdk/ws/uimaj-core/src/main/java/org/apache/uima/cas/impl/FeatureStructureImpl.java>:[69,56] cannot find symbol
[ERROR] symbol:   method getHeapValue(int)
[ERROR] location: class org.apache.uima.cas.impl.CASImpl
[ERROR] <https://builds.apache.org/job/UIMA-v3-sdk/ws/uimaj-core/src/main/java/org/apache/uima/cas/impl/FeatureStructureImpl.java>:[81,34] cannot find symbol
[ERROR] symbol:   method setFeatureValueNoIndexCorruptionCheck(int,int,int)
[ERROR] location: class org.apache.uima.cas.impl.CASImpl
[ERROR] <https://builds.apache.org/job/UIMA-v3-sdk/ws/uimaj-core/src/main/java/org/apache/uima/cas/impl/FeatureStructureImpl.java>:[85,49] incompatible types: int cannot be converted to org.apache.uima.cas.Type
[ERROR] <https://builds.apache.org/job/UIMA-v3-sdk/ws/uimaj-core/src/main/java/org/apache/uima/cas/impl/FeatureStructureImpl.java>:[85,93] incompatible types: int cannot be converted to org.apache.uima.cas.Type
[ERROR] <https://builds.apache.org/job/UIMA-v3-sdk/ws/uimaj-core/src/main/java/org/apache/uima/cas/impl/FeatureStructureImpl.java>:[86,67] incompatible types: int cannot be converted to org.apache.uima.cas.Type
[ERROR] <https://builds.apache.org/job/UIMA-v3-sdk/ws/uimaj-core/src/main/java/org/apache/uima/cas/impl/FeatureStructureImpl.java>:[92,34] cannot find symbol
[ERROR] symbol:   method setFeatureValueNoIndexCorruptionCheck(int,int,int)
[ERROR] location: class org.apache.uima.cas.impl.CASImpl
[ERROR] <https://builds.apache.org/job/UIMA-v3-sdk/ws/uimaj-core/src/main/java/org/apache/uima/cas/impl/FeatureStructureImpl.java>:[97,92] cannot find symbol
[ERROR] symbol:   method getHeapValue(int)
[ERROR] location: class org.apache.uima.cas.impl.CASImpl
[ERROR] <https://builds.apache.org/job/UIMA-v3-sdk/ws/uimaj-core/src/main/java/org/apache/uima/cas/impl/FeatureStructureImpl.java>:[106,80] incompatible types: int cannot be converted to org.apache.uima.jcas.cas.TOP
[ERROR] <https://builds.apache.org/job/UIMA-v3-sdk/ws/uimaj-core/src/main/java/org/apache/uima/cas/impl/FeatureStructureImpl.java>:[111,92] cannot find symbol
[ERROR] symbol:   method getHeapValue(int)
[ERROR] location: class org.apache.uima.cas.impl.CASImpl
[ERROR] <https://builds.apache.org/job/UIMA-v3-sdk/ws/uimaj-core/src/main/java/org/apache/uima/cas/impl/FeatureStructureImpl.java>:[120,34] cannot find symbol
[ERROR] symbol:   method setFloatValue(int,int,float)
[ERROR] location: class org.apache.uima.cas.impl.CASImpl
[ERROR] <https://builds.apache.org/job/UIMA-v3-sdk/ws/uimaj-core/src/main/java/org/apache/uima/cas/impl/FeatureStructureImpl.java>:[127,55] cannot find symbol
[ERROR] symbol:   method getHeapValue(int)
[ERROR] location: class org.apache.uima.cas.impl.CASImpl
[ERROR] <https://builds.apache.org/job/UIMA-v3-sdk/ws/uimaj-core/src/main/java/org/apache/uima/cas/impl/FeatureStructureImpl.java>:[147,92] cannot find symbol
[ERROR] symbol:   method getHeapValue(int)
[ERROR] location: class org.apache.uima.cas.impl.CASImpl
[ERROR] <https://builds.apache.org/job/UIMA-v3-sdk/ws/uimaj-core/src/main/java/org/apache/uima/cas/impl/FeatureStructureImpl.java>:[157,80] incompatible types: byte cannot be converted to org.apache.uima.jcas.cas.TOP
[ERROR] <https://builds.apache.org/job/UIMA-v3-sdk/ws/uimaj-core/src/main/java/org/apache/uima/cas/impl/FeatureStructureImpl.java>:[163,92] cannot find symbol
[ERROR] symbol:   method getHeapValue(int)
[ERROR] location: class org.apache.uima.cas.impl.CASImpl
[ERROR] <https://builds.apache.org/job/UIMA-v3-sdk/ws/uimaj-core/src/main/java/org/apache/uima/cas/impl/FeatureStructureImpl.java>:[172,80] incompatible types: boolean cannot be converted to org.apache.uima.jcas.cas.TOP
[ERROR] <https://builds.apache.org/job/UIMA-v3-sdk/ws/uimaj-core/src/main/java/org/apache/uima/cas/impl/FeatureStructureImpl.java>:[178,92] cannot find symbol
[ERROR] symbol:   method getHeapValue(int)
[ERROR] location: class org.apache.uima.cas.impl.CASImpl
[ERROR] <https://builds.apache.org/job/UIMA-v3-sdk/ws/uimaj-core/src/main/java/org/apache/uima/cas/impl/FeatureStructureImpl.java>:[187,80] incompatible types: short cannot be converted to org.apache.uima.jcas.cas.TOP
[ERROR] <https://builds.apache.org/job/UIMA-v3-sdk/ws/uimaj-core/src/main/java/org/apache/uima/cas/impl/FeatureStructureImpl.java>:[192,92] cannot find symbol
[ERROR] symbol:   method getHeapValue(int)
[ERROR] location: class org.apache.uima.cas.impl.CASImpl
[ERROR] <https://builds.apache.org/job/UIMA-v3-sdk/ws/uimaj-core/src/main/java/org/apache/uima/cas/impl/FeatureStructureImpl.java>:[201,80] incompatible types: long cannot be converted to org.apache.uima.jcas.cas.TOP
[ERROR] <https://builds.apache.org/job/UIMA-v3-sdk/ws/uimaj-core/src/main/java/org/apache/uima/cas/impl/FeatureStructureImpl.java>:[206,92] cannot find symbol
[ERROR] symbol:   method getHeapValue(int)
[ERROR] location: class org.apache.uima.cas.impl.CASImpl
[ERROR] <https://builds.apache.org/job/UIMA-v3-sdk/ws/uimaj-core/src/main/java/org/apache/uima/cas/impl/FeatureStructureImpl.java>:[215,80] incompatible types: double cannot be converted to org.apache.uima.jcas.cas.TOP
[ERROR] <https://builds.apache.org/job/UIMA-v3-sdk/ws/uimaj-core/src/main/java/org/apache/uima/cas/impl/FeatureStructureImpl.java>:[220,76] incompatible types: int cannot be converted to org.apache.uima.cas.impl.FeatureStructureImplC
[ERROR] <https://builds.apache.org/job/UIMA-v3-sdk/ws/uimaj-core/src/main/java/org/apache/uima/cas/impl/FeatureStructureImpl.java>:[230,51] cannot find symbol
[ERROR] symbol:   method getHeapValue(int)
[ERROR] location: class org.apache.uima.cas.impl.CASImpl
[ERROR] <https://builds.apache.org/job/UIMA-v3-sdk/ws/uimaj-core/src/main/java/org/apache/uima/cas/impl/FeatureStructureImpl.java>:[242,54] cannot find symbol
[ERROR] symbol:   method getFeatureValue(int,int)
[ERROR] location: class org.apache.uima.cas.impl.CASImpl
[ERROR] <https://builds.apache.org/job/UIMA-v3-sdk/ws/uimaj-core/src/main/java/org/apache/uima/cas/impl/FeatureStructureImpl.java>:[261,41] cannot find symbol
[ERROR] symbol:   method getFeatureValue(int,int)
[ERROR] location: class org.apache.uima.cas.impl.CASImpl
[ERROR] <https://builds.apache.org/job/UIMA-v3-sdk/ws/uimaj-core/src/main/java/org/apache/uima/cas/impl/FeatureStructureImpl.java>:[273,41] cannot find symbol
[ERROR] symbol:   method getFloatValue(int,int)
[ERROR] location: class org.apache.uima.cas.impl.CASImpl
[ERROR] <https://builds.apache.org/job/UIMA-v3-sdk/ws/uimaj-core/src/main/java/org/apache/uima/cas/impl/FeatureStructureImpl.java>:[292,41] cannot find symbol
[ERROR] symbol:   method getStringValue(int,int)
[ERROR] location: class org.apache.uima.cas.impl.CASImpl
[ERROR] <https://builds.apache.org/job/UIMA-v3-sdk/ws/uimaj-core/src/main/java/org/apache/uima/cas/impl/FeatureStructureImpl.java>:[304,41] cannot find symbol
[ERROR] symbol:   method getByteValue(int,int)
[ERROR] location: class org.apache.uima.cas.impl.CASImpl
[ERROR] <https://builds.apache.org/job/UIMA-v3-sdk/ws/uimaj-core/src/main/java/org/apache/uima/cas/impl/FeatureStructureImpl.java>:[316,41] cannot find symbol
[ERROR] symbol:   method getBooleanValue(int,int)
[ERROR] location: class org.apache.uima.cas.impl.CASImpl
[ERROR] <https://builds.apache.org/job/UIMA-v3-sdk/ws/uimaj-core/src/main/java/org/apache/uima/cas/impl/FeatureStructureImpl.java>:[329,41] cannot find symbol
[ERROR] symbol:   method getShortValue(int,int)
[ERROR] location: class org.apache.uima.cas.impl.CASImpl
[ERROR] <https://builds.apache.org/job/UIMA-v3-sdk/ws/uimaj-core/src/main/java/org/apache/uima/cas/impl/FeatureStructureImpl.java>:[341,41] cannot find symbol
[ERROR] symbol:   method getLongValue(int,int)
[ERROR] location: class org.apache.uima.cas.impl.CASImpl
[ERROR] <https://builds.apache.org/job/UIMA-v3-sdk/ws/uimaj-core/src/main/java/org/apache/uima/cas/impl/FeatureStructureImpl.java>:[353,41] cannot find symbol
[ERROR] symbol:   method getDoubleValue(int,int)
[ERROR] location: class org.apache.uima.cas.impl.CASImpl
[ERROR] <https://builds.apache.org/job/UIMA-v3-sdk/ws/uimaj-core/src/main/java/org/apache/uima/cas/impl/FeatureStructureImpl.java>:[358,41] cannot find symbol
[ERROR] symbol:   method getFeatureValueAsString(int,int)
[ERROR] location: class org.apache.uima.cas.impl.CASImpl
[ERROR] <https://builds.apache.org/job/UIMA-v3-sdk/ws/uimaj-core/src/main/java/org/apache/uima/cas/impl/FeatureStructureImpl.java>:[501,17] cannot find symbol
[ERROR] symbol:   class CommonAuxArrayFSImpl
[ERROR] location: class org.apache.uima.cas.impl.FeatureStructureImpl
[ERROR] <https://builds.apache.org/job/UIMA-v3-sdk/ws/uimaj-core/src/main/java/org/apache/uima/cas/impl/FeatureStructureImpl.java>:[507,36] no suitable method found for printSpaces(int,java.lang.StringBuffer)
[ERROR] method org.apache.uima.internal.util.StringUtils.printSpaces(int,java.lang.StringBuilder) is not applicable
[ERROR] (argument mismatch; java.lang.StringBuffer cannot be converted to java.lang.StringBuilder)
[ERROR] method org.apache.uima.internal.util.StringUtils.printSpaces(int,java.io.Writer) is not applicable
[ERROR] (argument mismatch; java.lang.StringBuffer cannot be converted to java.io.Writer)
[ERROR] <https://builds.apache.org/job/UIMA-v3-sdk/ws/uimaj-core/src/main/java/org/apache/uima/cas/impl/FeatureStructureImpl.java>:[510,44] no suitable method found for printSpaces(int,java.lang.StringBuffer)
[ERROR] method org.apache.uima.internal.util.StringUtils.printSpaces(int,java.lang.StringBuilder) is not applicable
[ERROR] (argument mismatch; java.lang.StringBuffer cannot be converted to java.lang.StringBuilder)
[ERROR] method org.apache.uima.internal.util.StringUtils.printSpaces(int,java.io.Writer) is not applicable
[ERROR] (argument mismatch; java.lang.StringBuffer cannot be converted to java.io.Writer)
[ERROR] <https://builds.apache.org/job/UIMA-v3-sdk/ws/uimaj-core/src/main/java/org/apache/uima/cas/impl/FeatureStructureImpl.java>:[524,36] no suitable method found for printSpaces(int,java.lang.StringBuffer)
[ERROR] method org.apache.uima.internal.util.StringUtils.printSpaces(int,java.lang.StringBuilder) is not applicable
[ERROR] (argument mismatch; java.lang.StringBuffer cannot be converted to java.lang.StringBuilder)
[ERROR] method org.apache.uima.internal.util.StringUtils.printSpaces(int,java.io.Writer) is not applicable
[ERROR] (argument mismatch; java.lang.StringBuffer cannot be converted to java.io.Writer)
[ERROR] <https://builds.apache.org/job/UIMA-v3-sdk/ws/uimaj-core/src/main/java/org/apache/uima/cas/impl/FeatureStructureImpl.java>:[527,44] no suitable method found for printSpaces(int,java.lang.StringBuffer)
[ERROR] method org.apache.uima.internal.util.StringUtils.printSpaces(int,java.lang.StringBuilder) is not applicable
[ERROR] (argument mismatch; java.lang.StringBuffer cannot be converted to java.lang.StringBuilder)
[ERROR] method org.apache.uima.internal.util.StringUtils.printSpaces(int,java.io.Writer) is not applicable
[ERROR] (argument mismatch; java.lang.StringBuffer cannot be converted to java.io.Writer)
[ERROR] <https://builds.apache.org/job/UIMA-v3-sdk/ws/uimaj-core/src/main/java/org/apache/uima/cas/impl/FeatureStructureImpl.java>:[540,36] no suitable method found for printSpaces(int,java.lang.StringBuffer)
[ERROR] method org.apache.uima.internal.util.StringUtils.printSpaces(int,java.lang.StringBuilder) is not applicable
[ERROR] (argument mismatch; java.lang.StringBuffer cannot be converted to java.lang.StringBuilder)
[ERROR] method org.apache.uima.internal.util.StringUtils.printSpaces(int,java.io.Writer) is not applicable
[ERROR] (argument mismatch; java.lang.StringBuffer cannot be converted to java.io.Writer)
[ERROR] <https://builds.apache.org/job/UIMA-v3-sdk/ws/uimaj-core/src/main/java/org/apache/uima/cas/impl/FeatureStructureImpl.java>:[543,44] no suitable method found for printSpaces(int,java.lang.StringBuffer)
[ERROR] method org.apache.uima.internal.util.StringUtils.printSpaces(int,java.lang.StringBuilder) is not applicable
[ERROR] (argument mismatch; java.lang.StringBuffer cannot be converted to java.lang.StringBuilder)
[ERROR] method org.apache.uima.internal.util.StringUtils.printSpaces(int,java.io.Writer) is not applicable
[ERROR] (argument mismatch; java.lang.StringBuffer cannot be converted to java.io.Writer)
[ERROR] <https://builds.apache.org/job/UIMA-v3-sdk/ws/uimaj-core/src/main/java/org/apache/uima/cas/impl/FeatureStructureImpl.java>:[560,47] cannot find symbol
[ERROR] symbol:   class ByteArrayFSImpl
[ERROR] location: class org.apache.uima.cas.impl.FeatureStructureImpl
[ERROR] <https://builds.apache.org/job/UIMA-v3-sdk/ws/uimaj-core/src/main/java/org/apache/uima/cas/impl/FeatureStructureImpl.java>:[562,47] cannot find symbol
[ERROR] symbol:   class ByteArrayFSImpl
[ERROR] location: class org.apache.uima.cas.impl.FeatureStructureImpl
[ERROR] <https://builds.apache.org/job/UIMA-v3-sdk/ws/uimaj-core/src/main/java/org/apache/uima/cas/impl/FeatureStructureImpl.java>:[564,47] cannot find symbol
[ERROR] symbol:   class ShortArrayFSImpl
[ERROR] location: class org.apache.uima.cas.impl.FeatureStructureImpl
[ERROR] <https://builds.apache.org/job/UIMA-v3-sdk/ws/uimaj-core/src/main/java/org/apache/uima/cas/impl/FeatureStructureImpl.java>:[566,47] cannot find symbol
[ERROR] symbol:   class LongArrayFSImpl
[ERROR] location: class org.apache.uima.cas.impl.FeatureStructureImpl
[ERROR] <https://builds.apache.org/job/UIMA-v3-sdk/ws/uimaj-core/src/main/java/org/apache/uima/cas/impl/FeatureStructureImpl.java>:[568,47] cannot find symbol
[ERROR] symbol:   class DoubleArrayFSImpl
[ERROR] location: class org.apache.uima.cas.impl.FeatureStructureImpl
[ERROR] <https://builds.apache.org/job/UIMA-v3-sdk/ws/uimaj-core/src/main/java/org/apache/uima/cas/impl/FeatureStructureImpl.java>:[571,36] no suitable method found for printSpaces(int,java.lang.StringBuffer)
[ERROR] method org.apache.uima.internal.util.StringUtils.printSpaces(int,java.lang.StringBuilder) is not applicable
[ERROR] (argument mismatch; java.lang.StringBuffer cannot be converted to java.lang.StringBuilder)
[ERROR] method org.apache.uima.internal.util.StringUtils.printSpaces(int,java.io.Writer) is not applicable
[ERROR] (argument mismatch; java.lang.StringBuffer cannot be converted to java.io.Writer)
[ERROR] <https://builds.apache.org/job/UIMA-v3-sdk/ws/uimaj-core/src/main/java/org/apache/uima/cas/impl/FeatureStructureImpl.java>:[581,44] no suitable method found for printSpaces(int,java.lang.StringBuffer)
[ERROR] method org.apache.uima.internal.util.StringUtils.printSpaces(int,java.lang.StringBuilder) is not applicable
[ERROR] (argument mismatch; java.lang.StringBuffer cannot be converted to java.lang.StringBuilder)
[ERROR] method org.apache.uima.internal.util.StringUtils.printSpaces(int,java.io.Writer) is not applicable
[ERROR] (argument mismatch; java.lang.StringBuffer cannot be converted to java.io.Writer)
[ERROR] <https://builds.apache.org/job/UIMA-v3-sdk/ws/uimaj-core/src/main/java/org/apache/uima/cas/impl/FeatureStructureImpl.java>:[605,36] no suitable method found for printSpaces(int,java.lang.StringBuffer)
[ERROR] method org.apache.uima.internal.util.StringUtils.printSpaces(int,java.lang.StringBuilder) is not applicable
[ERROR] (argument mismatch; java.lang.StringBuffer cannot be converted to java.lang.StringBuilder)
[ERROR] method org.apache.uima.internal.util.StringUtils.printSpaces(int,java.io.Writer) is not applicable
[ERROR] (argument mismatch; java.lang.StringBuffer cannot be converted to java.io.Writer)
[ERROR] <https://builds.apache.org/job/UIMA-v3-sdk/ws/uimaj-core/src/main/java/org/apache/uima/cas/impl/FeatureStructureImpl.java>:[668,24] cannot find symbol
[ERROR] symbol:   method copyFeatures(int,int)
[ERROR] location: variable casImpl of type org.apache.uima.cas.impl.CASImpl
[ERROR] -> [Help 1]
[ERROR] 
[ERROR] To see the full stack trace of the errors, re-run Maven with the -e switch.
[ERROR] Re-run Maven using the -X switch to enable full debug logging.
[ERROR] 
[ERROR] For more information about the errors and possible solutions, please read the following articles:
[ERROR] [Help 1] http://cwiki.apache.org/confluence/display/MAVEN/MojoFailureException
[ERROR] 
[ERROR] After correcting the problems, you can resume the build with the command
[ERROR]   mvn <goals> -rf :uimaj-core
[JENKINS] Archiving <https://builds.apache.org/job/UIMA-v3-sdk/ws/uimaj-eclipse-feature-runtime/pom.xml> to org.apache.uima/uimaj-eclipse-feature-runtime/3.0.0-SNAPSHOT/uimaj-eclipse-feature-runtime-3.0.0-SNAPSHOT.pom
No artifacts from UIMA-v3-sdk » Apache UIMA Eclipse: uimaj-eclipse-feature-runtime #18 to compare, so performing full copy of artifacts
[JENKINS] Archiving <https://builds.apache.org/job/UIMA-v3-sdk/ws/uimaj-ep-launcher/pom.xml> to org.apache.uima/uimaj-ep-launcher/3.0.0-SNAPSHOT/uimaj-ep-launcher-3.0.0-SNAPSHOT.pom
No artifacts from UIMA-v3-sdk » Apache UIMA Eclipse: uimaj-ep-launcher #18 to compare, so performing full copy of artifacts
[JENKINS] Archiving <https://builds.apache.org/job/UIMA-v3-sdk/ws/uimaj-eclipse-feature-tools/pom.xml> to org.apache.uima/uimaj-eclipse-feature-tools/3.0.0-SNAPSHOT/uimaj-eclipse-feature-tools-3.0.0-SNAPSHOT.pom
No artifacts from UIMA-v3-sdk » Apache UIMA Eclipse: uimaj-eclipse-feature-tools #18 to compare, so performing full copy of artifacts
[JENKINS] Archiving <https://builds.apache.org/job/UIMA-v3-sdk/ws/uimaj-bootstrap/pom.xml> to org.apache.uima/uimaj-bootstrap/3.0.0-SNAPSHOT/uimaj-bootstrap-3.0.0-SNAPSHOT.pom
[JENKINS] Archiving <https://builds.apache.org/job/UIMA-v3-sdk/ws/aggregate-uimaj-eclipse-plugins/pom.xml> to org.apache.uima/aggregate-uimaj-eclipse-plugins/3.0.0-SNAPSHOT/aggregate-uimaj-eclipse-plugins-3.0.0-SNAPSHOT.pom
No artifacts from UIMA-v3-sdk » Apache UIMA Aggregate: aggregate-uimaj-eclipse-plugins #18 to compare, so performing full copy of artifacts
[JENKINS] Archiving <https://builds.apache.org/job/UIMA-v3-sdk/ws/uimaj-core/pom.xml> to org.apache.uima/uimaj-core/3.0.0-SNAPSHOT/uimaj-core-3.0.0-SNAPSHOT.pom
No artifacts from UIMA-v3-sdk » Apache UIMA Base: uimaj-core #18 to compare, so performing full copy of artifacts
[JENKINS] Archiving <https://builds.apache.org/job/UIMA-v3-sdk/ws/uimaj-component-test-util/pom.xml> to org.apache.uima/uimaj-component-test-util/3.0.0-SNAPSHOT/uimaj-component-test-util-3.0.0-SNAPSHOT.pom
No artifacts from UIMA-v3-sdk » Apache UIMA Base: uimaj-component-test-util: for JUnit #18 to compare, so performing full copy of artifacts
[JENKINS] Archiving <https://builds.apache.org/job/UIMA-v3-sdk/ws/aggregate-uimaj-docbooks/pom.xml> to org.apache.uima/aggregate-uimaj-docbooks/3.0.0-SNAPSHOT/aggregate-uimaj-docbooks-3.0.0-SNAPSHOT.pom
[JENKINS] Archiving <https://builds.apache.org/job/UIMA-v3-sdk/ws/uima-docbook-tools/pom.xml> to org.apache.uima/uima-docbook-tools/3.0.0-SNAPSHOT/uima-docbook-tools-3.0.0-SNAPSHOT.pom
No artifacts from UIMA-v3-sdk » Apache UIMA SDK Documentation - tools #18 to compare, so performing full copy of artifacts
[JENKINS] Archiving <https://builds.apache.org/job/UIMA-v3-sdk/ws/uimaj-document-annotation/pom.xml> to org.apache.uima/uimaj-document-annotation/3.0.0-SNAPSHOT/uimaj-document-annotation-3.0.0-SNAPSHOT.pom
No artifacts from UIMA-v3-sdk » Apache UIMA Base: uimaj-document-annotation #18 to compare, so performing full copy of artifacts
[JENKINS] Archiving <https://builds.apache.org/job/UIMA-v3-sdk/ws/jVinci/pom.xml> to org.apache.uima/jVinci/3.0.0-SNAPSHOT/jVinci-3.0.0-SNAPSHOT.pom
No artifacts from UIMA-v3-sdk » Apache UIMA Base: jVinci: Vinci Transport Library #18 to compare, so performing full copy of artifacts
[JENKINS] Archiving <https://builds.apache.org/job/UIMA-v3-sdk/ws/uimaj-ep-configurator/pom.xml> to org.apache.uima/uimaj-ep-configurator/3.0.0-SNAPSHOT/uimaj-ep-configurator-3.0.0-SNAPSHOT.pom
No artifacts from UIMA-v3-sdk » Apache UIMA Eclipse: uimaj-ep-configurator: Descriptor Editor #18 to compare, so performing full copy of artifacts
[JENKINS] Archiving <https://builds.apache.org/job/UIMA-v3-sdk/ws/uimaj-examples/pom.xml> to org.apache.uima/uimaj-examples/3.0.0-SNAPSHOT/uimaj-examples-3.0.0-SNAPSHOT.pom
No artifacts from UIMA-v3-sdk » Apache UIMA Base: uimaj-examples: SDK Examples #18 to compare, so performing full copy of artifacts
[JENKINS] Archiving <https://builds.apache.org/job/UIMA-v3-sdk/ws/uimaj-adapter-vinci/pom.xml> to org.apache.uima/uimaj-adapter-vinci/3.0.0-SNAPSHOT/uimaj-adapter-vinci-3.0.0-SNAPSHOT.pom
No artifacts from UIMA-v3-sdk » Apache UIMA Base: uimaj-adapter-vinci: Vinci Adapter #18 to compare, so performing full copy of artifacts
[JENKINS] Archiving <https://builds.apache.org/job/UIMA-v3-sdk/ws/PearPackagingMavenPlugin/pom.xml> to org.apache.uima/PearPackagingMavenPlugin/3.0.0-SNAPSHOT/PearPackagingMavenPlugin-3.0.0-SNAPSHOT.pom
[JENKINS] Archiving <https://builds.apache.org/job/UIMA-v3-sdk/ws/uimaj-ep-cas-editor-ide/pom.xml> to org.apache.uima/uimaj-ep-cas-editor-ide/3.0.0-SNAPSHOT/uimaj-ep-cas-editor-ide-3.0.0-SNAPSHOT.pom
No artifacts from UIMA-v3-sdk » Apache UIMA Eclipse: uimaj-ep-cas-editor-ide #18 to compare, so performing full copy of artifacts
[JENKINS] Archiving <https://builds.apache.org/job/UIMA-v3-sdk/ws/uimaj-test-util/pom.xml> to org.apache.uima/uimaj-test-util/3.0.0-SNAPSHOT/uimaj-test-util-3.0.0-SNAPSHOT.pom
[JENKINS] Archiving <https://builds.apache.org/job/UIMA-v3-sdk/ws/uimaj-test-util/target/uimaj-test-util-3.0.0-SNAPSHOT.jar> to org.apache.uima/uimaj-test-util/3.0.0-SNAPSHOT/uimaj-test-util-3.0.0-SNAPSHOT.jar
[JENKINS] Archiving <https://builds.apache.org/job/UIMA-v3-sdk/ws/uimaj-ep-runtime/pom.xml> to org.apache.uima/uimaj-ep-runtime/3.0.0-SNAPSHOT/uimaj-ep-runtime-3.0.0-SNAPSHOT.pom
No artifacts from UIMA-v3-sdk » Apache UIMA Eclipse: uimaj-ep-runtime #18 to compare, so performing full copy of artifacts
[JENKINS] Archiving <https://builds.apache.org/job/UIMA-v3-sdk/ws/uimaj-ep-debug/pom.xml> to org.apache.uima/uimaj-ep-debug/3.0.0-SNAPSHOT/uimaj-ep-debug-3.0.0-SNAPSHOT.pom
No artifacts from UIMA-v3-sdk » Apache UIMA Eclipse: uimaj-ep-debug #18 to compare, so performing full copy of artifacts
[JENKINS] Archiving <https://builds.apache.org/job/UIMA-v3-sdk/ws/uimaj-ep-cas-editor/pom.xml> to org.apache.uima/uimaj-ep-cas-editor/3.0.0-SNAPSHOT/uimaj-ep-cas-editor-3.0.0-SNAPSHOT.pom
No artifacts from UIMA-v3-sdk » Apache UIMA Eclipse: uimaj-ep-cas-editor #18 to compare, so performing full copy of artifacts
[JENKINS] Archiving <https://builds.apache.org/job/UIMA-v3-sdk/ws/aggregate-uimaj/pom.xml> to org.apache.uima/aggregate-uimaj/3.0.0-SNAPSHOT/aggregate-uimaj-3.0.0-SNAPSHOT.pom
[JENKINS] Archiving <https://builds.apache.org/job/UIMA-v3-sdk/ws/uimaj-parent/pom.xml> to org.apache.uima/uimaj-parent/3.0.0-SNAPSHOT/uimaj-parent-3.0.0-SNAPSHOT.pom
[JENKINS] Archiving <https://builds.apache.org/job/UIMA-v3-sdk/ws/jcasgen-maven-plugin/pom.xml> to org.apache.uima/jcasgen-maven-plugin/3.0.0-SNAPSHOT/jcasgen-maven-plugin-3.0.0-SNAPSHOT.pom
[JENKINS] Archiving <https://builds.apache.org/job/UIMA-v3-sdk/ws/pom.xml> to org.apache.uima/uimaj/3.0.0-SNAPSHOT/uimaj-3.0.0-SNAPSHOT.pom
[JENKINS] Archiving <https://builds.apache.org/job/UIMA-v3-sdk/ws/uimaj-ep-jcasgen/pom.xml> to org.apache.uima/uimaj-ep-jcasgen/3.0.0-SNAPSHOT/uimaj-ep-jcasgen-3.0.0-SNAPSHOT.pom
No artifacts from UIMA-v3-sdk » Apache UIMA Eclipse: uimaj-ep-jcasgen #18 to compare, so performing full copy of artifacts
[JENKINS] Archiving <https://builds.apache.org/job/UIMA-v3-sdk/ws/uimaj-json/pom.xml> to org.apache.uima/uimaj-json/3.0.0-SNAPSHOT/uimaj-json-3.0.0-SNAPSHOT.pom
[JENKINS] Archiving <https://builds.apache.org/job/UIMA-v3-sdk/ws/uimaj-v3migration-jcas/pom.xml> to org.apache.uima/uimaj-v3migration-jcas/3.0.0-SNAPSHOT/uimaj-v3migration-jcas-3.0.0-SNAPSHOT.pom
No artifacts from UIMA-v3-sdk » Apache UIMA Base: uimaj-v3migration-jcas #18 to compare, so performing full copy of artifacts
[JENKINS] Archiving <https://builds.apache.org/job/UIMA-v3-sdk/ws/uimaj-tools/pom.xml> to org.apache.uima/uimaj-tools/3.0.0-SNAPSHOT/uimaj-tools-3.0.0-SNAPSHOT.pom
No artifacts from UIMA-v3-sdk » Apache UIMA Base: uimaj-tools: Tools #18 to compare, so performing full copy of artifacts
[JENKINS] Archiving <https://builds.apache.org/job/UIMA-v3-sdk/ws/uima-docbook-tutorials-and-users-guides/pom.xml> to org.apache.uima/uima-docbook-tutorials-and-users-guides/3.0.0-SNAPSHOT/uima-docbook-tutorials-and-users-guides-3.0.0-SNAPSHOT.pom
No artifacts from UIMA-v3-sdk » Apache UIMA SDK Documentation - tutorials and user's guides #18 to compare, so performing full copy of artifacts
[JENKINS] Archiving <https://builds.apache.org/job/UIMA-v3-sdk/ws/uimaj-adapter-soap/pom.xml> to org.apache.uima/uimaj-adapter-soap/3.0.0-SNAPSHOT/uimaj-adapter-soap-3.0.0-SNAPSHOT.pom
No artifacts from UIMA-v3-sdk » Apache UIMA Base: uimaj-adapter-soap: SOAP Adapter #18 to compare, so performing full copy of artifacts
[JENKINS] Archiving <https://builds.apache.org/job/UIMA-v3-sdk/ws/uima-docbook-v3-users-guide/pom.xml> to org.apache.uima/uima-docbook-v3-users-guide/3.0.0-SNAPSHOT/uima-docbook-v3-users-guide-3.0.0-SNAPSHOT.pom
[JENKINS] Archiving <https://builds.apache.org/job/UIMA-v3-sdk/ws/uimaj-ep-pear-packager/pom.xml> to org.apache.uima/uimaj-ep-pear-packager/3.0.0-SNAPSHOT/uimaj-ep-pear-packager-3.0.0-SNAPSHOT.pom
No artifacts from UIMA-v3-sdk » Apache UIMA Eclipse: uimaj-ep-pear-packager #18 to compare, so performing full copy of artifacts
[JENKINS] Archiving <https://builds.apache.org/job/UIMA-v3-sdk/ws/uima-docbook-overview-and-setup/pom.xml> to org.apache.uima/uima-docbook-overview-and-setup/3.0.0-SNAPSHOT/uima-docbook-overview-and-setup-3.0.0-SNAPSHOT.pom
No artifacts from UIMA-v3-sdk » Apache UIMA SDK Documentation - overview and setup #18 to compare, so performing full copy of artifacts
[JENKINS] Archiving <https://builds.apache.org/job/UIMA-v3-sdk/ws/uima-docbook-references/pom.xml> to org.apache.uima/uima-docbook-references/3.0.0-SNAPSHOT/uima-docbook-references-3.0.0-SNAPSHOT.pom
No artifacts from UIMA-v3-sdk » Apache UIMA SDK Documentation - references #18 to compare, so performing full copy of artifacts
[JENKINS] Archiving <https://builds.apache.org/job/UIMA-v3-sdk/ws/uimaj-cpe/pom.xml> to org.apache.uima/uimaj-cpe/3.0.0-SNAPSHOT/uimaj-cpe-3.0.0-SNAPSHOT.pom
No artifacts from UIMA-v3-sdk » Apache UIMA Base: uimaj-cpe: Collection Processing Engine #18 to compare, so performing full copy of artifacts
channel stopped
[WARNINGS] Skipping publisher since build result is FAILURE

Jenkins build is back to stable : UIMA-v3-sdk #29

Posted by Apache Jenkins Server <je...@builds.apache.org>.
See <https://builds.apache.org/job/UIMA-v3-sdk/29/changes>


Jenkins build is still unstable: UIMA-v3-sdk #28

Posted by Apache Jenkins Server <je...@builds.apache.org>.
See <https://builds.apache.org/job/UIMA-v3-sdk/changes>


Jenkins build is unstable: UIMA-v3-sdk #27

Posted by Apache Jenkins Server <je...@builds.apache.org>.
See <https://builds.apache.org/job/UIMA-v3-sdk/27/changes>


Build failed in Jenkins: UIMA-v3-sdk #26

Posted by Apache Jenkins Server <je...@builds.apache.org>.
See <https://builds.apache.org/job/UIMA-v3-sdk/26/changes>

Changes:

[schor] no Jira - reorganize imports

[schor] no Jira - slight refactor - use arraylist instead of list where feasible, because usage uses get(i) kinds of access which require random access style. Use newer APIs for creating lists.

[schor] [UIMA-5225] backwards compatibility - reinit calls.  Delete getExistingJCas - not reliable.

[schor] [UIMA-5225] add version of alreadyCopied that uses int arg, only for backwards compatibility.

[schor] no Jira - rename built-in array method for create to createFromArray

[schor] [UIMA-5225] comment change

[schor] [UIMA-2147] add static fields for type and feature names for built-ins

[schor] [UIMA-2147] add static fields for type and feature names for built-ins

------------------------------------------
[...truncated 12271 lines...]
[INFO] --- maven-dependency-plugin:2.9:unpack (copyDocbookInfoNextToOlink) @ uima-docbook-tutorials-and-users-guides ---
[INFO] Configured Artifact: org.apache.uima:uima-build-resources:5:jar
[INFO] uima-build-resources-5.jar already unpacked.
[INFO] 
[INFO] --- maven-dependency-plugin:2.9:unpack (getOlink) @ uima-docbook-tutorials-and-users-guides ---
[INFO] Configured Artifact: org.apache.uima:uima-docbook-olink:olink:1-SNAPSHOT:zip
[INFO] uima-docbook-olink-1-SNAPSHOT-olink.zip already unpacked.
[INFO] 
[INFO] --- jacoco-maven-plugin:0.7.6.201602180812:report (default-report) @ uima-docbook-tutorials-and-users-guides ---
[INFO] Skipping JaCoCo execution due to missing execution data <https://builds.apache.org/job/UIMA-v3-sdk/ws/uima-docbook-tutorials-and-users-guides/target/jacoco.exec>
[PMD] No report found for mojo report
[INFO] 
[INFO] --- maven-site-plugin:3.3:attach-descriptor (attach-descriptor) @ uima-docbook-tutorials-and-users-guides ---
[INFO] 
[INFO] --- docbkx-maven-plugin:2.0.14:generate-html (html) @ uima-docbook-tutorials-and-users-guides ---
[INFO] Processing input file: tutorials_and_users_guides.xml
[INFO] Applying customization parameters
[INFO] <https://builds.apache.org/job/UIMA-v3-sdk/ws/uima-docbook-tutorials-and-users-guides/target/site/d/tutorials_and_users_guides.html> has been generated.
[INFO] 
[INFO] --- docbkx-maven-plugin:2.0.14:generate-pdf (pdf) @ uima-docbook-tutorials-and-users-guides ---
[INFO] Processing input file: tutorials_and_users_guides.xml
[INFO] Applying customization parameters
[INFO] targetFileExtension pdf
[INFO] type fo
[WARNING] Font "Symbol,normal,700" not found. Substituting with "Symbol,normal,400".
[WARNING] Font "ZapfDingbats,normal,700" not found. Substituting with "ZapfDingbats,normal,400".
[WARNING] Line 8 of a paragraph overflows the available area by 1696 millipoints. (See position 3990:28412)
[INFO] <https://builds.apache.org/job/UIMA-v3-sdk/ws/uima-docbook-tutorials-and-users-guides/target/docbkx/pdf/tutorials_and_users_guides.pdf> has been generated.
[INFO] <https://builds.apache.org/job/UIMA-v3-sdk/ws/uima-docbook-tutorials-and-users-guides/target/docbkx/pdf/tutorials_and_users_guides.fo> has been generated.
[INFO] 
[INFO] --- maven-resources-plugin:2.6:copy-resources (docbook-copy-images) @ uima-docbook-tutorials-and-users-guides ---
[INFO] Using 'UTF-8' encoding to copy filtered resources.
[INFO] Copying 43 resources
[INFO] 
[INFO] --- maven-resources-plugin:2.6:copy-resources (docbook-copy-css) @ uima-docbook-tutorials-and-users-guides ---
[INFO] Using 'UTF-8' encoding to copy filtered resources.
[INFO] Copying 1 resource
[INFO] 
[INFO] --- maven-resources-plugin:2.6:copy-resources (docbook-move-pdf) @ uima-docbook-tutorials-and-users-guides ---
[INFO] Using 'UTF-8' encoding to copy filtered resources.
[INFO] Copying 1 resource
[INFO] 
[INFO] --- findbugs-maven-plugin:3.0.3:findbugs (default) @ uima-docbook-tutorials-and-users-guides ---
[FINDBUGS] No report found for mojo findbugs
[INFO] 
[INFO] --- maven-pmd-plugin:3.6:cpd (default) @ uima-docbook-tutorials-and-users-guides ---
[DRY] No report found for mojo cpd
[INFO] 
[INFO] --- maven-pmd-plugin:3.6:pmd (default) @ uima-docbook-tutorials-and-users-guides ---
[PMD] No report found for mojo pmd
[INFO] 
[INFO] --- jacoco-maven-plugin:0.7.6.201602180812:check (default-check) @ uima-docbook-tutorials-and-users-guides ---
[INFO] Skipping JaCoCo execution due to missing execution data <https://builds.apache.org/job/UIMA-v3-sdk/ws/uima-docbook-tutorials-and-users-guides/target/jacoco.exec>
[PMD] No report found for mojo check
[INFO] 
[INFO] --- maven-install-plugin:2.5.1:install (default-install) @ uima-docbook-tutorials-and-users-guides ---
[INFO] Installing <https://builds.apache.org/job/UIMA-v3-sdk/ws/uima-docbook-tutorials-and-users-guides/pom.xml> to /home/jenkins/jenkins-slave/maven-repositories/0/org/apache/uima/uima-docbook-tutorials-and-users-guides/3.0.0-SNAPSHOT/uima-docbook-tutorials-and-users-guides-3.0.0-SNAPSHOT.pom
[INFO] 
[INFO] >>> maven-dependency-plugin:2.9:analyze (default-cli) > test-compile @ uima-docbook-tutorials-and-users-guides >>>
[INFO] 
[INFO] --- maven-enforcer-plugin:1.3.1:enforce (enforce-versions) @ uima-docbook-tutorials-and-users-guides ---
[INFO] 
[INFO] --- build-helper-maven-plugin:1.8:parse-version (parse-project-version) @ uima-docbook-tutorials-and-users-guides ---
[INFO] 
[INFO] --- uima-build-helper-maven-plugin:7:parse-date-time (set buildYear and buildMonth) @ uima-docbook-tutorials-and-users-guides ---
[INFO] 
[INFO] --- jacoco-maven-plugin:0.7.6.201602180812:prepare-agent (default-prepare-agent) @ uima-docbook-tutorials-and-users-guides ---
[INFO] jacoco.argLine set to -javaagent:/home/jenkins/jenkins-slave/maven-repositories/0/org/jacoco/org.jacoco.agent/0.7.6.201602180812/org.jacoco.agent-0.7.6.201602180812-runtime.jar=destfile=<https://builds.apache.org/job/UIMA-v3-sdk/ws/uima-docbook-tutorials-and-users-guides/target/jacoco.exec,excludes=**/org/apache/uima/examples/SourceDocumentInformation*>:**/org/apache/uima/examples/SourceDocumentInformation_Type*
[INFO] 
[INFO] --- maven-remote-resources-plugin:1.5:process (default) @ uima-docbook-tutorials-and-users-guides ---
[WARNING] Failed to getClass for org.apache.maven.plugin.dependency.analyze.AnalyzeMojo
[INFO] 
[INFO] <<< maven-dependency-plugin:2.9:analyze (default-cli) < test-compile @ uima-docbook-tutorials-and-users-guides <<<
[INFO] 
[INFO] --- maven-dependency-plugin:2.9:analyze (default-cli) @ uima-docbook-tutorials-and-users-guides ---
[INFO] Skipping pom project
[INFO]                                                                         
[INFO] ------------------------------------------------------------------------
[INFO] Building Apache UIMA SDK Documentation - tutorials and user's guides 3.0.0-SNAPSHOT
[INFO] ------------------------------------------------------------------------
[INFO] 
[INFO] --- maven-clean-plugin:2.5:clean (default-clean) @ uima-docbook-v3-users-guide ---
[TASKS] Scanning folder '<https://builds.apache.org/job/UIMA-v3-sdk/ws/uima-docbook-v3-users-guide'> for files matching the pattern '**/*.java' - excludes: 
[TASKS] Found 0 files to scan for tasks
Found 0 open tasks.
[TASKS] Computing warning deltas based on reference build #17
[INFO] 
[INFO] --- maven-enforcer-plugin:1.3.1:enforce (enforce-versions) @ uima-docbook-v3-users-guide ---
[INFO] 
[INFO] --- build-helper-maven-plugin:1.8:parse-version (parse-project-version) @ uima-docbook-v3-users-guide ---
[INFO] 
[INFO] --- uima-build-helper-maven-plugin:7:parse-date-time (set buildYear and buildMonth) @ uima-docbook-v3-users-guide ---
[INFO] 
[INFO] --- jacoco-maven-plugin:0.7.6.201602180812:prepare-agent (default-prepare-agent) @ uima-docbook-v3-users-guide ---
[INFO] jacoco.argLine set to -javaagent:/home/jenkins/jenkins-slave/maven-repositories/0/org/jacoco/org.jacoco.agent/0.7.6.201602180812/org.jacoco.agent-0.7.6.201602180812-runtime.jar=destfile=<https://builds.apache.org/job/UIMA-v3-sdk/ws/uima-docbook-v3-users-guide/target/jacoco.exec,excludes=**/org/apache/uima/examples/SourceDocumentInformation*>:**/org/apache/uima/examples/SourceDocumentInformation_Type*
[INFO] 
[INFO] --- maven-remote-resources-plugin:1.5:process (default) @ uima-docbook-v3-users-guide ---
[INFO] 
[INFO] --- maven-antrun-plugin:1.7:run (dup-meta-jar-cleanup) @ uima-docbook-v3-users-guide ---
[INFO] Executing tasks

main:
[INFO] Executed tasks
[INFO] 
[INFO] --- maven-dependency-plugin:2.9:unpack (copyDocbookInfo) @ uima-docbook-v3-users-guide ---
[INFO] Configured Artifact: org.apache.uima:uima-build-resources:5:jar
[INFO] Unpacking /home/jenkins/jenkins-slave/maven-repositories/0/org/apache/uima/uima-build-resources/5/uima-build-resources-5.jar to <https://builds.apache.org/job/UIMA-v3-sdk/ws/uima-docbook-v3-users-guide/target> with includes "docbook-shared/**" and excludes ""
[INFO] 
[INFO] --- maven-dependency-plugin:2.9:unpack (copyDocbookInfoNextToOlink) @ uima-docbook-v3-users-guide ---
[INFO] Configured Artifact: org.apache.uima:uima-build-resources:5:jar
[INFO] uima-build-resources-5.jar already unpacked.
[INFO] 
[INFO] --- maven-dependency-plugin:2.9:unpack (getOlink) @ uima-docbook-v3-users-guide ---
[INFO] Configured Artifact: org.apache.uima:uima-docbook-olink:olink:1-SNAPSHOT:zip
[INFO] uima-docbook-olink-1-SNAPSHOT-olink.zip already unpacked.
[INFO] 
[INFO] --- jacoco-maven-plugin:0.7.6.201602180812:report (default-report) @ uima-docbook-v3-users-guide ---
[INFO] Skipping JaCoCo execution due to missing execution data <https://builds.apache.org/job/UIMA-v3-sdk/ws/uima-docbook-v3-users-guide/target/jacoco.exec>
[PMD] No report found for mojo report
[INFO] 
[INFO] --- maven-site-plugin:3.3:attach-descriptor (attach-descriptor) @ uima-docbook-v3-users-guide ---
[INFO] 
[INFO] --- docbkx-maven-plugin:2.0.14:generate-html (html) @ uima-docbook-v3-users-guide ---
[INFO] Processing input file: version_3_users_guide.xml
[INFO] Applying customization parameters
Recoverable error
org.xml.sax.SAXParseException; systemId: file://<https://builds.apache.org/job/UIMA-v3-sdk/ws/uima-docbook-v3-users-guide/src/docbook/version_3_users_guide.xml;> lineNumber: 30; columnNumber: 95; Include operation failed, reverting to fallback. Resource error reading file as XML (href='uv3.new_or_extended_apis.xml'). Reason: <https://builds.apache.org/job/UIMA-v3-sdk/ws/uima-docbook-v3-users-guide/src/docbook/uv3.new_or_extended_apis.xml> (No such file or directory)
Error on line 30 column 95 of file://<https://builds.apache.org/job/UIMA-v3-sdk/ws/uima-docbook-v3-users-guide/src/docbook/version_3_users_guide.xml>:
  Error reported by XML parser: An 'include' failed, and no 'fallback' element was found.
[INFO]                                                                         
[INFO] ------------------------------------------------------------------------
[INFO] Skipping Apache UIMA Java SDK: uimaj
[INFO] This project has been banned from the build due to previous failures.
[INFO] ------------------------------------------------------------------------
[INFO] ------------------------------------------------------------------------
[INFO] Reactor Summary:
[INFO] 
[INFO] Apache UIMA Java SDK: uimaj-parent ................. SUCCESS [ 17.316 s]
[INFO] Apache UIMA Base: uimaj-test-util: JUnit utilities . SUCCESS [ 31.669 s]
[INFO] Apache UIMA Base: uimaj-core ....................... SUCCESS [02:26 min]
[INFO] Apache UIMA Base: jVinci: Vinci Transport Library .. SUCCESS [ 24.868 s]
[INFO] Apache UIMA Base: uimaj-adapter-vinci: Vinci Adapter SUCCESS [ 19.138 s]
[INFO] Apache UIMA Base: uimaj-cpe: Collection Processing Engine SUCCESS [ 50.584 s]
[INFO] Apache UIMA Base: uimaj-document-annotation ........ SUCCESS [ 14.267 s]
[INFO] Apache UIMA Base: uimaj-tools: Tools ............... SUCCESS [ 38.393 s]
[INFO] Apache UIMA Base: uimaj-v3migration-jcas ........... SUCCESS [ 16.461 s]
[INFO] Apache UIMA Base: uimaj-examples: SDK Examples ..... SUCCESS [ 20.579 s]
[INFO] Apache UIMA Base: uimaj-adapter-soap: SOAP Adapter . SUCCESS [ 15.753 s]
[INFO] Apache UIMA Base: uimaj-component-test-util: for JUnit SUCCESS [ 14.535 s]
[INFO] Apache UIMA Eclipse: uimaj-ep-debug ................ SUCCESS [ 42.622 s]
[INFO] Apache UIMA Eclipse: uimaj-ep-jcasgen .............. SUCCESS [ 16.729 s]
[INFO] Apache UIMA Eclipse: uimaj-ep-configurator: Descriptor Editor SUCCESS [ 55.267 s]
[INFO] Apache UIMA Eclipse: uimaj-ep-pear-packager ........ SUCCESS [ 24.660 s]
[INFO] Apache UIMA Eclipse: uimaj-ep-launcher ............. SUCCESS [ 30.869 s]
[INFO] Apache UIMA Eclipse: uimaj-ep-cas-editor ........... SUCCESS [ 38.309 s]
[INFO] Apache UIMA Eclipse: uimaj-ep-cas-editor-ide ....... SUCCESS [ 20.392 s]
[INFO] Apache UIMA Eclipse: uimaj-ep-runtime .............. SUCCESS [ 10.903 s]
[INFO] Apache UIMA Eclipse: uimaj-eclipse-feature-tools ... SUCCESS [  8.542 s]
[INFO] Apache UIMA Eclipse: uimaj-eclipse-feature-runtime . SUCCESS [  8.664 s]
[INFO] Apache UIMA Aggregate: aggregate-uimaj-eclipse-plugins SUCCESS [  5.552 s]
[INFO] Apache UIMA SDK Documentation - overview and setup . SUCCESS [ 18.847 s]
[INFO] Apache UIMA SDK Documentation - references ......... SUCCESS [ 14.795 s]
[INFO] Apache UIMA SDK Documentation - tools .............. SUCCESS [ 12.788 s]
[INFO] Apache UIMA SDK Documentation - tutorials and user's guides SUCCESS [ 15.118 s]
[INFO] Apache UIMA SDK Documentation - tutorials and user's guides FAILURE [  4.263 s]
[INFO] Apache UIMA Aggregate: aggregate-uimaj-docbooks .... SKIPPED
[INFO] Apache UIMA Maven: PearPackagingMavenPlugin ........ SKIPPED
[INFO] Apache UIMA Maven: jcasgen-maven-plugin ............ SKIPPED
[INFO] Apache UIMA Base: uimaj-bootstrap .................. SKIPPED
[INFO] Apache UIMA Aggregate: aggregate-uimaj ............. SKIPPED
[INFO] Apache UIMA Base: uimaj-json: JSON ................. SKIPPED
[INFO] Apache UIMA Java SDK: uimaj ........................ SKIPPED
[INFO] ------------------------------------------------------------------------
[INFO] BUILD FAILURE
[INFO] ------------------------------------------------------------------------
[INFO] Total time: 13:36 min
[INFO] Finished at: 2016-12-21T15:44:10+00:00
[INFO] Final Memory: 191M/995M
[INFO] ------------------------------------------------------------------------
Waiting for Jenkins to finish collecting data
[ERROR] Failed to execute goal com.agilejava.docbkx:docbkx-maven-plugin:2.0.14:generate-html (html) on project uima-docbook-v3-users-guide: Failed to transform version_3_users_guide.xml. org.xml.sax.SAXParseException; systemId: file://<https://builds.apache.org/job/UIMA-v3-sdk/ws/uima-docbook-v3-users-guide/src/docbook/version_3_users_guide.xml;> lineNumber: 30; columnNumber: 95; An 'include' failed, and no 'fallback' element was found. -> [Help 1]
[ERROR] 
[ERROR] To see the full stack trace of the errors, re-run Maven with the -e switch.
[ERROR] Re-run Maven using the -X switch to enable full debug logging.
[ERROR] 
[ERROR] For more information about the errors and possible solutions, please read the following articles:
[ERROR] [Help 1] http://cwiki.apache.org/confluence/display/MAVEN/MojoExecutionException
[ERROR] 
[ERROR] After correcting the problems, you can resume the build with the command
[ERROR]   mvn <goals> -rf :uima-docbook-v3-users-guide
[JENKINS] Archiving <https://builds.apache.org/job/UIMA-v3-sdk/ws/uimaj-eclipse-feature-runtime/pom.xml> to org.apache.uima/uimaj-eclipse-feature-runtime/3.0.0-SNAPSHOT/uimaj-eclipse-feature-runtime-3.0.0-SNAPSHOT.pom
[JENKINS] Archiving <https://builds.apache.org/job/UIMA-v3-sdk/ws/uimaj-eclipse-feature-runtime/target/uimaj-eclipse-feature-runtime_3.0.0.SNAPSHOT.jar> to org.apache.uima/uimaj-eclipse-feature-runtime/3.0.0-SNAPSHOT/uimaj-eclipse-feature-runtime-3.0.0-SNAPSHOT.jar
[JENKINS] Archiving <https://builds.apache.org/job/UIMA-v3-sdk/ws/uimaj-ep-launcher/pom.xml> to org.apache.uima/uimaj-ep-launcher/3.0.0-SNAPSHOT/uimaj-ep-launcher-3.0.0-SNAPSHOT.pom
[JENKINS] Archiving <https://builds.apache.org/job/UIMA-v3-sdk/ws/uimaj-ep-launcher/target/org.apache.uima.launcher_3.0.0.SNAPSHOT.jar> to org.apache.uima/uimaj-ep-launcher/3.0.0-SNAPSHOT/uimaj-ep-launcher-3.0.0-SNAPSHOT.jar
[JENKINS] Archiving <https://builds.apache.org/job/UIMA-v3-sdk/ws/uimaj-eclipse-feature-tools/pom.xml> to org.apache.uima/uimaj-eclipse-feature-tools/3.0.0-SNAPSHOT/uimaj-eclipse-feature-tools-3.0.0-SNAPSHOT.pom
[JENKINS] Archiving <https://builds.apache.org/job/UIMA-v3-sdk/ws/uimaj-eclipse-feature-tools/target/uimaj-eclipse-feature-tools_3.0.0.SNAPSHOT.jar> to org.apache.uima/uimaj-eclipse-feature-tools/3.0.0-SNAPSHOT/uimaj-eclipse-feature-tools-3.0.0-SNAPSHOT.jar
[JENKINS] Archiving <https://builds.apache.org/job/UIMA-v3-sdk/ws/uimaj-bootstrap/pom.xml> to org.apache.uima/uimaj-bootstrap/3.0.0-SNAPSHOT/uimaj-bootstrap-3.0.0-SNAPSHOT.pom
[JENKINS] Archiving <https://builds.apache.org/job/UIMA-v3-sdk/ws/aggregate-uimaj-eclipse-plugins/pom.xml> to org.apache.uima/aggregate-uimaj-eclipse-plugins/3.0.0-SNAPSHOT/aggregate-uimaj-eclipse-plugins-3.0.0-SNAPSHOT.pom
[JENKINS] Archiving <https://builds.apache.org/job/UIMA-v3-sdk/ws/uimaj-core/pom.xml> to org.apache.uima/uimaj-core/3.0.0-SNAPSHOT/uimaj-core-3.0.0-SNAPSHOT.pom
[JENKINS] Archiving <https://builds.apache.org/job/UIMA-v3-sdk/ws/uimaj-core/target/uima-core.jar> to org.apache.uima/uimaj-core/3.0.0-SNAPSHOT/uimaj-core-3.0.0-SNAPSHOT.jar
[JENKINS] Archiving <https://builds.apache.org/job/UIMA-v3-sdk/ws/uimaj-component-test-util/pom.xml> to org.apache.uima/uimaj-component-test-util/3.0.0-SNAPSHOT/uimaj-component-test-util-3.0.0-SNAPSHOT.pom
[JENKINS] Archiving <https://builds.apache.org/job/UIMA-v3-sdk/ws/uimaj-component-test-util/target/uimaj-component-test-util-3.0.0-SNAPSHOT.jar> to org.apache.uima/uimaj-component-test-util/3.0.0-SNAPSHOT/uimaj-component-test-util-3.0.0-SNAPSHOT.jar
[JENKINS] Archiving <https://builds.apache.org/job/UIMA-v3-sdk/ws/aggregate-uimaj-docbooks/pom.xml> to org.apache.uima/aggregate-uimaj-docbooks/3.0.0-SNAPSHOT/aggregate-uimaj-docbooks-3.0.0-SNAPSHOT.pom
[JENKINS] Archiving <https://builds.apache.org/job/UIMA-v3-sdk/ws/uima-docbook-tools/pom.xml> to org.apache.uima/uima-docbook-tools/3.0.0-SNAPSHOT/uima-docbook-tools-3.0.0-SNAPSHOT.pom
[JENKINS] Archiving <https://builds.apache.org/job/UIMA-v3-sdk/ws/uimaj-document-annotation/pom.xml> to org.apache.uima/uimaj-document-annotation/3.0.0-SNAPSHOT/uimaj-document-annotation-3.0.0-SNAPSHOT.pom
[JENKINS] Archiving <https://builds.apache.org/job/UIMA-v3-sdk/ws/uimaj-document-annotation/target/uima-document-annotation.jar> to org.apache.uima/uimaj-document-annotation/3.0.0-SNAPSHOT/uimaj-document-annotation-3.0.0-SNAPSHOT.jar
[JENKINS] Archiving <https://builds.apache.org/job/UIMA-v3-sdk/ws/jVinci/pom.xml> to org.apache.uima/jVinci/3.0.0-SNAPSHOT/jVinci-3.0.0-SNAPSHOT.pom
[JENKINS] Archiving <https://builds.apache.org/job/UIMA-v3-sdk/ws/jVinci/target/jVinci.jar> to org.apache.uima/jVinci/3.0.0-SNAPSHOT/jVinci-3.0.0-SNAPSHOT.jar
[JENKINS] Archiving <https://builds.apache.org/job/UIMA-v3-sdk/ws/uimaj-ep-configurator/pom.xml> to org.apache.uima/uimaj-ep-configurator/3.0.0-SNAPSHOT/uimaj-ep-configurator-3.0.0-SNAPSHOT.pom
[JENKINS] Archiving <https://builds.apache.org/job/UIMA-v3-sdk/ws/uimaj-ep-configurator/target/org.apache.uima.desceditor_3.0.0.SNAPSHOT.jar> to org.apache.uima/uimaj-ep-configurator/3.0.0-SNAPSHOT/uimaj-ep-configurator-3.0.0-SNAPSHOT.jar
[JENKINS] Archiving <https://builds.apache.org/job/UIMA-v3-sdk/ws/uimaj-examples/pom.xml> to org.apache.uima/uimaj-examples/3.0.0-SNAPSHOT/uimaj-examples-3.0.0-SNAPSHOT.pom
[JENKINS] Archiving <https://builds.apache.org/job/UIMA-v3-sdk/ws/uimaj-examples/target/uima-examples.jar> to org.apache.uima/uimaj-examples/3.0.0-SNAPSHOT/uimaj-examples-3.0.0-SNAPSHOT.jar
[JENKINS] Archiving <https://builds.apache.org/job/UIMA-v3-sdk/ws/uimaj-adapter-vinci/pom.xml> to org.apache.uima/uimaj-adapter-vinci/3.0.0-SNAPSHOT/uimaj-adapter-vinci-3.0.0-SNAPSHOT.pom
[JENKINS] Archiving <https://builds.apache.org/job/UIMA-v3-sdk/ws/uimaj-adapter-vinci/target/uima-adapter-vinci.jar> to org.apache.uima/uimaj-adapter-vinci/3.0.0-SNAPSHOT/uimaj-adapter-vinci-3.0.0-SNAPSHOT.jar
[JENKINS] Archiving <https://builds.apache.org/job/UIMA-v3-sdk/ws/PearPackagingMavenPlugin/pom.xml> to org.apache.uima/PearPackagingMavenPlugin/3.0.0-SNAPSHOT/PearPackagingMavenPlugin-3.0.0-SNAPSHOT.pom
[JENKINS] Archiving <https://builds.apache.org/job/UIMA-v3-sdk/ws/uimaj-ep-cas-editor-ide/pom.xml> to org.apache.uima/uimaj-ep-cas-editor-ide/3.0.0-SNAPSHOT/uimaj-ep-cas-editor-ide-3.0.0-SNAPSHOT.pom
[JENKINS] Archiving <https://builds.apache.org/job/UIMA-v3-sdk/ws/uimaj-ep-cas-editor-ide/target/org.apache.uima.caseditor.ide_3.0.0.SNAPSHOT.jar> to org.apache.uima/uimaj-ep-cas-editor-ide/3.0.0-SNAPSHOT/uimaj-ep-cas-editor-ide-3.0.0-SNAPSHOT.jar
[JENKINS] Archiving <https://builds.apache.org/job/UIMA-v3-sdk/ws/uimaj-test-util/pom.xml> to org.apache.uima/uimaj-test-util/3.0.0-SNAPSHOT/uimaj-test-util-3.0.0-SNAPSHOT.pom
[JENKINS] Archiving <https://builds.apache.org/job/UIMA-v3-sdk/ws/uimaj-test-util/target/uimaj-test-util-3.0.0-SNAPSHOT.jar> to org.apache.uima/uimaj-test-util/3.0.0-SNAPSHOT/uimaj-test-util-3.0.0-SNAPSHOT.jar
[JENKINS] Archiving <https://builds.apache.org/job/UIMA-v3-sdk/ws/uimaj-ep-runtime/pom.xml> to org.apache.uima/uimaj-ep-runtime/3.0.0-SNAPSHOT/uimaj-ep-runtime-3.0.0-SNAPSHOT.pom
[JENKINS] Archiving <https://builds.apache.org/job/UIMA-v3-sdk/ws/uimaj-ep-runtime/target/org.apache.uima.runtime_3.0.0.SNAPSHOT.jar> to org.apache.uima/uimaj-ep-runtime/3.0.0-SNAPSHOT/uimaj-ep-runtime-3.0.0-SNAPSHOT.jar
Compressed 4.02 MB of artifacts by 35.0% relative to #25
[JENKINS] Archiving <https://builds.apache.org/job/UIMA-v3-sdk/ws/uimaj-ep-debug/pom.xml> to org.apache.uima/uimaj-ep-debug/3.0.0-SNAPSHOT/uimaj-ep-debug-3.0.0-SNAPSHOT.pom
[JENKINS] Archiving <https://builds.apache.org/job/UIMA-v3-sdk/ws/uimaj-ep-debug/target/org.apache.uima.debug_3.0.0.SNAPSHOT.jar> to org.apache.uima/uimaj-ep-debug/3.0.0-SNAPSHOT/uimaj-ep-debug-3.0.0-SNAPSHOT.jar
[JENKINS] Archiving <https://builds.apache.org/job/UIMA-v3-sdk/ws/uimaj-ep-cas-editor/pom.xml> to org.apache.uima/uimaj-ep-cas-editor/3.0.0-SNAPSHOT/uimaj-ep-cas-editor-3.0.0-SNAPSHOT.pom
[JENKINS] Archiving <https://builds.apache.org/job/UIMA-v3-sdk/ws/uimaj-ep-cas-editor/target/org.apache.uima.caseditor_3.0.0.SNAPSHOT.jar> to org.apache.uima/uimaj-ep-cas-editor/3.0.0-SNAPSHOT/uimaj-ep-cas-editor-3.0.0-SNAPSHOT.jar
[JENKINS] Archiving <https://builds.apache.org/job/UIMA-v3-sdk/ws/aggregate-uimaj/pom.xml> to org.apache.uima/aggregate-uimaj/3.0.0-SNAPSHOT/aggregate-uimaj-3.0.0-SNAPSHOT.pom
[JENKINS] Archiving <https://builds.apache.org/job/UIMA-v3-sdk/ws/uimaj-parent/pom.xml> to org.apache.uima/uimaj-parent/3.0.0-SNAPSHOT/uimaj-parent-3.0.0-SNAPSHOT.pom
[JENKINS] Archiving <https://builds.apache.org/job/UIMA-v3-sdk/ws/jcasgen-maven-plugin/pom.xml> to org.apache.uima/jcasgen-maven-plugin/3.0.0-SNAPSHOT/jcasgen-maven-plugin-3.0.0-SNAPSHOT.pom
[JENKINS] Archiving <https://builds.apache.org/job/UIMA-v3-sdk/ws/pom.xml> to org.apache.uima/uimaj/3.0.0-SNAPSHOT/uimaj-3.0.0-SNAPSHOT.pom
[JENKINS] Archiving <https://builds.apache.org/job/UIMA-v3-sdk/ws/uimaj-ep-jcasgen/pom.xml> to org.apache.uima/uimaj-ep-jcasgen/3.0.0-SNAPSHOT/uimaj-ep-jcasgen-3.0.0-SNAPSHOT.pom
[JENKINS] Archiving <https://builds.apache.org/job/UIMA-v3-sdk/ws/uimaj-ep-jcasgen/target/org.apache.uima.jcas.jcasgenp_3.0.0.SNAPSHOT.jar> to org.apache.uima/uimaj-ep-jcasgen/3.0.0-SNAPSHOT/uimaj-ep-jcasgen-3.0.0-SNAPSHOT.jar
[JENKINS] Archiving <https://builds.apache.org/job/UIMA-v3-sdk/ws/uimaj-json/pom.xml> to org.apache.uima/uimaj-json/3.0.0-SNAPSHOT/uimaj-json-3.0.0-SNAPSHOT.pom
[JENKINS] Archiving <https://builds.apache.org/job/UIMA-v3-sdk/ws/uimaj-v3migration-jcas/pom.xml> to org.apache.uima/uimaj-v3migration-jcas/3.0.0-SNAPSHOT/uimaj-v3migration-jcas-3.0.0-SNAPSHOT.pom
[JENKINS] Archiving <https://builds.apache.org/job/UIMA-v3-sdk/ws/uimaj-v3migration-jcas/target/uimaj-v3migration-jcas.jar> to org.apache.uima/uimaj-v3migration-jcas/3.0.0-SNAPSHOT/uimaj-v3migration-jcas-3.0.0-SNAPSHOT.jar
[JENKINS] Archiving <https://builds.apache.org/job/UIMA-v3-sdk/ws/uimaj-tools/pom.xml> to org.apache.uima/uimaj-tools/3.0.0-SNAPSHOT/uimaj-tools-3.0.0-SNAPSHOT.pom
[JENKINS] Archiving <https://builds.apache.org/job/UIMA-v3-sdk/ws/uimaj-tools/target/uima-tools.jar> to org.apache.uima/uimaj-tools/3.0.0-SNAPSHOT/uimaj-tools-3.0.0-SNAPSHOT.jar
[JENKINS] Archiving <https://builds.apache.org/job/UIMA-v3-sdk/ws/uima-docbook-tutorials-and-users-guides/pom.xml> to org.apache.uima/uima-docbook-tutorials-and-users-guides/3.0.0-SNAPSHOT/uima-docbook-tutorials-and-users-guides-3.0.0-SNAPSHOT.pom
[JENKINS] Archiving <https://builds.apache.org/job/UIMA-v3-sdk/ws/uimaj-adapter-soap/pom.xml> to org.apache.uima/uimaj-adapter-soap/3.0.0-SNAPSHOT/uimaj-adapter-soap-3.0.0-SNAPSHOT.pom
[JENKINS] Archiving <https://builds.apache.org/job/UIMA-v3-sdk/ws/uimaj-adapter-soap/target/uima-adapter-soap.jar> to org.apache.uima/uimaj-adapter-soap/3.0.0-SNAPSHOT/uimaj-adapter-soap-3.0.0-SNAPSHOT.jar
[JENKINS] Archiving <https://builds.apache.org/job/UIMA-v3-sdk/ws/uima-docbook-v3-users-guide/pom.xml> to org.apache.uima/uima-docbook-v3-users-guide/3.0.0-SNAPSHOT/uima-docbook-v3-users-guide-3.0.0-SNAPSHOT.pom
[JENKINS] Archiving <https://builds.apache.org/job/UIMA-v3-sdk/ws/uimaj-ep-pear-packager/pom.xml> to org.apache.uima/uimaj-ep-pear-packager/3.0.0-SNAPSHOT/uimaj-ep-pear-packager-3.0.0-SNAPSHOT.pom
[JENKINS] Archiving <https://builds.apache.org/job/UIMA-v3-sdk/ws/uimaj-ep-pear-packager/target/org.apache.uima.pear_3.0.0.SNAPSHOT.jar> to org.apache.uima/uimaj-ep-pear-packager/3.0.0-SNAPSHOT/uimaj-ep-pear-packager-3.0.0-SNAPSHOT.jar
[JENKINS] Archiving <https://builds.apache.org/job/UIMA-v3-sdk/ws/uima-docbook-overview-and-setup/pom.xml> to org.apache.uima/uima-docbook-overview-and-setup/3.0.0-SNAPSHOT/uima-docbook-overview-and-setup-3.0.0-SNAPSHOT.pom
[JENKINS] Archiving <https://builds.apache.org/job/UIMA-v3-sdk/ws/uima-docbook-references/pom.xml> to org.apache.uima/uima-docbook-references/3.0.0-SNAPSHOT/uima-docbook-references-3.0.0-SNAPSHOT.pom
[JENKINS] Archiving <https://builds.apache.org/job/UIMA-v3-sdk/ws/uimaj-cpe/pom.xml> to org.apache.uima/uimaj-cpe/3.0.0-SNAPSHOT/uimaj-cpe-3.0.0-SNAPSHOT.pom
[JENKINS] Archiving <https://builds.apache.org/job/UIMA-v3-sdk/ws/uimaj-cpe/target/uima-cpe.jar> to org.apache.uima/uimaj-cpe/3.0.0-SNAPSHOT/uimaj-cpe-3.0.0-SNAPSHOT.jar
channel stopped
[WARNINGS] Skipping publisher since build result is FAILURE

Build failed in Jenkins: UIMA-v3-sdk #25

Posted by Apache Jenkins Server <je...@builds.apache.org>.
See <https://builds.apache.org/job/UIMA-v3-sdk/25/changes>

Changes:

[schor] [UIMA-5225] fix up FeatureStructureImplC to support FeatureStructureImpl (added for backwards compatibility).

------------------------------------------
[...truncated 12688 lines...]
[INFO] --- maven-dependency-plugin:2.9:unpack (copyDocbookInfoNextToOlink) @ uima-docbook-tutorials-and-users-guides ---
[INFO] Configured Artifact: org.apache.uima:uima-build-resources:5:jar
[INFO] uima-build-resources-5.jar already unpacked.
[INFO] 
[INFO] --- maven-dependency-plugin:2.9:unpack (getOlink) @ uima-docbook-tutorials-and-users-guides ---
[INFO] Configured Artifact: org.apache.uima:uima-docbook-olink:olink:1-SNAPSHOT:zip
[INFO] uima-docbook-olink-1-SNAPSHOT-olink.zip already unpacked.
[INFO] 
[INFO] --- jacoco-maven-plugin:0.7.6.201602180812:report (default-report) @ uima-docbook-tutorials-and-users-guides ---
[INFO] Skipping JaCoCo execution due to missing execution data <https://builds.apache.org/job/UIMA-v3-sdk/ws/uima-docbook-tutorials-and-users-guides/target/jacoco.exec>
[PMD] No report found for mojo report
[INFO] 
[INFO] --- maven-site-plugin:3.3:attach-descriptor (attach-descriptor) @ uima-docbook-tutorials-and-users-guides ---
[INFO] 
[INFO] --- docbkx-maven-plugin:2.0.14:generate-html (html) @ uima-docbook-tutorials-and-users-guides ---
[INFO] Processing input file: tutorials_and_users_guides.xml
[INFO] Applying customization parameters
[INFO] <https://builds.apache.org/job/UIMA-v3-sdk/ws/uima-docbook-tutorials-and-users-guides/target/site/d/tutorials_and_users_guides.html> has been generated.
[INFO] 
[INFO] --- docbkx-maven-plugin:2.0.14:generate-pdf (pdf) @ uima-docbook-tutorials-and-users-guides ---
[INFO] Processing input file: tutorials_and_users_guides.xml
[INFO] Applying customization parameters
[INFO] targetFileExtension pdf
[INFO] type fo
[WARNING] Font "Symbol,normal,700" not found. Substituting with "Symbol,normal,400".
[WARNING] Font "ZapfDingbats,normal,700" not found. Substituting with "ZapfDingbats,normal,400".
[WARNING] Line 8 of a paragraph overflows the available area by 1696 millipoints. (See position 3990:28412)
[INFO] <https://builds.apache.org/job/UIMA-v3-sdk/ws/uima-docbook-tutorials-and-users-guides/target/docbkx/pdf/tutorials_and_users_guides.pdf> has been generated.
[INFO] <https://builds.apache.org/job/UIMA-v3-sdk/ws/uima-docbook-tutorials-and-users-guides/target/docbkx/pdf/tutorials_and_users_guides.fo> has been generated.
[INFO] 
[INFO] --- maven-resources-plugin:2.6:copy-resources (docbook-copy-images) @ uima-docbook-tutorials-and-users-guides ---
[INFO] Using 'UTF-8' encoding to copy filtered resources.
[INFO] Copying 43 resources
[INFO] 
[INFO] --- maven-resources-plugin:2.6:copy-resources (docbook-copy-css) @ uima-docbook-tutorials-and-users-guides ---
[INFO] Using 'UTF-8' encoding to copy filtered resources.
[INFO] Copying 1 resource
[INFO] 
[INFO] --- maven-resources-plugin:2.6:copy-resources (docbook-move-pdf) @ uima-docbook-tutorials-and-users-guides ---
[INFO] Using 'UTF-8' encoding to copy filtered resources.
[INFO] Copying 1 resource
[INFO] 
[INFO] --- findbugs-maven-plugin:3.0.3:findbugs (default) @ uima-docbook-tutorials-and-users-guides ---
[FINDBUGS] No report found for mojo findbugs
[INFO] 
[INFO] --- maven-pmd-plugin:3.6:cpd (default) @ uima-docbook-tutorials-and-users-guides ---
[DRY] No report found for mojo cpd
[INFO] 
[INFO] --- maven-pmd-plugin:3.6:pmd (default) @ uima-docbook-tutorials-and-users-guides ---
[PMD] No report found for mojo pmd
[INFO] 
[INFO] --- jacoco-maven-plugin:0.7.6.201602180812:check (default-check) @ uima-docbook-tutorials-and-users-guides ---
[INFO] Skipping JaCoCo execution due to missing execution data <https://builds.apache.org/job/UIMA-v3-sdk/ws/uima-docbook-tutorials-and-users-guides/target/jacoco.exec>
[PMD] No report found for mojo check
[INFO] 
[INFO] --- maven-install-plugin:2.5.1:install (default-install) @ uima-docbook-tutorials-and-users-guides ---
[INFO] Installing <https://builds.apache.org/job/UIMA-v3-sdk/ws/uima-docbook-tutorials-and-users-guides/pom.xml> to /home/jenkins/jenkins-slave/maven-repositories/0/org/apache/uima/uima-docbook-tutorials-and-users-guides/3.0.0-SNAPSHOT/uima-docbook-tutorials-and-users-guides-3.0.0-SNAPSHOT.pom
[INFO] 
[INFO] >>> maven-dependency-plugin:2.9:analyze (default-cli) > test-compile @ uima-docbook-tutorials-and-users-guides >>>
[INFO] 
[INFO] --- maven-enforcer-plugin:1.3.1:enforce (enforce-versions) @ uima-docbook-tutorials-and-users-guides ---
[INFO] 
[INFO] --- build-helper-maven-plugin:1.8:parse-version (parse-project-version) @ uima-docbook-tutorials-and-users-guides ---
[INFO] 
[INFO] --- uima-build-helper-maven-plugin:7:parse-date-time (set buildYear and buildMonth) @ uima-docbook-tutorials-and-users-guides ---
[INFO] 
[INFO] --- jacoco-maven-plugin:0.7.6.201602180812:prepare-agent (default-prepare-agent) @ uima-docbook-tutorials-and-users-guides ---
[INFO] jacoco.argLine set to -javaagent:/home/jenkins/jenkins-slave/maven-repositories/0/org/jacoco/org.jacoco.agent/0.7.6.201602180812/org.jacoco.agent-0.7.6.201602180812-runtime.jar=destfile=<https://builds.apache.org/job/UIMA-v3-sdk/ws/uima-docbook-tutorials-and-users-guides/target/jacoco.exec,excludes=**/org/apache/uima/examples/SourceDocumentInformation*>:**/org/apache/uima/examples/SourceDocumentInformation_Type*
[INFO] 
[INFO] --- maven-remote-resources-plugin:1.5:process (default) @ uima-docbook-tutorials-and-users-guides ---
[WARNING] Failed to getClass for org.apache.maven.plugin.dependency.analyze.AnalyzeMojo
[INFO] 
[INFO] <<< maven-dependency-plugin:2.9:analyze (default-cli) < test-compile @ uima-docbook-tutorials-and-users-guides <<<
[INFO] 
[INFO] --- maven-dependency-plugin:2.9:analyze (default-cli) @ uima-docbook-tutorials-and-users-guides ---
[INFO] Skipping pom project
[INFO]                                                                         
[INFO] ------------------------------------------------------------------------
[INFO] Building Apache UIMA SDK Documentation - tutorials and user's guides 3.0.0-SNAPSHOT
[INFO] ------------------------------------------------------------------------
[INFO] 
[INFO] --- maven-clean-plugin:2.5:clean (default-clean) @ uima-docbook-v3-users-guide ---
[TASKS] Scanning folder '<https://builds.apache.org/job/UIMA-v3-sdk/ws/uima-docbook-v3-users-guide'> for files matching the pattern '**/*.java' - excludes: 
[TASKS] Found 0 files to scan for tasks
Found 0 open tasks.
[TASKS] Computing warning deltas based on reference build #17
[INFO] 
[INFO] --- maven-enforcer-plugin:1.3.1:enforce (enforce-versions) @ uima-docbook-v3-users-guide ---
[INFO] 
[INFO] --- build-helper-maven-plugin:1.8:parse-version (parse-project-version) @ uima-docbook-v3-users-guide ---
[INFO] 
[INFO] --- uima-build-helper-maven-plugin:7:parse-date-time (set buildYear and buildMonth) @ uima-docbook-v3-users-guide ---
[INFO] 
[INFO] --- jacoco-maven-plugin:0.7.6.201602180812:prepare-agent (default-prepare-agent) @ uima-docbook-v3-users-guide ---
[INFO] jacoco.argLine set to -javaagent:/home/jenkins/jenkins-slave/maven-repositories/0/org/jacoco/org.jacoco.agent/0.7.6.201602180812/org.jacoco.agent-0.7.6.201602180812-runtime.jar=destfile=<https://builds.apache.org/job/UIMA-v3-sdk/ws/uima-docbook-v3-users-guide/target/jacoco.exec,excludes=**/org/apache/uima/examples/SourceDocumentInformation*>:**/org/apache/uima/examples/SourceDocumentInformation_Type*
[INFO] 
[INFO] --- maven-remote-resources-plugin:1.5:process (default) @ uima-docbook-v3-users-guide ---
[INFO] 
[INFO] --- maven-antrun-plugin:1.7:run (dup-meta-jar-cleanup) @ uima-docbook-v3-users-guide ---
[INFO] Executing tasks

main:
[INFO] Executed tasks
[INFO] 
[INFO] --- maven-dependency-plugin:2.9:unpack (copyDocbookInfo) @ uima-docbook-v3-users-guide ---
[INFO] Configured Artifact: org.apache.uima:uima-build-resources:5:jar
[INFO] Unpacking /home/jenkins/jenkins-slave/maven-repositories/0/org/apache/uima/uima-build-resources/5/uima-build-resources-5.jar to <https://builds.apache.org/job/UIMA-v3-sdk/ws/uima-docbook-v3-users-guide/target> with includes "docbook-shared/**" and excludes ""
[INFO] 
[INFO] --- maven-dependency-plugin:2.9:unpack (copyDocbookInfoNextToOlink) @ uima-docbook-v3-users-guide ---
[INFO] Configured Artifact: org.apache.uima:uima-build-resources:5:jar
[INFO] uima-build-resources-5.jar already unpacked.
[INFO] 
[INFO] --- maven-dependency-plugin:2.9:unpack (getOlink) @ uima-docbook-v3-users-guide ---
[INFO] Configured Artifact: org.apache.uima:uima-docbook-olink:olink:1-SNAPSHOT:zip
[INFO] uima-docbook-olink-1-SNAPSHOT-olink.zip already unpacked.
[INFO] 
[INFO] --- jacoco-maven-plugin:0.7.6.201602180812:report (default-report) @ uima-docbook-v3-users-guide ---
[INFO] Skipping JaCoCo execution due to missing execution data <https://builds.apache.org/job/UIMA-v3-sdk/ws/uima-docbook-v3-users-guide/target/jacoco.exec>
[PMD] No report found for mojo report
[INFO] 
[INFO] --- maven-site-plugin:3.3:attach-descriptor (attach-descriptor) @ uima-docbook-v3-users-guide ---
[INFO] 
[INFO] --- docbkx-maven-plugin:2.0.14:generate-html (html) @ uima-docbook-v3-users-guide ---
[INFO] Processing input file: version_3_users_guide.xml
[INFO] Applying customization parameters
Recoverable error
org.xml.sax.SAXParseException; systemId: file://<https://builds.apache.org/job/UIMA-v3-sdk/ws/uima-docbook-v3-users-guide/src/docbook/version_3_users_guide.xml;> lineNumber: 30; columnNumber: 95; Include operation failed, reverting to fallback. Resource error reading file as XML (href='uv3.new_or_extended_apis.xml'). Reason: <https://builds.apache.org/job/UIMA-v3-sdk/ws/uima-docbook-v3-users-guide/src/docbook/uv3.new_or_extended_apis.xml> (No such file or directory)
Error on line 30 column 95 of file://<https://builds.apache.org/job/UIMA-v3-sdk/ws/uima-docbook-v3-users-guide/src/docbook/version_3_users_guide.xml>:
  Error reported by XML parser: An 'include' failed, and no 'fallback' element was found.
[INFO]                                                                         
[INFO] ------------------------------------------------------------------------
[INFO] Skipping Apache UIMA Java SDK: uimaj
[INFO] This project has been banned from the build due to previous failures.
[INFO] ------------------------------------------------------------------------
[INFO] ------------------------------------------------------------------------
[INFO] Reactor Summary:
[INFO] 
[INFO] Apache UIMA Java SDK: uimaj-parent ................. SUCCESS [ 19.864 s]
[INFO] Apache UIMA Base: uimaj-test-util: JUnit utilities . SUCCESS [ 35.417 s]
[INFO] Apache UIMA Base: uimaj-core ....................... SUCCESS [02:24 min]
[INFO] Apache UIMA Base: jVinci: Vinci Transport Library .. SUCCESS [ 20.375 s]
[INFO] Apache UIMA Base: uimaj-adapter-vinci: Vinci Adapter SUCCESS [ 18.606 s]
[INFO] Apache UIMA Base: uimaj-cpe: Collection Processing Engine SUCCESS [ 48.922 s]
[INFO] Apache UIMA Base: uimaj-document-annotation ........ SUCCESS [ 13.829 s]
[INFO] Apache UIMA Base: uimaj-tools: Tools ............... SUCCESS [ 37.754 s]
[INFO] Apache UIMA Base: uimaj-v3migration-jcas ........... SUCCESS [ 22.946 s]
[INFO] Apache UIMA Base: uimaj-examples: SDK Examples ..... SUCCESS [ 24.861 s]
[INFO] Apache UIMA Base: uimaj-adapter-soap: SOAP Adapter . SUCCESS [ 20.538 s]
[INFO] Apache UIMA Base: uimaj-component-test-util: for JUnit SUCCESS [ 18.022 s]
[INFO] Apache UIMA Eclipse: uimaj-ep-debug ................ SUCCESS [ 44.025 s]
[INFO] Apache UIMA Eclipse: uimaj-ep-jcasgen .............. SUCCESS [ 18.608 s]
[INFO] Apache UIMA Eclipse: uimaj-ep-configurator: Descriptor Editor SUCCESS [ 55.569 s]
[INFO] Apache UIMA Eclipse: uimaj-ep-pear-packager ........ SUCCESS [ 23.924 s]
[INFO] Apache UIMA Eclipse: uimaj-ep-launcher ............. SUCCESS [ 31.330 s]
[INFO] Apache UIMA Eclipse: uimaj-ep-cas-editor ........... SUCCESS [ 39.117 s]
[INFO] Apache UIMA Eclipse: uimaj-ep-cas-editor-ide ....... SUCCESS [ 24.793 s]
[INFO] Apache UIMA Eclipse: uimaj-ep-runtime .............. SUCCESS [ 17.013 s]
[INFO] Apache UIMA Eclipse: uimaj-eclipse-feature-tools ... SUCCESS [ 12.453 s]
[INFO] Apache UIMA Eclipse: uimaj-eclipse-feature-runtime . SUCCESS [ 12.357 s]
[INFO] Apache UIMA Aggregate: aggregate-uimaj-eclipse-plugins SUCCESS [  5.614 s]
[INFO] Apache UIMA SDK Documentation - overview and setup . SUCCESS [ 19.039 s]
[INFO] Apache UIMA SDK Documentation - references ......... SUCCESS [ 15.213 s]
[INFO] Apache UIMA SDK Documentation - tools .............. SUCCESS [ 14.295 s]
[INFO] Apache UIMA SDK Documentation - tutorials and user's guides SUCCESS [ 19.140 s]
[INFO] Apache UIMA SDK Documentation - tutorials and user's guides FAILURE [  3.998 s]
[INFO] Apache UIMA Aggregate: aggregate-uimaj-docbooks .... SKIPPED
[INFO] Apache UIMA Maven: PearPackagingMavenPlugin ........ SKIPPED
[INFO] Apache UIMA Maven: jcasgen-maven-plugin ............ SKIPPED
[INFO] Apache UIMA Base: uimaj-bootstrap .................. SKIPPED
[INFO] Apache UIMA Aggregate: aggregate-uimaj ............. SKIPPED
[INFO] Apache UIMA Base: uimaj-json: JSON ................. SKIPPED
[INFO] Apache UIMA Java SDK: uimaj ........................ SKIPPED
[INFO] ------------------------------------------------------------------------
[INFO] BUILD FAILURE
[INFO] ------------------------------------------------------------------------
[INFO] Total time: 15:18 min
[INFO] Finished at: 2016-12-21T14:11:09+00:00
[INFO] Final Memory: 189M/1079M
[INFO] ------------------------------------------------------------------------
Waiting for Jenkins to finish collecting data
[ERROR] Failed to execute goal com.agilejava.docbkx:docbkx-maven-plugin:2.0.14:generate-html (html) on project uima-docbook-v3-users-guide: Failed to transform version_3_users_guide.xml. org.xml.sax.SAXParseException; systemId: file://<https://builds.apache.org/job/UIMA-v3-sdk/ws/uima-docbook-v3-users-guide/src/docbook/version_3_users_guide.xml;> lineNumber: 30; columnNumber: 95; An 'include' failed, and no 'fallback' element was found. -> [Help 1]
[ERROR] 
[ERROR] To see the full stack trace of the errors, re-run Maven with the -e switch.
[ERROR] Re-run Maven using the -X switch to enable full debug logging.
[ERROR] 
[ERROR] For more information about the errors and possible solutions, please read the following articles:
[ERROR] [Help 1] http://cwiki.apache.org/confluence/display/MAVEN/MojoExecutionException
[ERROR] 
[ERROR] After correcting the problems, you can resume the build with the command
[ERROR]   mvn <goals> -rf :uima-docbook-v3-users-guide
[JENKINS] Archiving <https://builds.apache.org/job/UIMA-v3-sdk/ws/uimaj-eclipse-feature-runtime/pom.xml> to org.apache.uima/uimaj-eclipse-feature-runtime/3.0.0-SNAPSHOT/uimaj-eclipse-feature-runtime-3.0.0-SNAPSHOT.pom
[JENKINS] Archiving <https://builds.apache.org/job/UIMA-v3-sdk/ws/uimaj-eclipse-feature-runtime/target/uimaj-eclipse-feature-runtime_3.0.0.SNAPSHOT.jar> to org.apache.uima/uimaj-eclipse-feature-runtime/3.0.0-SNAPSHOT/uimaj-eclipse-feature-runtime-3.0.0-SNAPSHOT.jar
[JENKINS] Archiving <https://builds.apache.org/job/UIMA-v3-sdk/ws/uimaj-ep-launcher/pom.xml> to org.apache.uima/uimaj-ep-launcher/3.0.0-SNAPSHOT/uimaj-ep-launcher-3.0.0-SNAPSHOT.pom
[JENKINS] Archiving <https://builds.apache.org/job/UIMA-v3-sdk/ws/uimaj-ep-launcher/target/org.apache.uima.launcher_3.0.0.SNAPSHOT.jar> to org.apache.uima/uimaj-ep-launcher/3.0.0-SNAPSHOT/uimaj-ep-launcher-3.0.0-SNAPSHOT.jar
[JENKINS] Archiving <https://builds.apache.org/job/UIMA-v3-sdk/ws/uimaj-eclipse-feature-tools/pom.xml> to org.apache.uima/uimaj-eclipse-feature-tools/3.0.0-SNAPSHOT/uimaj-eclipse-feature-tools-3.0.0-SNAPSHOT.pom
[JENKINS] Archiving <https://builds.apache.org/job/UIMA-v3-sdk/ws/uimaj-eclipse-feature-tools/target/uimaj-eclipse-feature-tools_3.0.0.SNAPSHOT.jar> to org.apache.uima/uimaj-eclipse-feature-tools/3.0.0-SNAPSHOT/uimaj-eclipse-feature-tools-3.0.0-SNAPSHOT.jar
[JENKINS] Archiving <https://builds.apache.org/job/UIMA-v3-sdk/ws/uimaj-bootstrap/pom.xml> to org.apache.uima/uimaj-bootstrap/3.0.0-SNAPSHOT/uimaj-bootstrap-3.0.0-SNAPSHOT.pom
[JENKINS] Archiving <https://builds.apache.org/job/UIMA-v3-sdk/ws/aggregate-uimaj-eclipse-plugins/pom.xml> to org.apache.uima/aggregate-uimaj-eclipse-plugins/3.0.0-SNAPSHOT/aggregate-uimaj-eclipse-plugins-3.0.0-SNAPSHOT.pom
[JENKINS] Archiving <https://builds.apache.org/job/UIMA-v3-sdk/ws/uimaj-core/pom.xml> to org.apache.uima/uimaj-core/3.0.0-SNAPSHOT/uimaj-core-3.0.0-SNAPSHOT.pom
[JENKINS] Archiving <https://builds.apache.org/job/UIMA-v3-sdk/ws/uimaj-core/target/uima-core.jar> to org.apache.uima/uimaj-core/3.0.0-SNAPSHOT/uimaj-core-3.0.0-SNAPSHOT.jar
[JENKINS] Archiving <https://builds.apache.org/job/UIMA-v3-sdk/ws/uimaj-component-test-util/pom.xml> to org.apache.uima/uimaj-component-test-util/3.0.0-SNAPSHOT/uimaj-component-test-util-3.0.0-SNAPSHOT.pom
[JENKINS] Archiving <https://builds.apache.org/job/UIMA-v3-sdk/ws/uimaj-component-test-util/target/uimaj-component-test-util-3.0.0-SNAPSHOT.jar> to org.apache.uima/uimaj-component-test-util/3.0.0-SNAPSHOT/uimaj-component-test-util-3.0.0-SNAPSHOT.jar
[JENKINS] Archiving <https://builds.apache.org/job/UIMA-v3-sdk/ws/aggregate-uimaj-docbooks/pom.xml> to org.apache.uima/aggregate-uimaj-docbooks/3.0.0-SNAPSHOT/aggregate-uimaj-docbooks-3.0.0-SNAPSHOT.pom
[JENKINS] Archiving <https://builds.apache.org/job/UIMA-v3-sdk/ws/uima-docbook-tools/pom.xml> to org.apache.uima/uima-docbook-tools/3.0.0-SNAPSHOT/uima-docbook-tools-3.0.0-SNAPSHOT.pom
[JENKINS] Archiving <https://builds.apache.org/job/UIMA-v3-sdk/ws/uimaj-document-annotation/pom.xml> to org.apache.uima/uimaj-document-annotation/3.0.0-SNAPSHOT/uimaj-document-annotation-3.0.0-SNAPSHOT.pom
[JENKINS] Archiving <https://builds.apache.org/job/UIMA-v3-sdk/ws/uimaj-document-annotation/target/uima-document-annotation.jar> to org.apache.uima/uimaj-document-annotation/3.0.0-SNAPSHOT/uimaj-document-annotation-3.0.0-SNAPSHOT.jar
[JENKINS] Archiving <https://builds.apache.org/job/UIMA-v3-sdk/ws/jVinci/pom.xml> to org.apache.uima/jVinci/3.0.0-SNAPSHOT/jVinci-3.0.0-SNAPSHOT.pom
[JENKINS] Archiving <https://builds.apache.org/job/UIMA-v3-sdk/ws/jVinci/target/jVinci.jar> to org.apache.uima/jVinci/3.0.0-SNAPSHOT/jVinci-3.0.0-SNAPSHOT.jar
[JENKINS] Archiving <https://builds.apache.org/job/UIMA-v3-sdk/ws/uimaj-ep-configurator/pom.xml> to org.apache.uima/uimaj-ep-configurator/3.0.0-SNAPSHOT/uimaj-ep-configurator-3.0.0-SNAPSHOT.pom
[JENKINS] Archiving <https://builds.apache.org/job/UIMA-v3-sdk/ws/uimaj-ep-configurator/target/org.apache.uima.desceditor_3.0.0.SNAPSHOT.jar> to org.apache.uima/uimaj-ep-configurator/3.0.0-SNAPSHOT/uimaj-ep-configurator-3.0.0-SNAPSHOT.jar
[JENKINS] Archiving <https://builds.apache.org/job/UIMA-v3-sdk/ws/uimaj-examples/pom.xml> to org.apache.uima/uimaj-examples/3.0.0-SNAPSHOT/uimaj-examples-3.0.0-SNAPSHOT.pom
[JENKINS] Archiving <https://builds.apache.org/job/UIMA-v3-sdk/ws/uimaj-examples/target/uima-examples.jar> to org.apache.uima/uimaj-examples/3.0.0-SNAPSHOT/uimaj-examples-3.0.0-SNAPSHOT.jar
[JENKINS] Archiving <https://builds.apache.org/job/UIMA-v3-sdk/ws/uimaj-adapter-vinci/pom.xml> to org.apache.uima/uimaj-adapter-vinci/3.0.0-SNAPSHOT/uimaj-adapter-vinci-3.0.0-SNAPSHOT.pom
[JENKINS] Archiving <https://builds.apache.org/job/UIMA-v3-sdk/ws/uimaj-adapter-vinci/target/uima-adapter-vinci.jar> to org.apache.uima/uimaj-adapter-vinci/3.0.0-SNAPSHOT/uimaj-adapter-vinci-3.0.0-SNAPSHOT.jar
[JENKINS] Archiving <https://builds.apache.org/job/UIMA-v3-sdk/ws/PearPackagingMavenPlugin/pom.xml> to org.apache.uima/PearPackagingMavenPlugin/3.0.0-SNAPSHOT/PearPackagingMavenPlugin-3.0.0-SNAPSHOT.pom
[JENKINS] Archiving <https://builds.apache.org/job/UIMA-v3-sdk/ws/uimaj-ep-cas-editor-ide/pom.xml> to org.apache.uima/uimaj-ep-cas-editor-ide/3.0.0-SNAPSHOT/uimaj-ep-cas-editor-ide-3.0.0-SNAPSHOT.pom
[JENKINS] Archiving <https://builds.apache.org/job/UIMA-v3-sdk/ws/uimaj-ep-cas-editor-ide/target/org.apache.uima.caseditor.ide_3.0.0.SNAPSHOT.jar> to org.apache.uima/uimaj-ep-cas-editor-ide/3.0.0-SNAPSHOT/uimaj-ep-cas-editor-ide-3.0.0-SNAPSHOT.jar
[JENKINS] Archiving <https://builds.apache.org/job/UIMA-v3-sdk/ws/uimaj-test-util/pom.xml> to org.apache.uima/uimaj-test-util/3.0.0-SNAPSHOT/uimaj-test-util-3.0.0-SNAPSHOT.pom
[JENKINS] Archiving <https://builds.apache.org/job/UIMA-v3-sdk/ws/uimaj-test-util/target/uimaj-test-util-3.0.0-SNAPSHOT.jar> to org.apache.uima/uimaj-test-util/3.0.0-SNAPSHOT/uimaj-test-util-3.0.0-SNAPSHOT.jar
[JENKINS] Archiving <https://builds.apache.org/job/UIMA-v3-sdk/ws/uimaj-ep-runtime/pom.xml> to org.apache.uima/uimaj-ep-runtime/3.0.0-SNAPSHOT/uimaj-ep-runtime-3.0.0-SNAPSHOT.pom
[JENKINS] Archiving <https://builds.apache.org/job/UIMA-v3-sdk/ws/uimaj-ep-runtime/target/org.apache.uima.runtime_3.0.0.SNAPSHOT.jar> to org.apache.uima/uimaj-ep-runtime/3.0.0-SNAPSHOT/uimaj-ep-runtime-3.0.0-SNAPSHOT.jar
Compressed 4.01 MB of artifacts by 35.0% relative to #17
[JENKINS] Archiving <https://builds.apache.org/job/UIMA-v3-sdk/ws/uimaj-ep-debug/pom.xml> to org.apache.uima/uimaj-ep-debug/3.0.0-SNAPSHOT/uimaj-ep-debug-3.0.0-SNAPSHOT.pom
[JENKINS] Archiving <https://builds.apache.org/job/UIMA-v3-sdk/ws/uimaj-ep-debug/target/org.apache.uima.debug_3.0.0.SNAPSHOT.jar> to org.apache.uima/uimaj-ep-debug/3.0.0-SNAPSHOT/uimaj-ep-debug-3.0.0-SNAPSHOT.jar
[JENKINS] Archiving <https://builds.apache.org/job/UIMA-v3-sdk/ws/uimaj-ep-cas-editor/pom.xml> to org.apache.uima/uimaj-ep-cas-editor/3.0.0-SNAPSHOT/uimaj-ep-cas-editor-3.0.0-SNAPSHOT.pom
[JENKINS] Archiving <https://builds.apache.org/job/UIMA-v3-sdk/ws/uimaj-ep-cas-editor/target/org.apache.uima.caseditor_3.0.0.SNAPSHOT.jar> to org.apache.uima/uimaj-ep-cas-editor/3.0.0-SNAPSHOT/uimaj-ep-cas-editor-3.0.0-SNAPSHOT.jar
[JENKINS] Archiving <https://builds.apache.org/job/UIMA-v3-sdk/ws/aggregate-uimaj/pom.xml> to org.apache.uima/aggregate-uimaj/3.0.0-SNAPSHOT/aggregate-uimaj-3.0.0-SNAPSHOT.pom
[JENKINS] Archiving <https://builds.apache.org/job/UIMA-v3-sdk/ws/uimaj-parent/pom.xml> to org.apache.uima/uimaj-parent/3.0.0-SNAPSHOT/uimaj-parent-3.0.0-SNAPSHOT.pom
[JENKINS] Archiving <https://builds.apache.org/job/UIMA-v3-sdk/ws/jcasgen-maven-plugin/pom.xml> to org.apache.uima/jcasgen-maven-plugin/3.0.0-SNAPSHOT/jcasgen-maven-plugin-3.0.0-SNAPSHOT.pom
[JENKINS] Archiving <https://builds.apache.org/job/UIMA-v3-sdk/ws/pom.xml> to org.apache.uima/uimaj/3.0.0-SNAPSHOT/uimaj-3.0.0-SNAPSHOT.pom
[JENKINS] Archiving <https://builds.apache.org/job/UIMA-v3-sdk/ws/uimaj-ep-jcasgen/pom.xml> to org.apache.uima/uimaj-ep-jcasgen/3.0.0-SNAPSHOT/uimaj-ep-jcasgen-3.0.0-SNAPSHOT.pom
[JENKINS] Archiving <https://builds.apache.org/job/UIMA-v3-sdk/ws/uimaj-ep-jcasgen/target/org.apache.uima.jcas.jcasgenp_3.0.0.SNAPSHOT.jar> to org.apache.uima/uimaj-ep-jcasgen/3.0.0-SNAPSHOT/uimaj-ep-jcasgen-3.0.0-SNAPSHOT.jar
[JENKINS] Archiving <https://builds.apache.org/job/UIMA-v3-sdk/ws/uimaj-json/pom.xml> to org.apache.uima/uimaj-json/3.0.0-SNAPSHOT/uimaj-json-3.0.0-SNAPSHOT.pom
[JENKINS] Archiving <https://builds.apache.org/job/UIMA-v3-sdk/ws/uimaj-v3migration-jcas/pom.xml> to org.apache.uima/uimaj-v3migration-jcas/3.0.0-SNAPSHOT/uimaj-v3migration-jcas-3.0.0-SNAPSHOT.pom
[JENKINS] Archiving <https://builds.apache.org/job/UIMA-v3-sdk/ws/uimaj-v3migration-jcas/target/uimaj-v3migration-jcas.jar> to org.apache.uima/uimaj-v3migration-jcas/3.0.0-SNAPSHOT/uimaj-v3migration-jcas-3.0.0-SNAPSHOT.jar
[JENKINS] Archiving <https://builds.apache.org/job/UIMA-v3-sdk/ws/uimaj-tools/pom.xml> to org.apache.uima/uimaj-tools/3.0.0-SNAPSHOT/uimaj-tools-3.0.0-SNAPSHOT.pom
[JENKINS] Archiving <https://builds.apache.org/job/UIMA-v3-sdk/ws/uimaj-tools/target/uima-tools.jar> to org.apache.uima/uimaj-tools/3.0.0-SNAPSHOT/uimaj-tools-3.0.0-SNAPSHOT.jar
[JENKINS] Archiving <https://builds.apache.org/job/UIMA-v3-sdk/ws/uima-docbook-tutorials-and-users-guides/pom.xml> to org.apache.uima/uima-docbook-tutorials-and-users-guides/3.0.0-SNAPSHOT/uima-docbook-tutorials-and-users-guides-3.0.0-SNAPSHOT.pom
[JENKINS] Archiving <https://builds.apache.org/job/UIMA-v3-sdk/ws/uimaj-adapter-soap/pom.xml> to org.apache.uima/uimaj-adapter-soap/3.0.0-SNAPSHOT/uimaj-adapter-soap-3.0.0-SNAPSHOT.pom
[JENKINS] Archiving <https://builds.apache.org/job/UIMA-v3-sdk/ws/uimaj-adapter-soap/target/uima-adapter-soap.jar> to org.apache.uima/uimaj-adapter-soap/3.0.0-SNAPSHOT/uimaj-adapter-soap-3.0.0-SNAPSHOT.jar
[JENKINS] Archiving <https://builds.apache.org/job/UIMA-v3-sdk/ws/uima-docbook-v3-users-guide/pom.xml> to org.apache.uima/uima-docbook-v3-users-guide/3.0.0-SNAPSHOT/uima-docbook-v3-users-guide-3.0.0-SNAPSHOT.pom
[JENKINS] Archiving <https://builds.apache.org/job/UIMA-v3-sdk/ws/uimaj-ep-pear-packager/pom.xml> to org.apache.uima/uimaj-ep-pear-packager/3.0.0-SNAPSHOT/uimaj-ep-pear-packager-3.0.0-SNAPSHOT.pom
[JENKINS] Archiving <https://builds.apache.org/job/UIMA-v3-sdk/ws/uimaj-ep-pear-packager/target/org.apache.uima.pear_3.0.0.SNAPSHOT.jar> to org.apache.uima/uimaj-ep-pear-packager/3.0.0-SNAPSHOT/uimaj-ep-pear-packager-3.0.0-SNAPSHOT.jar
[JENKINS] Archiving <https://builds.apache.org/job/UIMA-v3-sdk/ws/uima-docbook-overview-and-setup/pom.xml> to org.apache.uima/uima-docbook-overview-and-setup/3.0.0-SNAPSHOT/uima-docbook-overview-and-setup-3.0.0-SNAPSHOT.pom
[JENKINS] Archiving <https://builds.apache.org/job/UIMA-v3-sdk/ws/uima-docbook-references/pom.xml> to org.apache.uima/uima-docbook-references/3.0.0-SNAPSHOT/uima-docbook-references-3.0.0-SNAPSHOT.pom
[JENKINS] Archiving <https://builds.apache.org/job/UIMA-v3-sdk/ws/uimaj-cpe/pom.xml> to org.apache.uima/uimaj-cpe/3.0.0-SNAPSHOT/uimaj-cpe-3.0.0-SNAPSHOT.pom
[JENKINS] Archiving <https://builds.apache.org/job/UIMA-v3-sdk/ws/uimaj-cpe/target/uima-cpe.jar> to org.apache.uima/uimaj-cpe/3.0.0-SNAPSHOT/uimaj-cpe-3.0.0-SNAPSHOT.jar
channel stopped
[WARNINGS] Skipping publisher since build result is FAILURE

Build failed in Jenkins: UIMA-v3-sdk #24

Posted by Apache Jenkins Server <je...@builds.apache.org>.
See <https://builds.apache.org/job/UIMA-v3-sdk/24/changes>

Changes:

[schor] [UIMA-5225] fix up FeatureStructureImpl (added for backwards compatibility).

------------------------------------------
[...truncated 3942 lines...]
[INFO] Installing <https://builds.apache.org/job/UIMA-v3-sdk/ws/uimaj-test-util/pom.xml> to /home/jenkins/jenkins-slave/maven-repositories/1/org/apache/uima/uimaj-test-util/3.0.0-SNAPSHOT/uimaj-test-util-3.0.0-SNAPSHOT.pom
[INFO] 
[INFO] >>> maven-dependency-plugin:2.9:analyze (default-cli) > test-compile @ uimaj-test-util >>>
[INFO] 
[INFO] --- maven-enforcer-plugin:1.3.1:enforce (enforce-versions) @ uimaj-test-util ---
[INFO] 
[INFO] --- build-helper-maven-plugin:1.8:parse-version (parse-project-version) @ uimaj-test-util ---
[INFO] 
[INFO] --- uima-build-helper-maven-plugin:7:parse-date-time (set buildYear and buildMonth) @ uimaj-test-util ---
[INFO] 
[INFO] --- jacoco-maven-plugin:0.7.6.201602180812:prepare-agent (default-prepare-agent) @ uimaj-test-util ---
[INFO] jacoco.argLine set to -javaagent:/home/jenkins/jenkins-slave/maven-repositories/1/org/jacoco/org.jacoco.agent/0.7.6.201602180812/org.jacoco.agent-0.7.6.201602180812-runtime.jar=destfile=<https://builds.apache.org/job/UIMA-v3-sdk/ws/uimaj-test-util/target/jacoco.exec,excludes=**/org/apache/uima/examples/SourceDocumentInformation*>:**/org/apache/uima/examples/SourceDocumentInformation_Type*
[INFO] 
[INFO] --- maven-remote-resources-plugin:1.5:process (default) @ uimaj-test-util ---
[INFO] 
[INFO] --- maven-resources-plugin:2.6:resources (default-resources) @ uimaj-test-util ---
[INFO] Using 'UTF-8' encoding to copy filtered resources.
[INFO] Copying 0 resource
[INFO] Copying 3 resources
[INFO] Copying 3 resources
[INFO] 
[INFO] --- maven-compiler-plugin:3.1:compile (default-compile) @ uimaj-test-util ---
[INFO] Nothing to compile - all classes are up to date
[INFO] 
[INFO] --- maven-resources-plugin:2.6:testResources (default-testResources) @ uimaj-test-util ---
[INFO] Using 'UTF-8' encoding to copy filtered resources.
[INFO] skip non existing resourceDirectory <https://builds.apache.org/job/UIMA-v3-sdk/ws/uimaj-test-util/src/test/resources>
[INFO] Copying 3 resources
[INFO] Copying 3 resources
[INFO] 
[INFO] --- maven-compiler-plugin:3.1:testCompile (default-testCompile) @ uimaj-test-util ---
[INFO] Nothing to compile - all classes are up to date
[WARNING] Failed to getClass for org.apache.maven.plugin.dependency.analyze.AnalyzeMojo
[INFO] 
[INFO] <<< maven-dependency-plugin:2.9:analyze (default-cli) < test-compile @ uimaj-test-util <<<
[INFO] 
[INFO] --- maven-dependency-plugin:2.9:analyze (default-cli) @ uimaj-test-util ---
[WARNING] Unused declared dependencies found:
[WARNING]    xmlunit:xmlunit:jar:1.6:compile
[WARNING]    com.github.stephenc.findbugs:findbugs-annotations:jar:1.3.9-1:compile
[INFO]                                                                         
[INFO] ------------------------------------------------------------------------
[INFO] Building Apache UIMA Base: uimaj-core 3.0.0-SNAPSHOT
[INFO] ------------------------------------------------------------------------
[INFO] 
[INFO] --- maven-clean-plugin:2.5:clean (default-clean) @ uimaj-core ---
[TASKS] Scanning folder '<https://builds.apache.org/job/UIMA-v3-sdk/ws/uimaj-core'> for files matching the pattern '**/*.java' - excludes: 
[TASKS] Found 909 files to scan for tasks
Found 57 open tasks.
[TASKS] Computing warning deltas based on reference build #17
[INFO] 
[INFO] --- maven-enforcer-plugin:1.3.1:enforce (enforce-versions) @ uimaj-core ---
[INFO] 
[INFO] --- build-helper-maven-plugin:1.8:parse-version (parse-project-version) @ uimaj-core ---
[INFO] 
[INFO] --- uima-build-helper-maven-plugin:7:parse-date-time (set buildYear and buildMonth) @ uimaj-core ---
[INFO] 
[INFO] --- jacoco-maven-plugin:0.7.6.201602180812:prepare-agent (default-prepare-agent) @ uimaj-core ---
[INFO] jacoco.argLine set to -javaagent:/home/jenkins/jenkins-slave/maven-repositories/1/org/jacoco/org.jacoco.agent/0.7.6.201602180812/org.jacoco.agent-0.7.6.201602180812-runtime.jar=destfile=<https://builds.apache.org/job/UIMA-v3-sdk/ws/uimaj-core/target/jacoco.exec,excludes=**/org/apache/uima/examples/SourceDocumentInformation*>:**/org/apache/uima/examples/SourceDocumentInformation_Type*
[INFO] 
[INFO] --- maven-resources-plugin:2.6:copy-resources (setVersions) @ uimaj-core ---
[INFO] Using 'UTF-8' encoding to copy filtered resources.
[INFO] Copying 1 resource
[INFO] 
[INFO] --- build-helper-maven-plugin:1.8:add-source (addVersionSrc) @ uimaj-core ---
[INFO] Source directory: <https://builds.apache.org/job/UIMA-v3-sdk/ws/uimaj-core/target/generated-sources/releaseVersion> added.
[INFO] 
[INFO] --- maven-remote-resources-plugin:1.5:process (default) @ uimaj-core ---
[INFO] 
[INFO] --- maven-resources-plugin:2.6:resources (default-resources) @ uimaj-core ---
[INFO] Using 'UTF-8' encoding to copy filtered resources.
[INFO] Copying 15 resources
[INFO] Copying 3 resources
[INFO] 
[INFO] --- maven-compiler-plugin:3.1:compile (default-compile) @ uimaj-core ---
[INFO] Changes detected - recompiling the module!
[INFO] Compiling 722 source files to <https://builds.apache.org/job/UIMA-v3-sdk/ws/uimaj-core/target/classes>
[INFO] -------------------------------------------------------------
[WARNING] COMPILATION WARNING : 
[INFO] -------------------------------------------------------------
[WARNING] <https://builds.apache.org/job/UIMA-v3-sdk/ws/uimaj-core/src/main/java/org/apache/uima/util/XMLParser.java>: Some input files use or override a deprecated API.
[WARNING] <https://builds.apache.org/job/UIMA-v3-sdk/ws/uimaj-core/src/main/java/org/apache/uima/util/XMLParser.java>: Recompile with -Xlint:deprecation for details.
[WARNING] <https://builds.apache.org/job/UIMA-v3-sdk/ws/uimaj-core/src/main/java/org/apache/uima/cas/impl/FeatureStructureImplC.java>: Some input files use unchecked or unsafe operations.
[WARNING] <https://builds.apache.org/job/UIMA-v3-sdk/ws/uimaj-core/src/main/java/org/apache/uima/cas/impl/FeatureStructureImplC.java>: Recompile with -Xlint:unchecked for details.
[INFO] 4 warnings 
[INFO] -------------------------------------------------------------
[INFO] -------------------------------------------------------------
[ERROR] COMPILATION ERROR : 
[INFO] -------------------------------------------------------------
[ERROR] <https://builds.apache.org/job/UIMA-v3-sdk/ws/uimaj-core/src/main/java/org/apache/uima/cas/impl/FeatureStructureImpl.java>:[150,46] org.apache.uima.cas.impl.FeatureStructureImplC.PrintReferences has private access in org.apache.uima.cas.impl.FeatureStructureImplC
[ERROR] <https://builds.apache.org/job/UIMA-v3-sdk/ws/uimaj-core/src/main/java/org/apache/uima/cas/impl/FeatureStructureImpl.java>:[45,43] incompatible types: org.apache.uima.cas.impl.FeatureStructureImpl cannot be converted to org.apache.uima.cas.impl.FeatureStructureImplC
[ERROR] <https://builds.apache.org/job/UIMA-v3-sdk/ws/uimaj-core/src/main/java/org/apache/uima/cas/impl/FeatureStructureImpl.java>:[49,37] incompatible types: org.apache.uima.cas.impl.FeatureStructureImpl cannot be converted to org.apache.uima.cas.impl.FeatureStructureImplC
[ERROR] <https://builds.apache.org/job/UIMA-v3-sdk/ws/uimaj-core/src/main/java/org/apache/uima/cas/impl/FeatureStructureImpl.java>:[53,36] incompatible types: org.apache.uima.cas.impl.FeatureStructureImpl cannot be converted to org.apache.uima.cas.impl.FeatureStructureImplC
[ERROR] <https://builds.apache.org/job/UIMA-v3-sdk/ws/uimaj-core/src/main/java/org/apache/uima/cas/impl/FeatureStructureImpl.java>:[57,30] incompatible types: org.apache.uima.cas.impl.FeatureStructureImpl cannot be converted to org.apache.uima.cas.impl.FeatureStructureImplC
[ERROR] <https://builds.apache.org/job/UIMA-v3-sdk/ws/uimaj-core/src/main/java/org/apache/uima/cas/impl/FeatureStructureImpl.java>:[61,30] incompatible types: org.apache.uima.cas.impl.FeatureStructureImpl cannot be converted to org.apache.uima.cas.impl.FeatureStructureImplC
[ERROR] <https://builds.apache.org/job/UIMA-v3-sdk/ws/uimaj-core/src/main/java/org/apache/uima/cas/impl/FeatureStructureImpl.java>:[65,30] incompatible types: org.apache.uima.cas.impl.FeatureStructureImpl cannot be converted to org.apache.uima.cas.impl.FeatureStructureImplC
[ERROR] <https://builds.apache.org/job/UIMA-v3-sdk/ws/uimaj-core/src/main/java/org/apache/uima/cas/impl/FeatureStructureImpl.java>:[69,30] incompatible types: org.apache.uima.cas.impl.FeatureStructureImpl cannot be converted to org.apache.uima.cas.impl.FeatureStructureImplC
[ERROR] <https://builds.apache.org/job/UIMA-v3-sdk/ws/uimaj-core/src/main/java/org/apache/uima/cas/impl/FeatureStructureImpl.java>:[73,30] incompatible types: org.apache.uima.cas.impl.FeatureStructureImpl cannot be converted to org.apache.uima.cas.impl.FeatureStructureImplC
[ERROR] <https://builds.apache.org/job/UIMA-v3-sdk/ws/uimaj-core/src/main/java/org/apache/uima/cas/impl/FeatureStructureImpl.java>:[77,30] incompatible types: org.apache.uima.cas.impl.FeatureStructureImpl cannot be converted to org.apache.uima.cas.impl.FeatureStructureImplC
[ERROR] <https://builds.apache.org/job/UIMA-v3-sdk/ws/uimaj-core/src/main/java/org/apache/uima/cas/impl/FeatureStructureImpl.java>:[81,30] incompatible types: org.apache.uima.cas.impl.FeatureStructureImpl cannot be converted to org.apache.uima.cas.impl.FeatureStructureImplC
[ERROR] <https://builds.apache.org/job/UIMA-v3-sdk/ws/uimaj-core/src/main/java/org/apache/uima/cas/impl/FeatureStructureImpl.java>:[85,30] incompatible types: org.apache.uima.cas.impl.FeatureStructureImpl cannot be converted to org.apache.uima.cas.impl.FeatureStructureImplC
[ERROR] <https://builds.apache.org/job/UIMA-v3-sdk/ws/uimaj-core/src/main/java/org/apache/uima/cas/impl/FeatureStructureImpl.java>:[89,30] incompatible types: org.apache.uima.cas.impl.FeatureStructureImpl cannot be converted to org.apache.uima.cas.impl.FeatureStructureImplC
[ERROR] <https://builds.apache.org/job/UIMA-v3-sdk/ws/uimaj-core/src/main/java/org/apache/uima/cas/impl/FeatureStructureImpl.java>:[93,37] incompatible types: org.apache.uima.cas.impl.FeatureStructureImpl cannot be converted to org.apache.uima.cas.impl.FeatureStructureImplC
[ERROR] <https://builds.apache.org/job/UIMA-v3-sdk/ws/uimaj-core/src/main/java/org/apache/uima/cas/impl/FeatureStructureImpl.java>:[97,37] incompatible types: org.apache.uima.cas.impl.FeatureStructureImpl cannot be converted to org.apache.uima.cas.impl.FeatureStructureImplC
[ERROR] <https://builds.apache.org/job/UIMA-v3-sdk/ws/uimaj-core/src/main/java/org/apache/uima/cas/impl/FeatureStructureImpl.java>:[101,37] incompatible types: org.apache.uima.cas.impl.FeatureStructureImpl cannot be converted to org.apache.uima.cas.impl.FeatureStructureImplC
[ERROR] <https://builds.apache.org/job/UIMA-v3-sdk/ws/uimaj-core/src/main/java/org/apache/uima/cas/impl/FeatureStructureImpl.java>:[105,37] incompatible types: org.apache.uima.cas.impl.FeatureStructureImpl cannot be converted to org.apache.uima.cas.impl.FeatureStructureImplC
[ERROR] <https://builds.apache.org/job/UIMA-v3-sdk/ws/uimaj-core/src/main/java/org/apache/uima/cas/impl/FeatureStructureImpl.java>:[109,37] incompatible types: org.apache.uima.cas.impl.FeatureStructureImpl cannot be converted to org.apache.uima.cas.impl.FeatureStructureImplC
[ERROR] <https://builds.apache.org/job/UIMA-v3-sdk/ws/uimaj-core/src/main/java/org/apache/uima/cas/impl/FeatureStructureImpl.java>:[113,37] incompatible types: org.apache.uima.cas.impl.FeatureStructureImpl cannot be converted to org.apache.uima.cas.impl.FeatureStructureImplC
[ERROR] <https://builds.apache.org/job/UIMA-v3-sdk/ws/uimaj-core/src/main/java/org/apache/uima/cas/impl/FeatureStructureImpl.java>:[117,37] incompatible types: org.apache.uima.cas.impl.FeatureStructureImpl cannot be converted to org.apache.uima.cas.impl.FeatureStructureImplC
[ERROR] <https://builds.apache.org/job/UIMA-v3-sdk/ws/uimaj-core/src/main/java/org/apache/uima/cas/impl/FeatureStructureImpl.java>:[121,37] incompatible types: org.apache.uima.cas.impl.FeatureStructureImpl cannot be converted to org.apache.uima.cas.impl.FeatureStructureImplC
[ERROR] <https://builds.apache.org/job/UIMA-v3-sdk/ws/uimaj-core/src/main/java/org/apache/uima/cas/impl/FeatureStructureImpl.java>:[125,37] incompatible types: org.apache.uima.cas.impl.FeatureStructureImpl cannot be converted to org.apache.uima.cas.impl.FeatureStructureImplC
[ERROR] <https://builds.apache.org/job/UIMA-v3-sdk/ws/uimaj-core/src/main/java/org/apache/uima/cas/impl/FeatureStructureImpl.java>:[129,37] incompatible types: org.apache.uima.cas.impl.FeatureStructureImpl cannot be converted to org.apache.uima.cas.impl.FeatureStructureImplC
[ERROR] <https://builds.apache.org/job/UIMA-v3-sdk/ws/uimaj-core/src/main/java/org/apache/uima/cas/impl/FeatureStructureImpl.java>:[134,37] incompatible types: org.apache.uima.cas.impl.FeatureStructureImpl cannot be converted to org.apache.uima.cas.impl.FeatureStructureImplC
[ERROR] <https://builds.apache.org/job/UIMA-v3-sdk/ws/uimaj-core/src/main/java/org/apache/uima/cas/impl/FeatureStructureImpl.java>:[138,37] incompatible types: org.apache.uima.cas.impl.FeatureStructureImpl cannot be converted to org.apache.uima.cas.impl.FeatureStructureImplC
[ERROR] <https://builds.apache.org/job/UIMA-v3-sdk/ws/uimaj-core/src/main/java/org/apache/uima/cas/impl/FeatureStructureImpl.java>:[142,30] incompatible types: org.apache.uima.cas.impl.FeatureStructureImpl cannot be converted to org.apache.uima.cas.impl.FeatureStructureImplC
[ERROR] <https://builds.apache.org/job/UIMA-v3-sdk/ws/uimaj-core/src/main/java/org/apache/uima/cas/impl/FeatureStructureImpl.java>:[146,30] incompatible types: org.apache.uima.cas.impl.FeatureStructureImpl cannot be converted to org.apache.uima.cas.impl.FeatureStructureImplC
[ERROR] <https://builds.apache.org/job/UIMA-v3-sdk/ws/uimaj-core/src/main/java/org/apache/uima/cas/impl/FeatureStructureImpl.java>:[151,30] incompatible types: org.apache.uima.cas.impl.FeatureStructureImpl cannot be converted to org.apache.uima.cas.impl.FeatureStructureImplC
[ERROR] <https://builds.apache.org/job/UIMA-v3-sdk/ws/uimaj-core/src/main/java/org/apache/uima/cas/impl/FeatureStructureImpl.java>:[156,43] incompatible types: org.apache.uima.cas.impl.FeatureStructureImpl cannot be converted to org.apache.uima.cas.impl.FeatureStructureImplC
[INFO] 29 errors 
[INFO] -------------------------------------------------------------
[INFO]                                                                         
[INFO] ------------------------------------------------------------------------
[INFO] Skipping Apache UIMA Java SDK: uimaj
[INFO] This project has been banned from the build due to previous failures.
[INFO] ------------------------------------------------------------------------
[INFO] ------------------------------------------------------------------------
[INFO] Reactor Summary:
[INFO] 
[INFO] Apache UIMA Java SDK: uimaj-parent ................. SUCCESS [ 19.034 s]
[INFO] Apache UIMA Base: uimaj-test-util: JUnit utilities . SUCCESS [ 32.295 s]
[INFO] Apache UIMA Base: uimaj-core ....................... FAILURE [ 12.191 s]
[INFO] Apache UIMA Base: jVinci: Vinci Transport Library .. SKIPPED
[INFO] Apache UIMA Base: uimaj-adapter-vinci: Vinci Adapter SKIPPED
[INFO] Apache UIMA Base: uimaj-cpe: Collection Processing Engine SKIPPED
[INFO] Apache UIMA Base: uimaj-document-annotation ........ SKIPPED
[INFO] Apache UIMA Base: uimaj-tools: Tools ............... SKIPPED
[INFO] Apache UIMA Base: uimaj-v3migration-jcas ........... SKIPPED
[INFO] Apache UIMA Base: uimaj-examples: SDK Examples ..... SKIPPED
[INFO] Apache UIMA Base: uimaj-adapter-soap: SOAP Adapter . SKIPPED
[INFO] Apache UIMA Base: uimaj-component-test-util: for JUnit SKIPPED
[INFO] Apache UIMA Eclipse: uimaj-ep-debug ................ SKIPPED
[INFO] Apache UIMA Eclipse: uimaj-ep-jcasgen .............. SKIPPED
[INFO] Apache UIMA Eclipse: uimaj-ep-configurator: Descriptor Editor SKIPPED
[INFO] Apache UIMA Eclipse: uimaj-ep-pear-packager ........ SKIPPED
[INFO] Apache UIMA Eclipse: uimaj-ep-launcher ............. SKIPPED
[INFO] Apache UIMA Eclipse: uimaj-ep-cas-editor ........... SKIPPED
[INFO] Apache UIMA Eclipse: uimaj-ep-cas-editor-ide ....... SKIPPED
[INFO] Apache UIMA Eclipse: uimaj-ep-runtime .............. SKIPPED
[INFO] Apache UIMA Eclipse: uimaj-eclipse-feature-tools ... SKIPPED
[INFO] Apache UIMA Eclipse: uimaj-eclipse-feature-runtime . SKIPPED
[INFO] Apache UIMA Aggregate: aggregate-uimaj-eclipse-plugins SKIPPED
[INFO] Apache UIMA SDK Documentation - overview and setup . SKIPPED
[INFO] Apache UIMA SDK Documentation - references ......... SKIPPED
[INFO] Apache UIMA SDK Documentation - tools .............. SKIPPED
[INFO] Apache UIMA SDK Documentation - tutorials and user's guides SKIPPED
[INFO] Apache UIMA SDK Documentation - tutorials and user's guides SKIPPED
[INFO] Apache UIMA Aggregate: aggregate-uimaj-docbooks .... SKIPPED
[INFO] Apache UIMA Maven: PearPackagingMavenPlugin ........ SKIPPED
[INFO] Apache UIMA Maven: jcasgen-maven-plugin ............ SKIPPED
[INFO] Apache UIMA Base: uimaj-bootstrap .................. SKIPPED
[INFO] Apache UIMA Aggregate: aggregate-uimaj ............. SKIPPED
[INFO] Apache UIMA Base: uimaj-json: JSON ................. SKIPPED
[INFO] Apache UIMA Java SDK: uimaj ........................ SKIPPED
[INFO] ------------------------------------------------------------------------
[INFO] BUILD FAILURE
[INFO] ------------------------------------------------------------------------
[INFO] Total time: 01:19 min
[INFO] Finished at: 2016-12-21T02:32:10+00:00
[INFO] Final Memory: 70M/712M
[INFO] ------------------------------------------------------------------------
Waiting for Jenkins to finish collecting data
[ERROR] Failed to execute goal org.apache.maven.plugins:maven-compiler-plugin:3.1:compile (default-compile) on project uimaj-core: Compilation failure: Compilation failure:
[ERROR] <https://builds.apache.org/job/UIMA-v3-sdk/ws/uimaj-core/src/main/java/org/apache/uima/cas/impl/FeatureStructureImpl.java>:[150,46] org.apache.uima.cas.impl.FeatureStructureImplC.PrintReferences has private access in org.apache.uima.cas.impl.FeatureStructureImplC
[ERROR] <https://builds.apache.org/job/UIMA-v3-sdk/ws/uimaj-core/src/main/java/org/apache/uima/cas/impl/FeatureStructureImpl.java>:[45,43] incompatible types: org.apache.uima.cas.impl.FeatureStructureImpl cannot be converted to org.apache.uima.cas.impl.FeatureStructureImplC
[ERROR] <https://builds.apache.org/job/UIMA-v3-sdk/ws/uimaj-core/src/main/java/org/apache/uima/cas/impl/FeatureStructureImpl.java>:[49,37] incompatible types: org.apache.uima.cas.impl.FeatureStructureImpl cannot be converted to org.apache.uima.cas.impl.FeatureStructureImplC
[ERROR] <https://builds.apache.org/job/UIMA-v3-sdk/ws/uimaj-core/src/main/java/org/apache/uima/cas/impl/FeatureStructureImpl.java>:[53,36] incompatible types: org.apache.uima.cas.impl.FeatureStructureImpl cannot be converted to org.apache.uima.cas.impl.FeatureStructureImplC
[ERROR] <https://builds.apache.org/job/UIMA-v3-sdk/ws/uimaj-core/src/main/java/org/apache/uima/cas/impl/FeatureStructureImpl.java>:[57,30] incompatible types: org.apache.uima.cas.impl.FeatureStructureImpl cannot be converted to org.apache.uima.cas.impl.FeatureStructureImplC
[ERROR] <https://builds.apache.org/job/UIMA-v3-sdk/ws/uimaj-core/src/main/java/org/apache/uima/cas/impl/FeatureStructureImpl.java>:[61,30] incompatible types: org.apache.uima.cas.impl.FeatureStructureImpl cannot be converted to org.apache.uima.cas.impl.FeatureStructureImplC
[ERROR] <https://builds.apache.org/job/UIMA-v3-sdk/ws/uimaj-core/src/main/java/org/apache/uima/cas/impl/FeatureStructureImpl.java>:[65,30] incompatible types: org.apache.uima.cas.impl.FeatureStructureImpl cannot be converted to org.apache.uima.cas.impl.FeatureStructureImplC
[ERROR] <https://builds.apache.org/job/UIMA-v3-sdk/ws/uimaj-core/src/main/java/org/apache/uima/cas/impl/FeatureStructureImpl.java>:[69,30] incompatible types: org.apache.uima.cas.impl.FeatureStructureImpl cannot be converted to org.apache.uima.cas.impl.FeatureStructureImplC
[ERROR] <https://builds.apache.org/job/UIMA-v3-sdk/ws/uimaj-core/src/main/java/org/apache/uima/cas/impl/FeatureStructureImpl.java>:[73,30] incompatible types: org.apache.uima.cas.impl.FeatureStructureImpl cannot be converted to org.apache.uima.cas.impl.FeatureStructureImplC
[ERROR] <https://builds.apache.org/job/UIMA-v3-sdk/ws/uimaj-core/src/main/java/org/apache/uima/cas/impl/FeatureStructureImpl.java>:[77,30] incompatible types: org.apache.uima.cas.impl.FeatureStructureImpl cannot be converted to org.apache.uima.cas.impl.FeatureStructureImplC
[ERROR] <https://builds.apache.org/job/UIMA-v3-sdk/ws/uimaj-core/src/main/java/org/apache/uima/cas/impl/FeatureStructureImpl.java>:[81,30] incompatible types: org.apache.uima.cas.impl.FeatureStructureImpl cannot be converted to org.apache.uima.cas.impl.FeatureStructureImplC
[ERROR] <https://builds.apache.org/job/UIMA-v3-sdk/ws/uimaj-core/src/main/java/org/apache/uima/cas/impl/FeatureStructureImpl.java>:[85,30] incompatible types: org.apache.uima.cas.impl.FeatureStructureImpl cannot be converted to org.apache.uima.cas.impl.FeatureStructureImplC
[ERROR] <https://builds.apache.org/job/UIMA-v3-sdk/ws/uimaj-core/src/main/java/org/apache/uima/cas/impl/FeatureStructureImpl.java>:[89,30] incompatible types: org.apache.uima.cas.impl.FeatureStructureImpl cannot be converted to org.apache.uima.cas.impl.FeatureStructureImplC
[ERROR] <https://builds.apache.org/job/UIMA-v3-sdk/ws/uimaj-core/src/main/java/org/apache/uima/cas/impl/FeatureStructureImpl.java>:[93,37] incompatible types: org.apache.uima.cas.impl.FeatureStructureImpl cannot be converted to org.apache.uima.cas.impl.FeatureStructureImplC
[ERROR] <https://builds.apache.org/job/UIMA-v3-sdk/ws/uimaj-core/src/main/java/org/apache/uima/cas/impl/FeatureStructureImpl.java>:[97,37] incompatible types: org.apache.uima.cas.impl.FeatureStructureImpl cannot be converted to org.apache.uima.cas.impl.FeatureStructureImplC
[ERROR] <https://builds.apache.org/job/UIMA-v3-sdk/ws/uimaj-core/src/main/java/org/apache/uima/cas/impl/FeatureStructureImpl.java>:[101,37] incompatible types: org.apache.uima.cas.impl.FeatureStructureImpl cannot be converted to org.apache.uima.cas.impl.FeatureStructureImplC
[ERROR] <https://builds.apache.org/job/UIMA-v3-sdk/ws/uimaj-core/src/main/java/org/apache/uima/cas/impl/FeatureStructureImpl.java>:[105,37] incompatible types: org.apache.uima.cas.impl.FeatureStructureImpl cannot be converted to org.apache.uima.cas.impl.FeatureStructureImplC
[ERROR] <https://builds.apache.org/job/UIMA-v3-sdk/ws/uimaj-core/src/main/java/org/apache/uima/cas/impl/FeatureStructureImpl.java>:[109,37] incompatible types: org.apache.uima.cas.impl.FeatureStructureImpl cannot be converted to org.apache.uima.cas.impl.FeatureStructureImplC
[ERROR] <https://builds.apache.org/job/UIMA-v3-sdk/ws/uimaj-core/src/main/java/org/apache/uima/cas/impl/FeatureStructureImpl.java>:[113,37] incompatible types: org.apache.uima.cas.impl.FeatureStructureImpl cannot be converted to org.apache.uima.cas.impl.FeatureStructureImplC
[ERROR] <https://builds.apache.org/job/UIMA-v3-sdk/ws/uimaj-core/src/main/java/org/apache/uima/cas/impl/FeatureStructureImpl.java>:[117,37] incompatible types: org.apache.uima.cas.impl.FeatureStructureImpl cannot be converted to org.apache.uima.cas.impl.FeatureStructureImplC
[ERROR] <https://builds.apache.org/job/UIMA-v3-sdk/ws/uimaj-core/src/main/java/org/apache/uima/cas/impl/FeatureStructureImpl.java>:[121,37] incompatible types: org.apache.uima.cas.impl.FeatureStructureImpl cannot be converted to org.apache.uima.cas.impl.FeatureStructureImplC
[ERROR] <https://builds.apache.org/job/UIMA-v3-sdk/ws/uimaj-core/src/main/java/org/apache/uima/cas/impl/FeatureStructureImpl.java>:[125,37] incompatible types: org.apache.uima.cas.impl.FeatureStructureImpl cannot be converted to org.apache.uima.cas.impl.FeatureStructureImplC
[ERROR] <https://builds.apache.org/job/UIMA-v3-sdk/ws/uimaj-core/src/main/java/org/apache/uima/cas/impl/FeatureStructureImpl.java>:[129,37] incompatible types: org.apache.uima.cas.impl.FeatureStructureImpl cannot be converted to org.apache.uima.cas.impl.FeatureStructureImplC
[ERROR] <https://builds.apache.org/job/UIMA-v3-sdk/ws/uimaj-core/src/main/java/org/apache/uima/cas/impl/FeatureStructureImpl.java>:[134,37] incompatible types: org.apache.uima.cas.impl.FeatureStructureImpl cannot be converted to org.apache.uima.cas.impl.FeatureStructureImplC
[ERROR] <https://builds.apache.org/job/UIMA-v3-sdk/ws/uimaj-core/src/main/java/org/apache/uima/cas/impl/FeatureStructureImpl.java>:[138,37] incompatible types: org.apache.uima.cas.impl.FeatureStructureImpl cannot be converted to org.apache.uima.cas.impl.FeatureStructureImplC
[ERROR] <https://builds.apache.org/job/UIMA-v3-sdk/ws/uimaj-core/src/main/java/org/apache/uima/cas/impl/FeatureStructureImpl.java>:[142,30] incompatible types: org.apache.uima.cas.impl.FeatureStructureImpl cannot be converted to org.apache.uima.cas.impl.FeatureStructureImplC
[ERROR] <https://builds.apache.org/job/UIMA-v3-sdk/ws/uimaj-core/src/main/java/org/apache/uima/cas/impl/FeatureStructureImpl.java>:[146,30] incompatible types: org.apache.uima.cas.impl.FeatureStructureImpl cannot be converted to org.apache.uima.cas.impl.FeatureStructureImplC
[ERROR] <https://builds.apache.org/job/UIMA-v3-sdk/ws/uimaj-core/src/main/java/org/apache/uima/cas/impl/FeatureStructureImpl.java>:[151,30] incompatible types: org.apache.uima.cas.impl.FeatureStructureImpl cannot be converted to org.apache.uima.cas.impl.FeatureStructureImplC
[ERROR] <https://builds.apache.org/job/UIMA-v3-sdk/ws/uimaj-core/src/main/java/org/apache/uima/cas/impl/FeatureStructureImpl.java>:[156,43] incompatible types: org.apache.uima.cas.impl.FeatureStructureImpl cannot be converted to org.apache.uima.cas.impl.FeatureStructureImplC
[ERROR] -> [Help 1]
[ERROR] 
[ERROR] To see the full stack trace of the errors, re-run Maven with the -e switch.
[ERROR] Re-run Maven using the -X switch to enable full debug logging.
[ERROR] 
[ERROR] For more information about the errors and possible solutions, please read the following articles:
[ERROR] [Help 1] http://cwiki.apache.org/confluence/display/MAVEN/MojoFailureException
[ERROR] 
[ERROR] After correcting the problems, you can resume the build with the command
[ERROR]   mvn <goals> -rf :uimaj-core
[JENKINS] Archiving <https://builds.apache.org/job/UIMA-v3-sdk/ws/uimaj-eclipse-feature-runtime/pom.xml> to org.apache.uima/uimaj-eclipse-feature-runtime/3.0.0-SNAPSHOT/uimaj-eclipse-feature-runtime-3.0.0-SNAPSHOT.pom
[JENKINS] Archiving <https://builds.apache.org/job/UIMA-v3-sdk/ws/uimaj-ep-launcher/pom.xml> to org.apache.uima/uimaj-ep-launcher/3.0.0-SNAPSHOT/uimaj-ep-launcher-3.0.0-SNAPSHOT.pom
[JENKINS] Archiving <https://builds.apache.org/job/UIMA-v3-sdk/ws/uimaj-eclipse-feature-tools/pom.xml> to org.apache.uima/uimaj-eclipse-feature-tools/3.0.0-SNAPSHOT/uimaj-eclipse-feature-tools-3.0.0-SNAPSHOT.pom
[JENKINS] Archiving <https://builds.apache.org/job/UIMA-v3-sdk/ws/uimaj-bootstrap/pom.xml> to org.apache.uima/uimaj-bootstrap/3.0.0-SNAPSHOT/uimaj-bootstrap-3.0.0-SNAPSHOT.pom
[JENKINS] Archiving <https://builds.apache.org/job/UIMA-v3-sdk/ws/aggregate-uimaj-eclipse-plugins/pom.xml> to org.apache.uima/aggregate-uimaj-eclipse-plugins/3.0.0-SNAPSHOT/aggregate-uimaj-eclipse-plugins-3.0.0-SNAPSHOT.pom
[JENKINS] Archiving <https://builds.apache.org/job/UIMA-v3-sdk/ws/uimaj-core/pom.xml> to org.apache.uima/uimaj-core/3.0.0-SNAPSHOT/uimaj-core-3.0.0-SNAPSHOT.pom
[JENKINS] Archiving <https://builds.apache.org/job/UIMA-v3-sdk/ws/uimaj-component-test-util/pom.xml> to org.apache.uima/uimaj-component-test-util/3.0.0-SNAPSHOT/uimaj-component-test-util-3.0.0-SNAPSHOT.pom
[JENKINS] Archiving <https://builds.apache.org/job/UIMA-v3-sdk/ws/aggregate-uimaj-docbooks/pom.xml> to org.apache.uima/aggregate-uimaj-docbooks/3.0.0-SNAPSHOT/aggregate-uimaj-docbooks-3.0.0-SNAPSHOT.pom
[JENKINS] Archiving <https://builds.apache.org/job/UIMA-v3-sdk/ws/uima-docbook-tools/pom.xml> to org.apache.uima/uima-docbook-tools/3.0.0-SNAPSHOT/uima-docbook-tools-3.0.0-SNAPSHOT.pom
[JENKINS] Archiving <https://builds.apache.org/job/UIMA-v3-sdk/ws/uimaj-document-annotation/pom.xml> to org.apache.uima/uimaj-document-annotation/3.0.0-SNAPSHOT/uimaj-document-annotation-3.0.0-SNAPSHOT.pom
[JENKINS] Archiving <https://builds.apache.org/job/UIMA-v3-sdk/ws/jVinci/pom.xml> to org.apache.uima/jVinci/3.0.0-SNAPSHOT/jVinci-3.0.0-SNAPSHOT.pom
[JENKINS] Archiving <https://builds.apache.org/job/UIMA-v3-sdk/ws/uimaj-ep-configurator/pom.xml> to org.apache.uima/uimaj-ep-configurator/3.0.0-SNAPSHOT/uimaj-ep-configurator-3.0.0-SNAPSHOT.pom
[JENKINS] Archiving <https://builds.apache.org/job/UIMA-v3-sdk/ws/uimaj-examples/pom.xml> to org.apache.uima/uimaj-examples/3.0.0-SNAPSHOT/uimaj-examples-3.0.0-SNAPSHOT.pom
[JENKINS] Archiving <https://builds.apache.org/job/UIMA-v3-sdk/ws/uimaj-adapter-vinci/pom.xml> to org.apache.uima/uimaj-adapter-vinci/3.0.0-SNAPSHOT/uimaj-adapter-vinci-3.0.0-SNAPSHOT.pom
[JENKINS] Archiving <https://builds.apache.org/job/UIMA-v3-sdk/ws/PearPackagingMavenPlugin/pom.xml> to org.apache.uima/PearPackagingMavenPlugin/3.0.0-SNAPSHOT/PearPackagingMavenPlugin-3.0.0-SNAPSHOT.pom
[JENKINS] Archiving <https://builds.apache.org/job/UIMA-v3-sdk/ws/uimaj-ep-cas-editor-ide/pom.xml> to org.apache.uima/uimaj-ep-cas-editor-ide/3.0.0-SNAPSHOT/uimaj-ep-cas-editor-ide-3.0.0-SNAPSHOT.pom
[JENKINS] Archiving <https://builds.apache.org/job/UIMA-v3-sdk/ws/uimaj-test-util/pom.xml> to org.apache.uima/uimaj-test-util/3.0.0-SNAPSHOT/uimaj-test-util-3.0.0-SNAPSHOT.pom
[JENKINS] Archiving <https://builds.apache.org/job/UIMA-v3-sdk/ws/uimaj-test-util/target/uimaj-test-util-3.0.0-SNAPSHOT.jar> to org.apache.uima/uimaj-test-util/3.0.0-SNAPSHOT/uimaj-test-util-3.0.0-SNAPSHOT.jar
[JENKINS] Archiving <https://builds.apache.org/job/UIMA-v3-sdk/ws/uimaj-ep-runtime/pom.xml> to org.apache.uima/uimaj-ep-runtime/3.0.0-SNAPSHOT/uimaj-ep-runtime-3.0.0-SNAPSHOT.pom
[JENKINS] Archiving <https://builds.apache.org/job/UIMA-v3-sdk/ws/uimaj-ep-debug/pom.xml> to org.apache.uima/uimaj-ep-debug/3.0.0-SNAPSHOT/uimaj-ep-debug-3.0.0-SNAPSHOT.pom
[JENKINS] Archiving <https://builds.apache.org/job/UIMA-v3-sdk/ws/uimaj-ep-cas-editor/pom.xml> to org.apache.uima/uimaj-ep-cas-editor/3.0.0-SNAPSHOT/uimaj-ep-cas-editor-3.0.0-SNAPSHOT.pom
[JENKINS] Archiving <https://builds.apache.org/job/UIMA-v3-sdk/ws/aggregate-uimaj/pom.xml> to org.apache.uima/aggregate-uimaj/3.0.0-SNAPSHOT/aggregate-uimaj-3.0.0-SNAPSHOT.pom
[JENKINS] Archiving <https://builds.apache.org/job/UIMA-v3-sdk/ws/uimaj-parent/pom.xml> to org.apache.uima/uimaj-parent/3.0.0-SNAPSHOT/uimaj-parent-3.0.0-SNAPSHOT.pom
[JENKINS] Archiving <https://builds.apache.org/job/UIMA-v3-sdk/ws/jcasgen-maven-plugin/pom.xml> to org.apache.uima/jcasgen-maven-plugin/3.0.0-SNAPSHOT/jcasgen-maven-plugin-3.0.0-SNAPSHOT.pom
[JENKINS] Archiving <https://builds.apache.org/job/UIMA-v3-sdk/ws/pom.xml> to org.apache.uima/uimaj/3.0.0-SNAPSHOT/uimaj-3.0.0-SNAPSHOT.pom
[JENKINS] Archiving <https://builds.apache.org/job/UIMA-v3-sdk/ws/uimaj-ep-jcasgen/pom.xml> to org.apache.uima/uimaj-ep-jcasgen/3.0.0-SNAPSHOT/uimaj-ep-jcasgen-3.0.0-SNAPSHOT.pom
[JENKINS] Archiving <https://builds.apache.org/job/UIMA-v3-sdk/ws/uimaj-json/pom.xml> to org.apache.uima/uimaj-json/3.0.0-SNAPSHOT/uimaj-json-3.0.0-SNAPSHOT.pom
[JENKINS] Archiving <https://builds.apache.org/job/UIMA-v3-sdk/ws/uimaj-v3migration-jcas/pom.xml> to org.apache.uima/uimaj-v3migration-jcas/3.0.0-SNAPSHOT/uimaj-v3migration-jcas-3.0.0-SNAPSHOT.pom
[JENKINS] Archiving <https://builds.apache.org/job/UIMA-v3-sdk/ws/uimaj-tools/pom.xml> to org.apache.uima/uimaj-tools/3.0.0-SNAPSHOT/uimaj-tools-3.0.0-SNAPSHOT.pom
[JENKINS] Archiving <https://builds.apache.org/job/UIMA-v3-sdk/ws/uima-docbook-tutorials-and-users-guides/pom.xml> to org.apache.uima/uima-docbook-tutorials-and-users-guides/3.0.0-SNAPSHOT/uima-docbook-tutorials-and-users-guides-3.0.0-SNAPSHOT.pom
[JENKINS] Archiving <https://builds.apache.org/job/UIMA-v3-sdk/ws/uimaj-adapter-soap/pom.xml> to org.apache.uima/uimaj-adapter-soap/3.0.0-SNAPSHOT/uimaj-adapter-soap-3.0.0-SNAPSHOT.pom
[JENKINS] Archiving <https://builds.apache.org/job/UIMA-v3-sdk/ws/uima-docbook-v3-users-guide/pom.xml> to org.apache.uima/uima-docbook-v3-users-guide/3.0.0-SNAPSHOT/uima-docbook-v3-users-guide-3.0.0-SNAPSHOT.pom
[JENKINS] Archiving <https://builds.apache.org/job/UIMA-v3-sdk/ws/uimaj-ep-pear-packager/pom.xml> to org.apache.uima/uimaj-ep-pear-packager/3.0.0-SNAPSHOT/uimaj-ep-pear-packager-3.0.0-SNAPSHOT.pom
[JENKINS] Archiving <https://builds.apache.org/job/UIMA-v3-sdk/ws/uima-docbook-overview-and-setup/pom.xml> to org.apache.uima/uima-docbook-overview-and-setup/3.0.0-SNAPSHOT/uima-docbook-overview-and-setup-3.0.0-SNAPSHOT.pom
[JENKINS] Archiving <https://builds.apache.org/job/UIMA-v3-sdk/ws/uima-docbook-references/pom.xml> to org.apache.uima/uima-docbook-references/3.0.0-SNAPSHOT/uima-docbook-references-3.0.0-SNAPSHOT.pom
[JENKINS] Archiving <https://builds.apache.org/job/UIMA-v3-sdk/ws/uimaj-cpe/pom.xml> to org.apache.uima/uimaj-cpe/3.0.0-SNAPSHOT/uimaj-cpe-3.0.0-SNAPSHOT.pom
channel stopped
[WARNINGS] Skipping publisher since build result is FAILURE