You are viewing a plain text version of this content. The canonical link for it is here.
Posted to yarn-dev@hadoop.apache.org by Apache Jenkins Server <je...@builds.apache.org> on 2013/10/04 11:26:51 UTC
Failed: YARN-1166 PreCommit Build #2095
Jira: https://issues.apache.org/jira/browse/YARN-1166
Build: https://builds.apache.org/job/PreCommit-YARN-Build/2095/
###################################################################################
########################## LAST 60 LINES OF THE CONSOLE ###########################
[...truncated 3022 lines...]
{color:red}-1 overall{color}. Here are the results of testing the latest attachment
http://issues.apache.org/jira/secure/attachment/12606761/YARN-1166.4.patch
against trunk revision .
{color:green}+1 @author{color}. The patch does not contain any @author tags.
{color:green}+1 tests included{color}. The patch appears to include 1 new or modified test files.
{color:green}+1 javac{color}. The applied patch does not increase the total number of javac compiler warnings.
{color:green}+1 javadoc{color}. The javadoc tool did not generate any warning messages.
{color:green}+1 eclipse:eclipse{color}. The patch built with eclipse:eclipse.
{color:green}+1 findbugs{color}. The patch does not introduce any new Findbugs (version 1.3.9) warnings.
{color:green}+1 release audit{color}. The applied patch does not increase the total number of release audit warnings.
{color:red}-1 core tests{color}. The patch failed these unit tests in hadoop-yarn-project/hadoop-yarn/hadoop-yarn-server/hadoop-yarn-server-resourcemanager:
org.apache.hadoop.yarn.server.resourcemanager.scheduler.capacity.TestLeafQueue
org.apache.hadoop.yarn.server.resourcemanager.scheduler.fair.TestFairScheduler
{color:green}+1 contrib tests{color}. The patch passed contrib unit tests.
Test results: https://builds.apache.org/job/PreCommit-YARN-Build/2095//testReport/
Console output: https://builds.apache.org/job/PreCommit-YARN-Build/2095//console
This message is automatically generated.
======================================================================
======================================================================
Adding comment to Jira.
======================================================================
======================================================================
Comment added.
f3b0cfdca1275069258f6269c361c38cba193306 logged out
======================================================================
======================================================================
Finished build.
======================================================================
======================================================================
Build step 'Execute shell' marked build as failure
Archiving artifacts
[description-setter] Could not determine description.
Recording test results
Email was triggered for: Failure
Sending email for trigger: Failure
###################################################################################
############################## FAILED TESTS (if any) ##############################
2 tests failed.
FAILED: org.apache.hadoop.yarn.server.resourcemanager.scheduler.capacity.TestLeafQueue.testAppAttemptMetrics
Error Message:
null
Stack Trace:
java.lang.NullPointerException: null
at org.apache.hadoop.yarn.server.resourcemanager.scheduler.QueueMetrics.finishApp(QueueMetrics.java:255)
at org.apache.hadoop.yarn.server.resourcemanager.scheduler.AppSchedulingInfo.stop(AppSchedulingInfo.java:401)
at org.apache.hadoop.yarn.server.resourcemanager.scheduler.common.fica.FiCaSchedulerApp.stop(FiCaSchedulerApp.java:215)
at org.apache.hadoop.yarn.server.resourcemanager.scheduler.capacity.CapacityScheduler.doneApplication(CapacityScheduler.java:501)
at org.apache.hadoop.yarn.server.resourcemanager.scheduler.capacity.CapacityScheduler.handle(CapacityScheduler.java:747)
at org.apache.hadoop.yarn.server.resourcemanager.scheduler.capacity.TestLeafQueue.testAppAttemptMetrics(TestLeafQueue.java:353)
FAILED: org.apache.hadoop.yarn.server.resourcemanager.scheduler.fair.TestFairScheduler.testContinuousScheduling
Error Message:
expected:<1024> but was:<0>
Stack Trace:
junit.framework.AssertionFailedError: expected:<1024> but was:<0>
at junit.framework.Assert.fail(Assert.java:50)
at junit.framework.Assert.failNotEquals(Assert.java:287)
at junit.framework.Assert.assertEquals(Assert.java:67)
at junit.framework.Assert.assertEquals(Assert.java:199)
at junit.framework.Assert.assertEquals(Assert.java:205)
at org.apache.hadoop.yarn.server.resourcemanager.scheduler.fair.TestFairScheduler.testContinuousScheduling(TestFairScheduler.java:2321)