You are viewing a plain text version of this content. The canonical link for it is here.
Posted to builds@solr.apache.org by Apache Jenkins Server <je...@builds.apache.org> on 2022/08/25 05:39:50 UTC

[JENKINS] Solr » Solr-Check-9.0 - Build # 1916 - Still Unstable!

Build: https://ci-builds.apache.org/job/Solr/job/Solr-Check-9.0/1916/

5 tests failed.
FAILED:  org.apache.solr.schema.SchemaApiFailureTest.classMethod

Error Message:
com.carrotsearch.randomizedtesting.ResourceDisposalError: Resource in scope SUITE failed to close. Resource was registered from thread Thread[id=20022, name=qtp1751424866-20022, state=RUNNABLE, group=TGRP-SchemaApiFailureTest], registration stack trace below.

Stack Trace:
com.carrotsearch.randomizedtesting.ResourceDisposalError: Resource in scope SUITE failed to close. Resource was registered from thread Thread[id=20022, name=qtp1751424866-20022, state=RUNNABLE, group=TGRP-SchemaApiFailureTest], registration stack trace below.
	at java.base@11.0.12/java.lang.Thread.getStackTrace(Thread.java:1606)
	at app//com.carrotsearch.randomizedtesting.RandomizedContext.closeAtEnd(RandomizedContext.java:157)
	at app//org.apache.lucene.util.LuceneTestCase.closeAfterSuite(LuceneTestCase.java:798)
	at app//org.apache.lucene.util.LuceneTestCase.wrapDirectory(LuceneTestCase.java:1504)
	at app//org.apache.lucene.util.LuceneTestCase.newDirectory(LuceneTestCase.java:1368)
	at app//org.apache.lucene.util.LuceneTestCase.newDirectory(LuceneTestCase.java:1350)
	at app//org.apache.solr.core.MockDirectoryFactory.create(MockDirectoryFactory.java:51)
	at app//org.apache.solr.core.CachingDirectoryFactory.get(CachingDirectoryFactory.java:368)
	at app//org.apache.solr.core.SolrCore.initSnapshotMetaDataManager(SolrCore.java:606)
	at app//org.apache.solr.core.SolrCore.<init>(SolrCore.java:1119)
	at app//org.apache.solr.core.SolrCore.<init>(SolrCore.java:1048)
	at app//org.apache.solr.core.CoreContainer.createFromDescriptor(CoreContainer.java:1560)
	at app//org.apache.solr.core.CoreContainer.create(CoreContainer.java:1426)
	at app//org.apache.solr.handler.admin.CoreAdminOperation.lambda$static$0(CoreAdminOperation.java:92)
	at app//org.apache.solr.handler.admin.CoreAdminOperation.execute(CoreAdminOperation.java:389)
	at app//org.apache.solr.handler.admin.CoreAdminHandler$CallInfo.call(CoreAdminHandler.java:411)
	at app//org.apache.solr.handler.admin.CoreAdminHandler.handleRequestBody(CoreAdminHandler.java:194)
	at app//org.apache.solr.handler.RequestHandlerBase.handleRequest(RequestHandlerBase.java:207)
	at app//org.apache.solr.servlet.HttpSolrCall.handleAdmin(HttpSolrCall.java:941)
	at app//org.apache.solr.servlet.HttpSolrCall.handleAdminRequest(HttpSolrCall.java:893)
	at app//org.apache.solr.servlet.HttpSolrCall.call(HttpSolrCall.java:584)
	at app//org.apache.solr.servlet.SolrDispatchFilter.dispatch(SolrDispatchFilter.java:239)
	at app//org.apache.solr.servlet.SolrDispatchFilter.lambda$doFilter$0(SolrDispatchFilter.java:207)
	at app//org.apache.solr.servlet.ServletUtils.traceHttpRequestExecution2(ServletUtils.java:257)
	at app//org.apache.solr.servlet.ServletUtils.rateLimitRequest(ServletUtils.java:227)
	at app//org.apache.solr.servlet.SolrDispatchFilter.doFilter(SolrDispatchFilter.java:202)
	at app//org.apache.solr.servlet.SolrDispatchFilter.doFilter(SolrDispatchFilter.java:184)
	at app//org.eclipse.jetty.servlet.FilterHolder.doFilter(FilterHolder.java:193)
	at app//org.eclipse.jetty.servlet.ServletHandler$Chain.doFilter(ServletHandler.java:1601)
	at app//org.apache.solr.client.solrj.embedded.JettySolrRunner$DebugFilter.doFilter(JettySolrRunner.java:187)
	at app//org.eclipse.jetty.servlet.FilterHolder.doFilter(FilterHolder.java:193)
	at app//org.eclipse.jetty.servlet.ServletHandler$Chain.doFilter(ServletHandler.java:1601)
	at app//org.eclipse.jetty.servlet.ServletHandler.doHandle(ServletHandler.java:548)
	at app//org.eclipse.jetty.server.handler.ScopedHandler.nextHandle(ScopedHandler.java:233)
	at app//org.eclipse.jetty.server.session.SessionHandler.doHandle(SessionHandler.java:1624)
	at app//org.eclipse.jetty.server.handler.ScopedHandler.nextHandle(ScopedHandler.java:233)
	at app//org.eclipse.jetty.server.handler.ContextHandler.doHandle(ContextHandler.java:1434)
	at app//org.eclipse.jetty.server.handler.ScopedHandler.nextScope(ScopedHandler.java:188)
	at app//org.eclipse.jetty.servlet.ServletHandler.doScope(ServletHandler.java:501)
	at app//org.eclipse.jetty.server.session.SessionHandler.doScope(SessionHandler.java:1594)
	at app//org.eclipse.jetty.server.handler.ScopedHandler.nextScope(ScopedHandler.java:186)
	at app//org.eclipse.jetty.server.handler.ContextHandler.doScope(ContextHandler.java:1349)
	at app//org.eclipse.jetty.server.handler.ScopedHandler.handle(ScopedHandler.java:141)
	at app//org.eclipse.jetty.server.handler.HandlerWrapper.handle(HandlerWrapper.java:127)
	at app//org.eclipse.jetty.rewrite.handler.RewriteHandler.handle(RewriteHandler.java:322)
	at app//org.eclipse.jetty.server.handler.gzip.GzipHandler.handle(GzipHandler.java:713)
	at app//org.eclipse.jetty.server.handler.HandlerWrapper.handle(HandlerWrapper.java:127)
	at app//org.eclipse.jetty.server.Server.handle(Server.java:516)
	at app//org.eclipse.jetty.server.HttpChannel.lambda$handle$1(HttpChannel.java:400)
	at app//org.eclipse.jetty.server.HttpChannel.dispatch(HttpChannel.java:645)
	at app//org.eclipse.jetty.server.HttpChannel.handle(HttpChannel.java:392)
	at app//org.eclipse.jetty.server.HttpChannel.run(HttpChannel.java:352)
	at app//org.eclipse.jetty.util.thread.QueuedThreadPool.runJob(QueuedThreadPool.java:883)
	at app//org.eclipse.jetty.util.thread.QueuedThreadPool$Runner.run(QueuedThreadPool.java:1034)
	at java.base@11.0.12/java.lang.Thread.run(Thread.java:834)
Caused by: java.lang.AssertionError: Directory not closed: MockDirectoryWrapper(ByteBuffersDirectory@47b19120 lockFactory=org.apache.lucene.store.SingleInstanceLockFactory@408555b)
	at org.junit.Assert.fail(Assert.java:89)
	at org.apache.lucene.util.CloseableDirectory.close(CloseableDirectory.java:43)
	at com.carrotsearch.randomizedtesting.RandomizedRunner$4$1.apply(RandomizedRunner.java:788)
	at com.carrotsearch.randomizedtesting.RandomizedRunner$4$1.apply(RandomizedRunner.java:785)
	at com.carrotsearch.randomizedtesting.RandomizedContext.closeResources(RandomizedContext.java:225)
	at com.carrotsearch.randomizedtesting.RandomizedRunner$4.afterAlways(RandomizedRunner.java:801)
	at com.carrotsearch.randomizedtesting.rules.StatementAdapter.evaluate(StatementAdapter.java:43)
	at com.carrotsearch.randomizedtesting.ThreadLeakControl$StatementRunner.run(ThreadLeakControl.java:370)
	at com.carrotsearch.randomizedtesting.ThreadLeakControl.lambda$forkTimeoutingTask$0(ThreadLeakControl.java:826)
	... 1 more


FAILED:  org.apache.solr.schema.SchemaApiFailureTest.classMethod

Error Message:
com.carrotsearch.randomizedtesting.ResourceDisposalError: Resource in scope SUITE failed to close. Resource was registered from thread Thread[id=20022, name=qtp1751424866-20022, state=RUNNABLE, group=TGRP-SchemaApiFailureTest], registration stack trace below.

Stack Trace:
com.carrotsearch.randomizedtesting.ResourceDisposalError: Resource in scope SUITE failed to close. Resource was registered from thread Thread[id=20022, name=qtp1751424866-20022, state=RUNNABLE, group=TGRP-SchemaApiFailureTest], registration stack trace below.
	at java.base@11.0.12/java.lang.Thread.getStackTrace(Thread.java:1606)
	at app//com.carrotsearch.randomizedtesting.RandomizedContext.closeAtEnd(RandomizedContext.java:157)
	at app//org.apache.lucene.util.LuceneTestCase.closeAfterSuite(LuceneTestCase.java:798)
	at app//org.apache.lucene.util.LuceneTestCase.wrapDirectory(LuceneTestCase.java:1504)
	at app//org.apache.lucene.util.LuceneTestCase.newDirectory(LuceneTestCase.java:1368)
	at app//org.apache.lucene.util.LuceneTestCase.newDirectory(LuceneTestCase.java:1350)
	at app//org.apache.solr.core.MockDirectoryFactory.create(MockDirectoryFactory.java:51)
	at app//org.apache.solr.core.CachingDirectoryFactory.get(CachingDirectoryFactory.java:368)
	at app//org.apache.solr.core.SolrCore.getNewIndexDir(SolrCore.java:412)
	at app//org.apache.solr.core.SolrCore.initIndex(SolrCore.java:856)
	at app//org.apache.solr.core.SolrCore.<init>(SolrCore.java:1123)
	at app//org.apache.solr.core.SolrCore.<init>(SolrCore.java:1048)
	at app//org.apache.solr.core.CoreContainer.createFromDescriptor(CoreContainer.java:1560)
	at app//org.apache.solr.core.CoreContainer.create(CoreContainer.java:1426)
	at app//org.apache.solr.handler.admin.CoreAdminOperation.lambda$static$0(CoreAdminOperation.java:92)
	at app//org.apache.solr.handler.admin.CoreAdminOperation.execute(CoreAdminOperation.java:389)
	at app//org.apache.solr.handler.admin.CoreAdminHandler$CallInfo.call(CoreAdminHandler.java:411)
	at app//org.apache.solr.handler.admin.CoreAdminHandler.handleRequestBody(CoreAdminHandler.java:194)
	at app//org.apache.solr.handler.RequestHandlerBase.handleRequest(RequestHandlerBase.java:207)
	at app//org.apache.solr.servlet.HttpSolrCall.handleAdmin(HttpSolrCall.java:941)
	at app//org.apache.solr.servlet.HttpSolrCall.handleAdminRequest(HttpSolrCall.java:893)
	at app//org.apache.solr.servlet.HttpSolrCall.call(HttpSolrCall.java:584)
	at app//org.apache.solr.servlet.SolrDispatchFilter.dispatch(SolrDispatchFilter.java:239)
	at app//org.apache.solr.servlet.SolrDispatchFilter.lambda$doFilter$0(SolrDispatchFilter.java:207)
	at app//org.apache.solr.servlet.ServletUtils.traceHttpRequestExecution2(ServletUtils.java:257)
	at app//org.apache.solr.servlet.ServletUtils.rateLimitRequest(ServletUtils.java:227)
	at app//org.apache.solr.servlet.SolrDispatchFilter.doFilter(SolrDispatchFilter.java:202)
	at app//org.apache.solr.servlet.SolrDispatchFilter.doFilter(SolrDispatchFilter.java:184)
	at app//org.eclipse.jetty.servlet.FilterHolder.doFilter(FilterHolder.java:193)
	at app//org.eclipse.jetty.servlet.ServletHandler$Chain.doFilter(ServletHandler.java:1601)
	at app//org.apache.solr.client.solrj.embedded.JettySolrRunner$DebugFilter.doFilter(JettySolrRunner.java:187)
	at app//org.eclipse.jetty.servlet.FilterHolder.doFilter(FilterHolder.java:193)
	at app//org.eclipse.jetty.servlet.ServletHandler$Chain.doFilter(ServletHandler.java:1601)
	at app//org.eclipse.jetty.servlet.ServletHandler.doHandle(ServletHandler.java:548)
	at app//org.eclipse.jetty.server.handler.ScopedHandler.nextHandle(ScopedHandler.java:233)
	at app//org.eclipse.jetty.server.session.SessionHandler.doHandle(SessionHandler.java:1624)
	at app//org.eclipse.jetty.server.handler.ScopedHandler.nextHandle(ScopedHandler.java:233)
	at app//org.eclipse.jetty.server.handler.ContextHandler.doHandle(ContextHandler.java:1434)
	at app//org.eclipse.jetty.server.handler.ScopedHandler.nextScope(ScopedHandler.java:188)
	at app//org.eclipse.jetty.servlet.ServletHandler.doScope(ServletHandler.java:501)
	at app//org.eclipse.jetty.server.session.SessionHandler.doScope(SessionHandler.java:1594)
	at app//org.eclipse.jetty.server.handler.ScopedHandler.nextScope(ScopedHandler.java:186)
	at app//org.eclipse.jetty.server.handler.ContextHandler.doScope(ContextHandler.java:1349)
	at app//org.eclipse.jetty.server.handler.ScopedHandler.handle(ScopedHandler.java:141)
	at app//org.eclipse.jetty.server.handler.HandlerWrapper.handle(HandlerWrapper.java:127)
	at app//org.eclipse.jetty.rewrite.handler.RewriteHandler.handle(RewriteHandler.java:322)
	at app//org.eclipse.jetty.server.handler.gzip.GzipHandler.handle(GzipHandler.java:713)
	at app//org.eclipse.jetty.server.handler.HandlerWrapper.handle(HandlerWrapper.java:127)
	at app//org.eclipse.jetty.server.Server.handle(Server.java:516)
	at app//org.eclipse.jetty.server.HttpChannel.lambda$handle$1(HttpChannel.java:400)
	at app//org.eclipse.jetty.server.HttpChannel.dispatch(HttpChannel.java:645)
	at app//org.eclipse.jetty.server.HttpChannel.handle(HttpChannel.java:392)
	at app//org.eclipse.jetty.server.HttpChannel.run(HttpChannel.java:352)
	at app//org.eclipse.jetty.util.thread.QueuedThreadPool.runJob(QueuedThreadPool.java:883)
	at app//org.eclipse.jetty.util.thread.QueuedThreadPool$Runner.run(QueuedThreadPool.java:1034)
	at java.base@11.0.12/java.lang.Thread.run(Thread.java:834)
Caused by: java.lang.AssertionError: Directory not closed: MockDirectoryWrapper(ByteBuffersDirectory@6427a5e4 lockFactory=org.apache.lucene.store.SingleInstanceLockFactory@311e7430)
	at org.junit.Assert.fail(Assert.java:89)
	at org.apache.lucene.util.CloseableDirectory.close(CloseableDirectory.java:43)
	at com.carrotsearch.randomizedtesting.RandomizedRunner$4$1.apply(RandomizedRunner.java:788)
	at com.carrotsearch.randomizedtesting.RandomizedRunner$4$1.apply(RandomizedRunner.java:785)
	at com.carrotsearch.randomizedtesting.RandomizedContext.closeResources(RandomizedContext.java:225)
	at com.carrotsearch.randomizedtesting.RandomizedRunner$4.afterAlways(RandomizedRunner.java:801)
	at com.carrotsearch.randomizedtesting.rules.StatementAdapter.evaluate(StatementAdapter.java:43)
	at com.carrotsearch.randomizedtesting.ThreadLeakControl$StatementRunner.run(ThreadLeakControl.java:370)
	at com.carrotsearch.randomizedtesting.ThreadLeakControl.lambda$forkTimeoutingTask$0(ThreadLeakControl.java:826)
	... 1 more


FAILED:  org.apache.solr.schema.SchemaApiFailureTest.classMethod

Error Message:
com.carrotsearch.randomizedtesting.ResourceDisposalError: Resource in scope SUITE failed to close. Resource was registered from thread Thread[id=20022, name=qtp1751424866-20022, state=RUNNABLE, group=TGRP-SchemaApiFailureTest], registration stack trace below.

Stack Trace:
com.carrotsearch.randomizedtesting.ResourceDisposalError: Resource in scope SUITE failed to close. Resource was registered from thread Thread[id=20022, name=qtp1751424866-20022, state=RUNNABLE, group=TGRP-SchemaApiFailureTest], registration stack trace below.
	at java.base@11.0.12/java.lang.Thread.getStackTrace(Thread.java:1606)
	at app//com.carrotsearch.randomizedtesting.RandomizedContext.closeAtEnd(RandomizedContext.java:157)
	at app//org.apache.lucene.util.LuceneTestCase.closeAfterSuite(LuceneTestCase.java:798)
	at app//org.apache.lucene.util.LuceneTestCase.wrapDirectory(LuceneTestCase.java:1504)
	at app//org.apache.lucene.util.LuceneTestCase.newDirectory(LuceneTestCase.java:1368)
	at app//org.apache.lucene.util.LuceneTestCase.newDirectory(LuceneTestCase.java:1350)
	at app//org.apache.solr.core.MockDirectoryFactory.create(MockDirectoryFactory.java:51)
	at app//org.apache.solr.core.CachingDirectoryFactory.get(CachingDirectoryFactory.java:368)
	at app//org.apache.solr.update.SolrIndexWriter.create(SolrIndexWriter.java:108)
	at app//org.apache.solr.core.SolrCore.initIndex(SolrCore.java:895)
	at app//org.apache.solr.core.SolrCore.<init>(SolrCore.java:1123)
	at app//org.apache.solr.core.SolrCore.<init>(SolrCore.java:1048)
	at app//org.apache.solr.core.CoreContainer.createFromDescriptor(CoreContainer.java:1560)
	at app//org.apache.solr.core.CoreContainer.create(CoreContainer.java:1426)
	at app//org.apache.solr.handler.admin.CoreAdminOperation.lambda$static$0(CoreAdminOperation.java:92)
	at app//org.apache.solr.handler.admin.CoreAdminOperation.execute(CoreAdminOperation.java:389)
	at app//org.apache.solr.handler.admin.CoreAdminHandler$CallInfo.call(CoreAdminHandler.java:411)
	at app//org.apache.solr.handler.admin.CoreAdminHandler.handleRequestBody(CoreAdminHandler.java:194)
	at app//org.apache.solr.handler.RequestHandlerBase.handleRequest(RequestHandlerBase.java:207)
	at app//org.apache.solr.servlet.HttpSolrCall.handleAdmin(HttpSolrCall.java:941)
	at app//org.apache.solr.servlet.HttpSolrCall.handleAdminRequest(HttpSolrCall.java:893)
	at app//org.apache.solr.servlet.HttpSolrCall.call(HttpSolrCall.java:584)
	at app//org.apache.solr.servlet.SolrDispatchFilter.dispatch(SolrDispatchFilter.java:239)
	at app//org.apache.solr.servlet.SolrDispatchFilter.lambda$doFilter$0(SolrDispatchFilter.java:207)
	at app//org.apache.solr.servlet.ServletUtils.traceHttpRequestExecution2(ServletUtils.java:257)
	at app//org.apache.solr.servlet.ServletUtils.rateLimitRequest(ServletUtils.java:227)
	at app//org.apache.solr.servlet.SolrDispatchFilter.doFilter(SolrDispatchFilter.java:202)
	at app//org.apache.solr.servlet.SolrDispatchFilter.doFilter(SolrDispatchFilter.java:184)
	at app//org.eclipse.jetty.servlet.FilterHolder.doFilter(FilterHolder.java:193)
	at app//org.eclipse.jetty.servlet.ServletHandler$Chain.doFilter(ServletHandler.java:1601)
	at app//org.apache.solr.client.solrj.embedded.JettySolrRunner$DebugFilter.doFilter(JettySolrRunner.java:187)
	at app//org.eclipse.jetty.servlet.FilterHolder.doFilter(FilterHolder.java:193)
	at app//org.eclipse.jetty.servlet.ServletHandler$Chain.doFilter(ServletHandler.java:1601)
	at app//org.eclipse.jetty.servlet.ServletHandler.doHandle(ServletHandler.java:548)
	at app//org.eclipse.jetty.server.handler.ScopedHandler.nextHandle(ScopedHandler.java:233)
	at app//org.eclipse.jetty.server.session.SessionHandler.doHandle(SessionHandler.java:1624)
	at app//org.eclipse.jetty.server.handler.ScopedHandler.nextHandle(ScopedHandler.java:233)
	at app//org.eclipse.jetty.server.handler.ContextHandler.doHandle(ContextHandler.java:1434)
	at app//org.eclipse.jetty.server.handler.ScopedHandler.nextScope(ScopedHandler.java:188)
	at app//org.eclipse.jetty.servlet.ServletHandler.doScope(ServletHandler.java:501)
	at app//org.eclipse.jetty.server.session.SessionHandler.doScope(SessionHandler.java:1594)
	at app//org.eclipse.jetty.server.handler.ScopedHandler.nextScope(ScopedHandler.java:186)
	at app//org.eclipse.jetty.server.handler.ContextHandler.doScope(ContextHandler.java:1349)
	at app//org.eclipse.jetty.server.handler.ScopedHandler.handle(ScopedHandler.java:141)
	at app//org.eclipse.jetty.server.handler.HandlerWrapper.handle(HandlerWrapper.java:127)
	at app//org.eclipse.jetty.rewrite.handler.RewriteHandler.handle(RewriteHandler.java:322)
	at app//org.eclipse.jetty.server.handler.gzip.GzipHandler.handle(GzipHandler.java:713)
	at app//org.eclipse.jetty.server.handler.HandlerWrapper.handle(HandlerWrapper.java:127)
	at app//org.eclipse.jetty.server.Server.handle(Server.java:516)
	at app//org.eclipse.jetty.server.HttpChannel.lambda$handle$1(HttpChannel.java:400)
	at app//org.eclipse.jetty.server.HttpChannel.dispatch(HttpChannel.java:645)
	at app//org.eclipse.jetty.server.HttpChannel.handle(HttpChannel.java:392)
	at app//org.eclipse.jetty.server.HttpChannel.run(HttpChannel.java:352)
	at app//org.eclipse.jetty.util.thread.QueuedThreadPool.runJob(QueuedThreadPool.java:883)
	at app//org.eclipse.jetty.util.thread.QueuedThreadPool$Runner.run(QueuedThreadPool.java:1034)
	at java.base@11.0.12/java.lang.Thread.run(Thread.java:834)
Caused by: java.lang.AssertionError: Directory not closed: MockDirectoryWrapper(ByteBuffersDirectory@412574b5 lockFactory=org.apache.lucene.store.SingleInstanceLockFactory@249a36db)
	at org.junit.Assert.fail(Assert.java:89)
	at org.apache.lucene.util.CloseableDirectory.close(CloseableDirectory.java:43)
	at com.carrotsearch.randomizedtesting.RandomizedRunner$4$1.apply(RandomizedRunner.java:788)
	at com.carrotsearch.randomizedtesting.RandomizedRunner$4$1.apply(RandomizedRunner.java:785)
	at com.carrotsearch.randomizedtesting.RandomizedContext.closeResources(RandomizedContext.java:225)
	at com.carrotsearch.randomizedtesting.RandomizedRunner$4.afterAlways(RandomizedRunner.java:801)
	at com.carrotsearch.randomizedtesting.rules.StatementAdapter.evaluate(StatementAdapter.java:43)
	at com.carrotsearch.randomizedtesting.ThreadLeakControl$StatementRunner.run(ThreadLeakControl.java:370)
	at com.carrotsearch.randomizedtesting.ThreadLeakControl.lambda$forkTimeoutingTask$0(ThreadLeakControl.java:826)
	... 1 more


FAILED:  org.apache.solr.schema.SchemaApiFailureTest.classMethod

Error Message:
com.carrotsearch.randomizedtesting.ThreadLeakError: 2 threads leaked from SUITE scope at org.apache.solr.schema.SchemaApiFailureTest: 
   1) Thread[id=20079, name=searcherExecutor-13846-thread-1-processing-127.0.0.1:35617_solr, state=WAITING, group=TGRP-SchemaApiFailureTest]
        at java.base@11.0.12/jdk.internal.misc.Unsafe.park(Native Method)
        at java.base@11.0.12/java.util.concurrent.locks.LockSupport.park(LockSupport.java:194)
        at java.base@11.0.12/java.util.concurrent.locks.AbstractQueuedSynchronizer.parkAndCheckInterrupt(AbstractQueuedSynchronizer.java:885)
        at java.base@11.0.12/java.util.concurrent.locks.AbstractQueuedSynchronizer.doAcquireSharedInterruptibly(AbstractQueuedSynchronizer.java:1039)
        at java.base@11.0.12/java.util.concurrent.locks.AbstractQueuedSynchronizer.acquireSharedInterruptibly(AbstractQueuedSynchronizer.java:1345)
        at java.base@11.0.12/java.util.concurrent.CountDownLatch.await(CountDownLatch.java:232)
        at app//org.apache.solr.core.SolrCore.lambda$new$2(SolrCore.java:1142)
        at app//org.apache.solr.core.SolrCore$$Lambda$419/0x0000000100636c40.call(Unknown Source)
        at java.base@11.0.12/java.util.concurrent.FutureTask.run(FutureTask.java:264)
        at app//org.apache.solr.common.util.ExecutorUtil$MDCAwareThreadPoolExecutor.lambda$execute$0(ExecutorUtil.java:259)
        at app//org.apache.solr.common.util.ExecutorUtil$MDCAwareThreadPoolExecutor$$Lambda$282/0x0000000100502840.run(Unknown Source)
        at java.base@11.0.12/java.util.concurrent.ThreadPoolExecutor.runWorker(ThreadPoolExecutor.java:1128)
        at java.base@11.0.12/java.util.concurrent.ThreadPoolExecutor$Worker.run(ThreadPoolExecutor.java:628)
        at java.base@11.0.12/java.lang.Thread.run(Thread.java:834)
   2) Thread[id=20059, name=ZKEventListenerThread, state=TIMED_WAITING, group=TGRP-SchemaApiFailureTest]
        at java.base@11.0.12/java.lang.Thread.sleep(Native Method)
        at app//org.apache.solr.common.cloud.ZkCmdExecutor.retryDelay(ZkCmdExecutor.java:161)
        at app//org.apache.solr.common.cloud.ZkCmdExecutor.retryOperation(ZkCmdExecutor.java:82)
        at app//org.apache.solr.common.cloud.SolrZkClient.exists(SolrZkClient.java:368)
        at app//org.apache.solr.schema.ManagedIndexSchemaFactory.lookupZKManagedSchemaPath(ManagedIndexSchemaFactory.java:125)
        at app//org.apache.solr.schema.ZkIndexSchemaReader.<init>(ZkIndexSchemaReader.java:56)
        at app//org.apache.solr.schema.ManagedIndexSchemaFactory.inform(ManagedIndexSchemaFactory.java:537)
        at app//org.apache.solr.core.SolrResourceLoader.inform(SolrResourceLoader.java:722)
        at app//org.apache.solr.core.SolrCore.<init>(SolrCore.java:1155)
        at app//org.apache.solr.core.SolrCore.reload(SolrCore.java:780)
        at app//org.apache.solr.core.CoreContainer.reload(CoreContainer.java:1855)
        at app//org.apache.solr.core.SolrCore.lambda$getConfListener$21(SolrCore.java:3394)
        at app//org.apache.solr.core.SolrCore$$Lambda$1102/0x0000000100bb6c40.run(Unknown Source)
        at app//org.apache.solr.cloud.ZkController.lambda$fireEventListeners$18(ZkController.java:2760)
        at app//org.apache.solr.cloud.ZkController$$Lambda$1267/0x0000000100d8d840.run(Unknown Source)
        at java.base@11.0.12/java.lang.Thread.run(Thread.java:834)

Stack Trace:
com.carrotsearch.randomizedtesting.ThreadLeakError: 2 threads leaked from SUITE scope at org.apache.solr.schema.SchemaApiFailureTest: 
   1) Thread[id=20079, name=searcherExecutor-13846-thread-1-processing-127.0.0.1:35617_solr, state=WAITING, group=TGRP-SchemaApiFailureTest]
        at java.base@11.0.12/jdk.internal.misc.Unsafe.park(Native Method)
        at java.base@11.0.12/java.util.concurrent.locks.LockSupport.park(LockSupport.java:194)
        at java.base@11.0.12/java.util.concurrent.locks.AbstractQueuedSynchronizer.parkAndCheckInterrupt(AbstractQueuedSynchronizer.java:885)
        at java.base@11.0.12/java.util.concurrent.locks.AbstractQueuedSynchronizer.doAcquireSharedInterruptibly(AbstractQueuedSynchronizer.java:1039)
        at java.base@11.0.12/java.util.concurrent.locks.AbstractQueuedSynchronizer.acquireSharedInterruptibly(AbstractQueuedSynchronizer.java:1345)
        at java.base@11.0.12/java.util.concurrent.CountDownLatch.await(CountDownLatch.java:232)
        at app//org.apache.solr.core.SolrCore.lambda$new$2(SolrCore.java:1142)
        at app//org.apache.solr.core.SolrCore$$Lambda$419/0x0000000100636c40.call(Unknown Source)
        at java.base@11.0.12/java.util.concurrent.FutureTask.run(FutureTask.java:264)
        at app//org.apache.solr.common.util.ExecutorUtil$MDCAwareThreadPoolExecutor.lambda$execute$0(ExecutorUtil.java:259)
        at app//org.apache.solr.common.util.ExecutorUtil$MDCAwareThreadPoolExecutor$$Lambda$282/0x0000000100502840.run(Unknown Source)
        at java.base@11.0.12/java.util.concurrent.ThreadPoolExecutor.runWorker(ThreadPoolExecutor.java:1128)
        at java.base@11.0.12/java.util.concurrent.ThreadPoolExecutor$Worker.run(ThreadPoolExecutor.java:628)
        at java.base@11.0.12/java.lang.Thread.run(Thread.java:834)
   2) Thread[id=20059, name=ZKEventListenerThread, state=TIMED_WAITING, group=TGRP-SchemaApiFailureTest]
        at java.base@11.0.12/java.lang.Thread.sleep(Native Method)
        at app//org.apache.solr.common.cloud.ZkCmdExecutor.retryDelay(ZkCmdExecutor.java:161)
        at app//org.apache.solr.common.cloud.ZkCmdExecutor.retryOperation(ZkCmdExecutor.java:82)
        at app//org.apache.solr.common.cloud.SolrZkClient.exists(SolrZkClient.java:368)
        at app//org.apache.solr.schema.ManagedIndexSchemaFactory.lookupZKManagedSchemaPath(ManagedIndexSchemaFactory.java:125)
        at app//org.apache.solr.schema.ZkIndexSchemaReader.<init>(ZkIndexSchemaReader.java:56)
        at app//org.apache.solr.schema.ManagedIndexSchemaFactory.inform(ManagedIndexSchemaFactory.java:537)
        at app//org.apache.solr.core.SolrResourceLoader.inform(SolrResourceLoader.java:722)
        at app//org.apache.solr.core.SolrCore.<init>(SolrCore.java:1155)
        at app//org.apache.solr.core.SolrCore.reload(SolrCore.java:780)
        at app//org.apache.solr.core.CoreContainer.reload(CoreContainer.java:1855)
        at app//org.apache.solr.core.SolrCore.lambda$getConfListener$21(SolrCore.java:3394)
        at app//org.apache.solr.core.SolrCore$$Lambda$1102/0x0000000100bb6c40.run(Unknown Source)
        at app//org.apache.solr.cloud.ZkController.lambda$fireEventListeners$18(ZkController.java:2760)
        at app//org.apache.solr.cloud.ZkController$$Lambda$1267/0x0000000100d8d840.run(Unknown Source)
        at java.base@11.0.12/java.lang.Thread.run(Thread.java:834)
	at __randomizedtesting.SeedInfo.seed([57CBF4661958326B]:0)


FAILED:  org.apache.solr.client.solrj.impl.CloudSolrClientBuilderTest.classMethod

Error Message:
com.carrotsearch.randomizedtesting.ThreadLeakError: 1 thread leaked from SUITE scope at org.apache.solr.client.solrj.impl.CloudSolrClientBuilderTest: 
   1) Thread[id=438, name=h2sc-251-thread-1, state=RUNNABLE, group=TGRP-CloudSolrClientBuilderTest]
        at java.base@11.0.12/jdk.internal.misc.Unsafe.unpark(Native Method)
        at java.base@11.0.12/java.util.concurrent.locks.LockSupport.unpark(LockSupport.java:160)
        at java.base@11.0.12/java.util.concurrent.locks.AbstractQueuedSynchronizer.unparkSuccessor(AbstractQueuedSynchronizer.java:709)
        at java.base@11.0.12/java.util.concurrent.locks.AbstractQueuedSynchronizer.release(AbstractQueuedSynchronizer.java:1305)
        at java.base@11.0.12/java.util.concurrent.locks.ReentrantLock.unlock(ReentrantLock.java:439)
        at java.base@11.0.12/java.util.concurrent.ThreadPoolExecutor.tryTerminate(ThreadPoolExecutor.java:726)
        at java.base@11.0.12/java.util.concurrent.ThreadPoolExecutor.processWorkerExit(ThreadPoolExecutor.java:994)
        at java.base@11.0.12/java.util.concurrent.ThreadPoolExecutor.runWorker(ThreadPoolExecutor.java:1142)
        at java.base@11.0.12/java.util.concurrent.ThreadPoolExecutor$Worker.run(ThreadPoolExecutor.java:628)
        at java.base@11.0.12/java.lang.Thread.run(Thread.java:834)

Stack Trace:
com.carrotsearch.randomizedtesting.ThreadLeakError: 1 thread leaked from SUITE scope at org.apache.solr.client.solrj.impl.CloudSolrClientBuilderTest: 
   1) Thread[id=438, name=h2sc-251-thread-1, state=RUNNABLE, group=TGRP-CloudSolrClientBuilderTest]
        at java.base@11.0.12/jdk.internal.misc.Unsafe.unpark(Native Method)
        at java.base@11.0.12/java.util.concurrent.locks.LockSupport.unpark(LockSupport.java:160)
        at java.base@11.0.12/java.util.concurrent.locks.AbstractQueuedSynchronizer.unparkSuccessor(AbstractQueuedSynchronizer.java:709)
        at java.base@11.0.12/java.util.concurrent.locks.AbstractQueuedSynchronizer.release(AbstractQueuedSynchronizer.java:1305)
        at java.base@11.0.12/java.util.concurrent.locks.ReentrantLock.unlock(ReentrantLock.java:439)
        at java.base@11.0.12/java.util.concurrent.ThreadPoolExecutor.tryTerminate(ThreadPoolExecutor.java:726)
        at java.base@11.0.12/java.util.concurrent.ThreadPoolExecutor.processWorkerExit(ThreadPoolExecutor.java:994)
        at java.base@11.0.12/java.util.concurrent.ThreadPoolExecutor.runWorker(ThreadPoolExecutor.java:1142)
        at java.base@11.0.12/java.util.concurrent.ThreadPoolExecutor$Worker.run(ThreadPoolExecutor.java:628)
        at java.base@11.0.12/java.lang.Thread.run(Thread.java:834)
	at __randomizedtesting.SeedInfo.seed([57CBF4661958326B]:0)




Build Log:
[...truncated 2063 lines...]
ERROR: The following test(s) have failed:
  - org.apache.solr.client.solrj.impl.CloudSolrClientBuilderTest.classMethod (:solr:solrj)
    Test output: /home/jenkins/jenkins-slave/workspace/Solr/Solr-Check-9.0/solr/solrj/build/test-results/test/outputs/OUTPUT-org.apache.solr.client.solrj.impl.CloudSolrClientBuilderTest.txt
    Reproduce with: gradlew :solr:solrj:test --tests "org.apache.solr.client.solrj.impl.CloudSolrClientBuilderTest.classMethod" -Ptests.jvms=4 -Ptests.haltonfailure=false -Ptests.jvmargs=-XX:TieredStopAtLevel=1 -Ptests.seed=57CBF4661958326B -Ptests.multiplier=2 -Ptests.badapples=false -Ptests.file.encoding=ISO-8859-1

  - org.apache.solr.schema.SchemaApiFailureTest.classMethod (:solr:core)
    Test output: /home/jenkins/jenkins-slave/workspace/Solr/Solr-Check-9.0/solr/core/build/test-results/test/outputs/OUTPUT-org.apache.solr.schema.SchemaApiFailureTest.txt
    Reproduce with: gradlew :solr:core:test --tests "org.apache.solr.schema.SchemaApiFailureTest.classMethod" -Ptests.jvms=4 -Ptests.haltonfailure=false -Ptests.jvmargs=-XX:TieredStopAtLevel=1 -Ptests.seed=57CBF4661958326B -Ptests.multiplier=2 -Ptests.badapples=false -Ptests.file.encoding=ISO-8859-1

  - org.apache.solr.schema.SchemaApiFailureTest.classMethod (:solr:core)
    Test output: /home/jenkins/jenkins-slave/workspace/Solr/Solr-Check-9.0/solr/core/build/test-results/test/outputs/OUTPUT-org.apache.solr.schema.SchemaApiFailureTest.txt
    Reproduce with: gradlew :solr:core:test --tests "org.apache.solr.schema.SchemaApiFailureTest.classMethod" -Ptests.jvms=4 -Ptests.haltonfailure=false -Ptests.jvmargs=-XX:TieredStopAtLevel=1 -Ptests.seed=57CBF4661958326B -Ptests.multiplier=2 -Ptests.badapples=false -Ptests.file.encoding=ISO-8859-1

  - org.apache.solr.schema.SchemaApiFailureTest.classMethod (:solr:core)
    Test output: /home/jenkins/jenkins-slave/workspace/Solr/Solr-Check-9.0/solr/core/build/test-results/test/outputs/OUTPUT-org.apache.solr.schema.SchemaApiFailureTest.txt
    Reproduce with: gradlew :solr:core:test --tests "org.apache.solr.schema.SchemaApiFailureTest.classMethod" -Ptests.jvms=4 -Ptests.haltonfailure=false -Ptests.jvmargs=-XX:TieredStopAtLevel=1 -Ptests.seed=57CBF4661958326B -Ptests.multiplier=2 -Ptests.badapples=false -Ptests.file.encoding=ISO-8859-1

  - org.apache.solr.schema.SchemaApiFailureTest.classMethod (:solr:core)
    Test output: /home/jenkins/jenkins-slave/workspace/Solr/Solr-Check-9.0/solr/core/build/test-results/test/outputs/OUTPUT-org.apache.solr.schema.SchemaApiFailureTest.txt
    Reproduce with: gradlew :solr:core:test --tests "org.apache.solr.schema.SchemaApiFailureTest.classMethod" -Ptests.jvms=4 -Ptests.haltonfailure=false -Ptests.jvmargs=-XX:TieredStopAtLevel=1 -Ptests.seed=57CBF4661958326B -Ptests.multiplier=2 -Ptests.badapples=false -Ptests.file.encoding=ISO-8859-1


Deprecated Gradle features were used in this build, making it incompatible with Gradle 8.0.

You can use '--warning-mode all' to show the individual deprecation warnings and determine if they come from your own scripts or plugins.

See https://docs.gradle.org/7.2/userguide/command_line_interface.html#sec:command_line_warnings

BUILD SUCCESSFUL in 52m 29s
531 actionable tasks: 531 executed
Build step 'Invoke Gradle script' changed build result to SUCCESS
Archiving artifacts
hudson.FilePath$ValidateAntFileMask$1Cancel
	at hudson.FilePath$ValidateAntFileMask$1.isCaseSensitive(FilePath.java:3209)
	at org.apache.tools.ant.DirectoryScanner.lambda$isIncluded$3(DirectoryScanner.java:1374)
	at java.base/java.util.stream.MatchOps$1MatchSink.accept(MatchOps.java:90)
	at java.base/java.util.Spliterators$ArraySpliterator.tryAdvance(Spliterators.java:958)
	at java.base/java.util.stream.ReferencePipeline.forEachWithCancel(ReferencePipeline.java:127)
	at java.base/java.util.stream.AbstractPipeline.copyIntoWithCancel(AbstractPipeline.java:502)
	at java.base/java.util.stream.AbstractPipeline.copyInto(AbstractPipeline.java:488)
	at java.base/java.util.stream.AbstractPipeline.wrapAndCopyInto(AbstractPipeline.java:474)
	at java.base/java.util.stream.MatchOps$MatchOp.evaluateSequential(MatchOps.java:230)
	at java.base/java.util.stream.MatchOps$MatchOp.evaluateSequential(MatchOps.java:196)
	at java.base/java.util.stream.AbstractPipeline.evaluate(AbstractPipeline.java:234)
	at java.base/java.util.stream.ReferencePipeline.anyMatch(ReferencePipeline.java:528)
	at org.apache.tools.ant.DirectoryScanner.isIncluded(DirectoryScanner.java:1374)
	at org.apache.tools.ant.DirectoryScanner.scandir(DirectoryScanner.java:1241)
	at org.apache.tools.ant.DirectoryScanner.scandir(DirectoryScanner.java:1267)
	at org.apache.tools.ant.DirectoryScanner.scandir(DirectoryScanner.java:1267)
	at org.apache.tools.ant.DirectoryScanner.scandir(DirectoryScanner.java:1267)
	at org.apache.tools.ant.DirectoryScanner.scandir(DirectoryScanner.java:1267)
	at org.apache.tools.ant.DirectoryScanner.scandir(DirectoryScanner.java:1267)
	at org.apache.tools.ant.DirectoryScanner.scandir(DirectoryScanner.java:1267)
	at org.apache.tools.ant.DirectoryScanner.scandir(DirectoryScanner.java:1267)
	at org.apache.tools.ant.DirectoryScanner.scandir(DirectoryScanner.java:1267)
	at org.apache.tools.ant.DirectoryScanner.scandir(DirectoryScanner.java:1267)
	at org.apache.tools.ant.DirectoryScanner.scandir(DirectoryScanner.java:1267)
	at org.apache.tools.ant.DirectoryScanner.scandir(DirectoryScanner.java:1194)
	at org.apache.tools.ant.DirectoryScanner.scandir(DirectoryScanner.java:1156)
	at org.apache.tools.ant.DirectoryScanner.checkIncludePatterns(DirectoryScanner.java:954)
	at org.apache.tools.ant.DirectoryScanner.scan(DirectoryScanner.java:912)
	at hudson.FilePath$ValidateAntFileMask.hasMatch(FilePath.java:3222)
Caused: java.lang.InterruptedException: no matches found within 10000
	at hudson.FilePath$ValidateAntFileMask.hasMatch(FilePath.java:3227)
	at hudson.FilePath$ValidateAntFileMask.invoke(FilePath.java:3105)
	at hudson.FilePath$ValidateAntFileMask.invoke(FilePath.java:3083)
	at hudson.FilePath$FileCallableWrapper.call(FilePath.java:3487)
Also:   hudson.remoting.Channel$CallSiteStackTrace: Remote call to lucene-solr-2
		at hudson.remoting.Channel.attachCallSiteStackTrace(Channel.java:1784)
		at hudson.remoting.UserRequest$ExceptionResponse.retrieve(UserRequest.java:356)
		at hudson.remoting.Channel.call(Channel.java:1000)
		at hudson.FilePath.act(FilePath.java:1194)
		at hudson.FilePath.act(FilePath.java:1183)
		at hudson.FilePath.validateAntFileMask(FilePath.java:3080)
		at hudson.tasks.ArtifactArchiver.perform(ArtifactArchiver.java:269)
		at hudson.tasks.BuildStepCompatibilityLayer.perform(BuildStepCompatibilityLayer.java:79)
		at hudson.tasks.BuildStepMonitor$1.perform(BuildStepMonitor.java:20)
		at hudson.model.AbstractBuild$AbstractBuildExecution.perform(AbstractBuild.java:814)
		at hudson.model.AbstractBuild$AbstractBuildExecution.performAllBuildSteps(AbstractBuild.java:763)
		at hudson.model.Build$BuildExecution.post2(Build.java:179)
		at hudson.model.AbstractBuild$AbstractBuildExecution.post(AbstractBuild.java:707)
		at hudson.model.Run.execute(Run.java:1921)
		at hudson.model.FreeStyleBuild.run(FreeStyleBuild.java:44)
		at hudson.model.ResourceController.execute(ResourceController.java:101)
		at hudson.model.Executor.run(Executor.java:442)
Caused: hudson.FilePath$TunneledInterruptedException
	at hudson.FilePath$FileCallableWrapper.call(FilePath.java:3489)
	at hudson.remoting.UserRequest.perform(UserRequest.java:211)
	at hudson.remoting.UserRequest.perform(UserRequest.java:54)
	at hudson.remoting.Request$2.run(Request.java:376)
	at hudson.remoting.InterceptingExecutorService.lambda$wrap$0(InterceptingExecutorService.java:78)
	at java.base/java.util.concurrent.FutureTask.run(FutureTask.java:264)
	at java.base/java.util.concurrent.ThreadPoolExecutor.runWorker(ThreadPoolExecutor.java:1128)
	at java.base/java.util.concurrent.ThreadPoolExecutor$Worker.run(ThreadPoolExecutor.java:628)
	at java.base/java.lang.Thread.run(Thread.java:834)
Caused: java.lang.InterruptedException: java.lang.InterruptedException: no matches found within 10000
	at hudson.FilePath.act(FilePath.java:1196)
	at hudson.FilePath.act(FilePath.java:1183)
	at hudson.FilePath.validateAntFileMask(FilePath.java:3080)
	at hudson.tasks.ArtifactArchiver.perform(ArtifactArchiver.java:269)
	at hudson.tasks.BuildStepCompatibilityLayer.perform(BuildStepCompatibilityLayer.java:79)
	at hudson.tasks.BuildStepMonitor$1.perform(BuildStepMonitor.java:20)
	at hudson.model.AbstractBuild$AbstractBuildExecution.perform(AbstractBuild.java:814)
	at hudson.model.AbstractBuild$AbstractBuildExecution.performAllBuildSteps(AbstractBuild.java:763)
	at hudson.model.Build$BuildExecution.post2(Build.java:179)
	at hudson.model.AbstractBuild$AbstractBuildExecution.post(AbstractBuild.java:707)
	at hudson.model.Run.execute(Run.java:1921)
	at hudson.model.FreeStyleBuild.run(FreeStyleBuild.java:44)
	at hudson.model.ResourceController.execute(ResourceController.java:101)
	at hudson.model.Executor.run(Executor.java:442)
No artifacts found that match the file pattern "**/*.events,heapdumps/**,**/hs_err_pid*". Configuration error?
Recording test results
[Checks API] No suitable checks publisher found.
Build step 'Publish JUnit test result report' changed build result to UNSTABLE
Email was triggered for: Unstable (Test Failures)
Sending email for trigger: Unstable (Test Failures)