You are viewing a plain text version of this content. The canonical link for it is here.
Posted to commits@activemq.apache.org by Apache Jenkins Server <je...@builds.apache.org> on 2020/05/24 07:42:36 UTC
Jenkins build is still unstable: ActiveMQ-Java8-5.15.x » ActiveMQ :: Unit Tests #505
See <https://builds.apache.org/job/ActiveMQ-Java8-5.15.x/org.apache.activemq$activemq-unit-tests/505/display/redirect>
Jenkins build is still unstable: ActiveMQ-Java8-5.15.x » ActiveMQ :: Unit Tests #516
Posted by Apache Jenkins Server <je...@builds.apache.org>.
See <https://builds.apache.org/job/ActiveMQ-Java8-5.15.x/org.apache.activemq$activemq-unit-tests/516/display/redirect>
Jenkins build is still unstable: ActiveMQ-Java8-5.15.x » ActiveMQ :: Unit Tests #515
Posted by Apache Jenkins Server <je...@builds.apache.org>.
See <https://builds.apache.org/job/ActiveMQ-Java8-5.15.x/org.apache.activemq$activemq-unit-tests/515/display/redirect>
Jenkins build is still unstable: ActiveMQ-Java8-5.15.x » ActiveMQ :: Unit Tests #514
Posted by Apache Jenkins Server <je...@builds.apache.org>.
See <https://builds.apache.org/job/ActiveMQ-Java8-5.15.x/org.apache.activemq$activemq-unit-tests/514/display/redirect>
Jenkins build is still unstable: ActiveMQ-Java8-5.15.x » ActiveMQ :: Unit Tests #513
Posted by Apache Jenkins Server <je...@builds.apache.org>.
See <https://builds.apache.org/job/ActiveMQ-Java8-5.15.x/org.apache.activemq$activemq-unit-tests/513/display/redirect>
Jenkins build is still unstable: ActiveMQ-Java8-5.15.x » ActiveMQ :: Unit Tests #512
Posted by Apache Jenkins Server <je...@builds.apache.org>.
See <https://builds.apache.org/job/ActiveMQ-Java8-5.15.x/org.apache.activemq$activemq-unit-tests/512/display/redirect>
Jenkins build is still unstable: ActiveMQ-Java8-5.15.x » ActiveMQ :: Unit Tests #511
Posted by Apache Jenkins Server <je...@builds.apache.org>.
See <https://builds.apache.org/job/ActiveMQ-Java8-5.15.x/org.apache.activemq$activemq-unit-tests/511/display/redirect>
Jenkins build is still unstable: ActiveMQ-Java8-5.15.x » ActiveMQ :: Unit Tests #510
Posted by Apache Jenkins Server <je...@builds.apache.org>.
See <https://builds.apache.org/job/ActiveMQ-Java8-5.15.x/org.apache.activemq$activemq-unit-tests/510/display/redirect>
Jenkins build is unstable: ActiveMQ-Java8-5.15.x » ActiveMQ :: Unit Tests #509
Posted by Apache Jenkins Server <je...@builds.apache.org>.
See <https://builds.apache.org/job/ActiveMQ-Java8-5.15.x/org.apache.activemq$activemq-unit-tests/509/display/redirect>
Build failed in Jenkins: ActiveMQ-Java8-5.15.x » ActiveMQ :: Unit Tests #508
Posted by Apache Jenkins Server <je...@builds.apache.org>.
See <https://builds.apache.org/job/ActiveMQ-Java8-5.15.x/org.apache.activemq$activemq-unit-tests/508/display/redirect>
Changes:
------------------------------------------
[...truncated 129.80 KB...]
[INFO] Tests run: 2, Failures: 0, Errors: 0, Skipped: 0, Time elapsed: 1.165 s - in org.apache.activemq.usecases.AMQ6446Test
[INFO] Running org.apache.activemq.usecases.AMQ6477Test
[INFO] Tests run: 4, Failures: 0, Errors: 0, Skipped: 0, Time elapsed: 2.618 s - in org.apache.activemq.usecases.AMQ6477Test
[INFO] Running org.apache.activemq.usecases.AdvisoryTopicDeletionTest
[INFO] Tests run: 2, Failures: 0, Errors: 0, Skipped: 0, Time elapsed: 1.229 s - in org.apache.activemq.usecases.AdvisoryTopicDeletionTest
[INFO] Running org.apache.activemq.usecases.AdvisoryViaNetworkTest
[INFO] Tests run: 10, Failures: 0, Errors: 0, Skipped: 0, Time elapsed: 24.628 s - in org.apache.activemq.usecases.AdvisoryViaNetworkTest
[INFO] Running org.apache.activemq.usecases.AuthorizationFromAdminViewTest
[INFO] Tests run: 1, Failures: 0, Errors: 0, Skipped: 0, Time elapsed: 1.039 s - in org.apache.activemq.usecases.AuthorizationFromAdminViewTest
[INFO] Running org.apache.activemq.usecases.BacklogNetworkCrossTalkTest
[INFO] Tests run: 1, Failures: 0, Errors: 0, Skipped: 0, Time elapsed: 153.682 s - in org.apache.activemq.usecases.BacklogNetworkCrossTalkTest
[INFO] Running org.apache.activemq.usecases.BatchedMessagePriorityConsumerTest
[INFO] Tests run: 2, Failures: 0, Errors: 0, Skipped: 0, Time elapsed: 3.281 s - in org.apache.activemq.usecases.BatchedMessagePriorityConsumerTest
[INFO] Running org.apache.activemq.usecases.BrokerQueueNetworkWithDisconnectTest
[INFO] Tests run: 4, Failures: 0, Errors: 0, Skipped: 0, Time elapsed: 85.847 s - in org.apache.activemq.usecases.BrokerQueueNetworkWithDisconnectTest
[INFO] Running org.apache.activemq.usecases.BrowseDLQTest
[INFO] Tests run: 1, Failures: 0, Errors: 0, Skipped: 0, Time elapsed: 6.756 s - in org.apache.activemq.usecases.BrowseDLQTest
[INFO] Running org.apache.activemq.usecases.ChangeSentMessageTest
[INFO] Tests run: 1, Failures: 0, Errors: 0, Skipped: 0, Time elapsed: 1.28 s - in org.apache.activemq.usecases.ChangeSentMessageTest
[INFO] Running org.apache.activemq.usecases.ChangeSessionDeliveryModeTest
[INFO] Tests run: 1, Failures: 0, Errors: 0, Skipped: 0, Time elapsed: 1.137 s - in org.apache.activemq.usecases.ChangeSessionDeliveryModeTest
[INFO] Running org.apache.activemq.usecases.CompositeConsumeTest
[INFO] Tests run: 1, Failures: 0, Errors: 0, Skipped: 0, Time elapsed: 1.181 s - in org.apache.activemq.usecases.CompositeConsumeTest
[INFO] Running org.apache.activemq.usecases.ConsumeQueuePrefetchTest
[INFO] Tests run: 4, Failures: 0, Errors: 0, Skipped: 0, Time elapsed: 1.468 s - in org.apache.activemq.usecases.ConsumeQueuePrefetchTest
[INFO] Running org.apache.activemq.usecases.ConsumeTopicPrefetchTest
[INFO] Tests run: 3, Failures: 0, Errors: 0, Skipped: 0, Time elapsed: 1.352 s - in org.apache.activemq.usecases.ConsumeTopicPrefetchTest
[INFO] Running org.apache.activemq.usecases.CreateTemporaryQueueBeforeStartTest
[INFO] Tests run: 3, Failures: 0, Errors: 0, Skipped: 0, Time elapsed: 1.251 s - in org.apache.activemq.usecases.CreateTemporaryQueueBeforeStartTest
[INFO] Running org.apache.activemq.usecases.DuplexAdvisoryRaceTest
[INFO] Tests run: 1, Failures: 0, Errors: 0, Skipped: 0, Time elapsed: 207.599 s - in org.apache.activemq.usecases.DuplexAdvisoryRaceTest
[INFO] Running org.apache.activemq.usecases.DurableRedeliveryTest
[INFO] Tests run: 1, Failures: 0, Errors: 0, Skipped: 0, Time elapsed: 1.35 s - in org.apache.activemq.usecases.DurableRedeliveryTest
[INFO] Running org.apache.activemq.usecases.DurableSubCacheTest
[INFO] Tests run: 2, Failures: 0, Errors: 0, Skipped: 0, Time elapsed: 3.375 s - in org.apache.activemq.usecases.DurableSubCacheTest
[INFO] Running org.apache.activemq.usecases.DurableSubInBrokerNetworkTest
[INFO] Tests run: 2, Failures: 0, Errors: 0, Skipped: 0, Time elapsed: 1.738 s - in org.apache.activemq.usecases.DurableSubInBrokerNetworkTest
[INFO] Running org.apache.activemq.usecases.DurableSubProcessConcurrentCommitActivateNoDuplicateTest
[WARNING] Tests run: 1, Failures: 0, Errors: 0, Skipped: 1, Time elapsed: 0.075 s - in org.apache.activemq.usecases.DurableSubProcessConcurrentCommitActivateNoDuplicateTest
[INFO] Running org.apache.activemq.usecases.DurableSubProcessWithRestartTest
[WARNING] Tests run: 1, Failures: 0, Errors: 0, Skipped: 1, Time elapsed: 0.076 s - in org.apache.activemq.usecases.DurableSubProcessWithRestartTest
[INFO] Running org.apache.activemq.usecases.DurableSubsOfflineSelectorConcurrentConsumeIndexUseTest
[INFO] Tests run: 1, Failures: 0, Errors: 0, Skipped: 0, Time elapsed: 208.705 s - in org.apache.activemq.usecases.DurableSubsOfflineSelectorConcurrentConsumeIndexUseTest
[INFO] Running org.apache.activemq.usecases.DurableSubsOfflineSelectorIndexUseTest
[INFO] Tests run: 3, Failures: 0, Errors: 0, Skipped: 0, Time elapsed: 53.341 s - in org.apache.activemq.usecases.DurableSubsOfflineSelectorIndexUseTest
[INFO] Running org.apache.activemq.usecases.DurableSubscriberWithNetworkRestartTest
[INFO] Tests run: 2, Failures: 0, Errors: 0, Skipped: 0, Time elapsed: 14.524 s - in org.apache.activemq.usecases.DurableSubscriberWithNetworkRestartTest
[INFO] Running org.apache.activemq.usecases.DurableSubscriptionOffline1Test
[INFO] Tests run: 18, Failures: 0, Errors: 0, Skipped: 0, Time elapsed: 174.606 s - in org.apache.activemq.usecases.DurableSubscriptionOffline1Test
[INFO] Running org.apache.activemq.usecases.DurableSubscriptionOffline2Test
[INFO] Tests run: 2, Failures: 0, Errors: 0, Skipped: 0, Time elapsed: 4.907 s - in org.apache.activemq.usecases.DurableSubscriptionOffline2Test
[INFO] Running org.apache.activemq.usecases.DurableSubscriptionOffline3Test
[INFO] Tests run: 12, Failures: 0, Errors: 0, Skipped: 0, Time elapsed: 162.576 s - in org.apache.activemq.usecases.DurableSubscriptionOffline3Test
[INFO] Running org.apache.activemq.usecases.DurableSubscriptionOffline4Test
[INFO] Tests run: 2, Failures: 0, Errors: 0, Skipped: 0, Time elapsed: 19.659 s - in org.apache.activemq.usecases.DurableSubscriptionOffline4Test
[INFO] Running org.apache.activemq.usecases.DurableSubscriptionOfflineBrowseRemoveTest
[INFO] Tests run: 4, Failures: 0, Errors: 0, Skipped: 0, Time elapsed: 20.242 s - in org.apache.activemq.usecases.DurableSubscriptionOfflineBrowseRemoveTest
[INFO] Running org.apache.activemq.usecases.DurableSubscriptionUpdatesTest
[INFO] Tests run: 3, Failures: 0, Errors: 0, Skipped: 0, Time elapsed: 10.18 s - in org.apache.activemq.usecases.DurableSubscriptionUpdatesTest
[INFO] Running org.apache.activemq.usecases.DurableSubscriptionWithNoLocalTest
[INFO] Tests run: 14, Failures: 0, Errors: 0, Skipped: 0, Time elapsed: 48.195 s - in org.apache.activemq.usecases.DurableSubscriptionWithNoLocalTest
[INFO] Running org.apache.activemq.usecases.ExceptionListenerTest
[INFO] Tests run: 2, Failures: 0, Errors: 0, Skipped: 0, Time elapsed: 1.066 s - in org.apache.activemq.usecases.ExceptionListenerTest
[INFO] Running org.apache.activemq.usecases.LevelDBDurableSubscriptionTest
[INFO] Tests run: 12, Failures: 0, Errors: 0, Skipped: 0, Time elapsed: 32.569 s - in org.apache.activemq.usecases.LevelDBDurableSubscriptionTest
[INFO] Running org.apache.activemq.usecases.ManagedDurableSubscriptionTest
[INFO] Tests run: 1, Failures: 0, Errors: 0, Skipped: 0, Time elapsed: 2.586 s - in org.apache.activemq.usecases.ManagedDurableSubscriptionTest
[INFO] Running org.apache.activemq.usecases.MemoryLimitTest
[WARNING] Tests run: 9, Failures: 0, Errors: 0, Skipped: 3, Time elapsed: 324.523 s - in org.apache.activemq.usecases.MemoryLimitTest
[INFO] Running org.apache.activemq.usecases.MessageGroupLateArrivalsTest
[INFO] Tests run: 2, Failures: 0, Errors: 0, Skipped: 0, Time elapsed: 2.178 s - in org.apache.activemq.usecases.MessageGroupLateArrivalsTest
[INFO] Running org.apache.activemq.usecases.MessageGroupReconnectDistributionTest
[INFO] Tests run: 2, Failures: 0, Errors: 0, Skipped: 0, Time elapsed: 30.091 s - in org.apache.activemq.usecases.MessageGroupReconnectDistributionTest
[INFO] Running org.apache.activemq.usecases.NetworkBrokerNameColonTest
[INFO] Tests run: 1, Failures: 0, Errors: 0, Skipped: 0, Time elapsed: 1.746 s - in org.apache.activemq.usecases.NetworkBrokerNameColonTest
[INFO] Running org.apache.activemq.usecases.NewConsumerCreatesDestinationTest
[INFO] Tests run: 1, Failures: 0, Errors: 0, Skipped: 0, Time elapsed: 1.195 s - in org.apache.activemq.usecases.NewConsumerCreatesDestinationTest
[INFO] Running org.apache.activemq.usecases.ObjectMessageNotSerializableTest
[INFO] Tests run: 2, Failures: 0, Errors: 0, Skipped: 0, Time elapsed: 1.205 s - in org.apache.activemq.usecases.ObjectMessageNotSerializableTest
[INFO] Running org.apache.activemq.usecases.ObjectSerializationTest
[INFO] Tests run: 1, Failures: 0, Errors: 0, Skipped: 0, Time elapsed: 1.143 s - in org.apache.activemq.usecases.ObjectSerializationTest
[INFO] Running org.apache.activemq.usecases.OfflineDurableSubscriberTimeoutTest
[INFO] Tests run: 1, Failures: 0, Errors: 0, Skipped: 0, Time elapsed: 11.621 s - in org.apache.activemq.usecases.OfflineDurableSubscriberTimeoutTest
[INFO] Running org.apache.activemq.usecases.PriorityRedeliveryOrderTest
[INFO] Tests run: 1, Failures: 0, Errors: 0, Skipped: 0, Time elapsed: 28.715 s - in org.apache.activemq.usecases.PriorityRedeliveryOrderTest
[INFO] Running org.apache.activemq.usecases.PublishOnDurableTopicConsumedMessageTest
[INFO] Tests run: 1, Failures: 0, Errors: 0, Skipped: 0, Time elapsed: 1.345 s - in org.apache.activemq.usecases.PublishOnDurableTopicConsumedMessageTest
[INFO] Running org.apache.activemq.usecases.PublishOnQueueConsumedMessageTest
[INFO] Tests run: 1, Failures: 0, Errors: 0, Skipped: 0, Time elapsed: 1.387 s - in org.apache.activemq.usecases.PublishOnQueueConsumedMessageTest
[INFO] Running org.apache.activemq.usecases.PublishOnTemporaryQueueConsumedMessageTest
[INFO] Tests run: 1, Failures: 0, Errors: 0, Skipped: 0, Time elapsed: 1.331 s - in org.apache.activemq.usecases.PublishOnTemporaryQueueConsumedMessageTest
[INFO] Running org.apache.activemq.usecases.QueueBrowsingLevelDBTest
[INFO] Tests run: 3, Failures: 0, Errors: 0, Skipped: 0, Time elapsed: 32.469 s - in org.apache.activemq.usecases.QueueBrowsingLevelDBTest
[INFO] Running org.apache.activemq.usecases.QueueBrowsingLimitTest
[INFO] Tests run: 1, Failures: 0, Errors: 0, Skipped: 0, Time elapsed: 14.178 s - in org.apache.activemq.usecases.QueueBrowsingLimitTest
[INFO] Running org.apache.activemq.usecases.QueueBrowsingTest
[INFO] Tests run: 3, Failures: 0, Errors: 0, Skipped: 0, Time elapsed: 33.16 s - in org.apache.activemq.usecases.QueueBrowsingTest
[INFO] Running org.apache.activemq.usecases.QueueOrderSingleTransactedConsumerTest
[INFO] Tests run: 4, Failures: 0, Errors: 0, Skipped: 0, Time elapsed: 5.938 s - in org.apache.activemq.usecases.QueueOrderSingleTransactedConsumerTest
[INFO] Running org.apache.activemq.usecases.QueueRepeaterTest
[INFO] Tests run: 1, Failures: 0, Errors: 0, Skipped: 0, Time elapsed: 1.217 s - in org.apache.activemq.usecases.QueueRepeaterTest
[INFO] Running org.apache.activemq.usecases.QueueZeroPrefetchLazyDispatchPriorityTest
[WARNING] Tests run: 5, Failures: 0, Errors: 0, Skipped: 1, Time elapsed: 15.995 s - in org.apache.activemq.usecases.QueueZeroPrefetchLazyDispatchPriorityTest
[INFO] Running org.apache.activemq.usecases.RequestReplyTempDestRemovalAdvisoryRaceTest
[INFO] Tests run: 8, Failures: 0, Errors: 0, Skipped: 0, Time elapsed: 118.187 s - in org.apache.activemq.usecases.RequestReplyTempDestRemovalAdvisoryRaceTest
[INFO] Running org.apache.activemq.usecases.RequestReplyToTopicViaThreeNetworkHopsTest
[INFO] Tests run: 1, Failures: 0, Errors: 0, Skipped: 0, Time elapsed: 11.674 s - in org.apache.activemq.usecases.RequestReplyToTopicViaThreeNetworkHopsTest
[INFO] Running org.apache.activemq.usecases.SingleBrokerVirtualDestinationsWithWildcardLevelDBTest
[INFO] Tests run: 4, Failures: 0, Errors: 0, Skipped: 0, Time elapsed: 45.433 s - in org.apache.activemq.usecases.SingleBrokerVirtualDestinationsWithWildcardLevelDBTest
[INFO] Running org.apache.activemq.usecases.StartAndConcurrentStopBrokerTest
[INFO] Tests run: 1, Failures: 0, Errors: 0, Skipped: 0, Time elapsed: 2.543 s - in org.apache.activemq.usecases.StartAndConcurrentStopBrokerTest
[INFO] Running org.apache.activemq.usecases.SubscribeClosePublishThenConsumeTest
[INFO] Tests run: 1, Failures: 0, Errors: 0, Skipped: 0, Time elapsed: 1.841 s - in org.apache.activemq.usecases.SubscribeClosePublishThenConsumeTest
[INFO] Running org.apache.activemq.usecases.ThreeBrokerTempDestDemandSubscriptionCleanupTest
[INFO] Tests run: 2, Failures: 0, Errors: 0, Skipped: 0, Time elapsed: 7.028 s - in org.apache.activemq.usecases.ThreeBrokerTempDestDemandSubscriptionCleanupTest
[INFO] Running org.apache.activemq.usecases.ThreeBrokerVirtualTopicNetworkLevelDBTest
[INFO] Tests run: 1, Failures: 0, Errors: 0, Skipped: 0, Time elapsed: 24.338 s - in org.apache.activemq.usecases.ThreeBrokerVirtualTopicNetworkLevelDBTest
[INFO] Running org.apache.activemq.usecases.TopicDurableConnectStatsTest
[INFO] Tests run: 1, Failures: 0, Errors: 0, Skipped: 0, Time elapsed: 4.025 s - in org.apache.activemq.usecases.TopicDurableConnectStatsTest
[INFO] Running org.apache.activemq.usecases.TopicProducerDurableSubFlowControlTest
[INFO] Tests run: 1, Failures: 0, Errors: 0, Skipped: 0, Time elapsed: 149.239 s - in org.apache.activemq.usecases.TopicProducerDurableSubFlowControlTest
[INFO] Running org.apache.activemq.usecases.TopicProducerToSubFileCursorTest
[INFO] Tests run: 1, Failures: 0, Errors: 0, Skipped: 0, Time elapsed: 22.881 s - in org.apache.activemq.usecases.TopicProducerToSubFileCursorTest
[INFO] Running org.apache.activemq.usecases.TopicSubscriptionZeroPrefetchTest
[INFO] Tests run: 11, Failures: 0, Errors: 0, Skipped: 0, Time elapsed: 9.201 s - in org.apache.activemq.usecases.TopicSubscriptionZeroPrefetchTest
[INFO] Running org.apache.activemq.usecases.TransactionRollbackOrderTest
[INFO] Tests run: 1, Failures: 0, Errors: 0, Skipped: 0, Time elapsed: 2.212 s - in org.apache.activemq.usecases.TransactionRollbackOrderTest
[INFO] Running org.apache.activemq.usecases.TransactionTest
[INFO] Tests run: 1, Failures: 0, Errors: 0, Skipped: 0, Time elapsed: 1.231 s - in org.apache.activemq.usecases.TransactionTest
[INFO] Running org.apache.activemq.usecases.TwoBrokerDurableForwardStaticRestartTest
[INFO] Tests run: 1, Failures: 0, Errors: 0, Skipped: 0, Time elapsed: 16.445 s - in org.apache.activemq.usecases.TwoBrokerDurableForwardStaticRestartTest
[INFO] Running org.apache.activemq.usecases.TwoBrokerVirtualTopicForwardingTest
[INFO] Tests run: 3, Failures: 0, Errors: 0, Skipped: 0, Time elapsed: 18.479 s - in org.apache.activemq.usecases.TwoBrokerVirtualTopicForwardingTest
[INFO] Running org.apache.activemq.usecases.TwoBrokerVirtualTopicSelectorAwareForwardingTest
[INFO] Tests run: 6, Failures: 0, Errors: 0, Skipped: 0, Time elapsed: 45.976 s - in org.apache.activemq.usecases.TwoBrokerVirtualTopicSelectorAwareForwardingTest
[INFO] Running org.apache.activemq.usecases.TwoBrokersStopSlaveTest
[INFO] Tests run: 1, Failures: 0, Errors: 0, Skipped: 0, Time elapsed: 2.201 s - in org.apache.activemq.usecases.TwoBrokersStopSlaveTest
[INFO] Running org.apache.activemq.usecases.TwoSecureBrokerRequestReplyTest
[INFO] Tests run: 1, Failures: 0, Errors: 0, Skipped: 0, Time elapsed: 25.13 s - in org.apache.activemq.usecases.TwoSecureBrokerRequestReplyTest
[INFO] Running org.apache.activemq.usecases.VerifyNetworkConsumersDisconnectTest
[INFO] Tests run: 3, Failures: 0, Errors: 0, Skipped: 0, Time elapsed: 42.789 s - in org.apache.activemq.usecases.VerifyNetworkConsumersDisconnectTest
[INFO] Running org.apache.activemq.usecases.VirtualTopicNetworkClusterReactivationTest
[INFO] Tests run: 1, Failures: 0, Errors: 0, Skipped: 0, Time elapsed: 7.493 s - in org.apache.activemq.usecases.VirtualTopicNetworkClusterReactivationTest
[INFO] Running org.apache.activemq.util.LinkedNodeTest
[INFO] Tests run: 3, Failures: 0, Errors: 0, Skipped: 0, Time elapsed: 0.036 s - in org.apache.activemq.util.LinkedNodeTest
[INFO] Running org.apache.activemq.util.ReflectionSupportTest
[INFO] Tests run: 3, Failures: 0, Errors: 0, Skipped: 0, Time elapsed: 0.151 s - in org.apache.activemq.util.ReflectionSupportTest
[INFO] Running org.apache.activemq.xbean.DestinationBridgeAccessorsTest
[INFO] Tests run: 1, Failures: 0, Errors: 0, Skipped: 0, Time elapsed: 2.455 s - in org.apache.activemq.xbean.DestinationBridgeAccessorsTest
[INFO] Running org.apache.activemq.xbean.JDBCPersistenceAdapterXBeanConfigTest
[INFO] Tests run: 1, Failures: 0, Errors: 0, Skipped: 0, Time elapsed: 16.547 s - in org.apache.activemq.xbean.JDBCPersistenceAdapterXBeanConfigTest
[INFO] Running org.apache.activemq.xbean.ManagementContextXBeanConfigTest
[INFO] Tests run: 4, Failures: 0, Errors: 0, Skipped: 0, Time elapsed: 3.73 s - in org.apache.activemq.xbean.ManagementContextXBeanConfigTest
[INFO] Running org.apache.activemq.xbean.MultipleTestsWithEmbeddedBrokerAndPersistenceTest
[INFO] Tests run: 2, Failures: 0, Errors: 0, Skipped: 0, Time elapsed: 2.074 s - in org.apache.activemq.xbean.MultipleTestsWithEmbeddedBrokerAndPersistenceTest
[INFO] Running org.apache.activemq.xbean.MultipleTestsWithEmbeddedBrokerTest
[INFO] Tests run: 2, Failures: 0, Errors: 0, Skipped: 0, Time elapsed: 1.116 s - in org.apache.activemq.xbean.MultipleTestsWithEmbeddedBrokerTest
[INFO] Running org.apache.activemq.xbean.XBeanConfigTest
[INFO] Tests run: 1, Failures: 0, Errors: 0, Skipped: 0, Time elapsed: 1.669 s - in org.apache.activemq.xbean.XBeanConfigTest
[INFO] Running org.apache.activemq.xbean.XBeanStartFalseTest
[INFO] Tests run: 1, Failures: 0, Errors: 0, Skipped: 0, Time elapsed: 1.465 s - in org.apache.activemq.xbean.XBeanStartFalseTest
[INFO]
[INFO] Results:
[INFO]
[ERROR] Failures:
[ERROR] InMemeoryJmsSchedulerTest>JmsSchedulerTest.testScheduleFullRecoveryRestart:215->JmsSchedulerTest.testScheduleRestart:293 Didn't receive the message
[ERROR] AMQ4952Test.testConsumerBrokerRestart:248 number of messages received expected:<2> but was:<1>
[ERROR] AMQ7118Test.testCompaction:143->checkFiles:200 expected:<3> but was:<2>
[ERROR] DuplicateFromStoreTest.testDuplicateMessage:143 no messages pending, i.e. dlq empty expected:<0> but was:<17395>
[ERROR] JDBCPersistenceAdapterExpiredMessageTest.testExpiredAfterCacheExhausted:181
[ERROR] Errors:
[ERROR] InMemeoryJmsSchedulerTest>JmsSchedulerTest.testUpdatesAppliedToIndexBeforeJournalShouldBeDiscarded:222 � ClassCast
[ERROR] org.apache.activemq.bugs.AMQ6815Test.testHeapUsage(org.apache.activemq.bugs.AMQ6815Test)
[ERROR] Run 1: AMQ6815Test.testHeapUsage:78->sendMessages:90 � TestTimedOut test timed out af...
[ERROR] Run 2: AMQ6815Test.tearDown:69 � JMS Disposed due to prior exception
[INFO]
[INFO]
[ERROR] Tests run: 4560, Failures: 5, Errors: 2, Skipped: 215
[INFO]
[ERROR] There was a timeout or other error in the fork
[JENKINS] Recording test results
[INFO]
[INFO] --- maven-jar-plugin:2.4:jar (default-jar) @ activemq-unit-tests ---
[INFO] Building jar: <https://builds.apache.org/job/ActiveMQ-Java8-5.15.x/org.apache.activemq$activemq-unit-tests/ws/target/activemq-unit-tests-5.15.14-SNAPSHOT.jar>
[INFO]
[INFO] --- maven-site-plugin:3.5.1:attach-descriptor (attach-descriptor) @ activemq-unit-tests ---
[INFO]
[INFO] --- maven-antrun-plugin:1.3:run (package) @ activemq-unit-tests ---
[INFO] Executing tasks
[echo] Deleting unwanted resources from the test-jar
[delete] DEPRECATED - Use of the implicit FileSet is deprecated. Use a nested fileset element instead.
[delete] Deleting <https://builds.apache.org/job/ActiveMQ-Java8-5.15.x/org.apache.activemq$activemq-unit-tests/ws/target/test-classes/activemq-browse.properties>
[delete] Deleting <https://builds.apache.org/job/ActiveMQ-Java8-5.15.x/org.apache.activemq$activemq-unit-tests/ws/target/test-classes/activemq-partition.xml>
[delete] Deleting <https://builds.apache.org/job/ActiveMQ-Java8-5.15.x/org.apache.activemq$activemq-unit-tests/ws/target/test-classes/activemq.xml>
[delete] Deleting <https://builds.apache.org/job/ActiveMQ-Java8-5.15.x/org.apache.activemq$activemq-unit-tests/ws/target/test-classes/cert-groups.properties>
[delete] Deleting <https://builds.apache.org/job/ActiveMQ-Java8-5.15.x/org.apache.activemq$activemq-unit-tests/ws/target/test-classes/cert-users-LARGE.properties>
[delete] Deleting <https://builds.apache.org/job/ActiveMQ-Java8-5.15.x/org.apache.activemq$activemq-unit-tests/ws/target/test-classes/cert-users-REGEXP.properties>
[delete] Deleting <https://builds.apache.org/job/ActiveMQ-Java8-5.15.x/org.apache.activemq$activemq-unit-tests/ws/target/test-classes/cert-users-SMALL.properties>
[delete] Deleting <https://builds.apache.org/job/ActiveMQ-Java8-5.15.x/org.apache.activemq$activemq-unit-tests/ws/target/test-classes/client.keystore>
[delete] Deleting <https://builds.apache.org/job/ActiveMQ-Java8-5.15.x/org.apache.activemq$activemq-unit-tests/ws/target/test-classes/credentials.properties>
[delete] Deleting <https://builds.apache.org/job/ActiveMQ-Java8-5.15.x/org.apache.activemq$activemq-unit-tests/ws/target/test-classes/dummy.keystore>
[delete] Deleting <https://builds.apache.org/job/ActiveMQ-Java8-5.15.x/org.apache.activemq$activemq-unit-tests/ws/target/test-classes/groups-JaasDualAuthenticationNetworkBridge.properties>
[delete] Deleting <https://builds.apache.org/job/ActiveMQ-Java8-5.15.x/org.apache.activemq$activemq-unit-tests/ws/target/test-classes/handleReplyToActivemq.xml>
[delete] Deleting <https://builds.apache.org/job/ActiveMQ-Java8-5.15.x/org.apache.activemq$activemq-unit-tests/ws/target/test-classes/jmx.access>
[delete] Deleting <https://builds.apache.org/job/ActiveMQ-Java8-5.15.x/org.apache.activemq$activemq-unit-tests/ws/target/test-classes/jmx.password>
[delete] Deleting <https://builds.apache.org/job/ActiveMQ-Java8-5.15.x/org.apache.activemq$activemq-unit-tests/ws/target/test-classes/jndi.properties>
[delete] Deleting <https://builds.apache.org/job/ActiveMQ-Java8-5.15.x/org.apache.activemq$activemq-unit-tests/ws/target/test-classes/log4j.properties>
[delete] Deleting <https://builds.apache.org/job/ActiveMQ-Java8-5.15.x/org.apache.activemq$activemq-unit-tests/ws/target/test-classes/login-JaasDualAuthenticationNetworkBridge.config>
[delete] Deleting <https://builds.apache.org/job/ActiveMQ-Java8-5.15.x/org.apache.activemq$activemq-unit-tests/ws/target/test-classes/login.config>
[delete] Deleting <https://builds.apache.org/job/ActiveMQ-Java8-5.15.x/org.apache.activemq$activemq-unit-tests/ws/target/test-classes/provider.properties>
[delete] Deleting <https://builds.apache.org/job/ActiveMQ-Java8-5.15.x/org.apache.activemq$activemq-unit-tests/ws/target/test-classes/server.keystore>
[delete] Deleting <https://builds.apache.org/job/ActiveMQ-Java8-5.15.x/org.apache.activemq$activemq-unit-tests/ws/target/test-classes/spring-embedded-xbean-bean-ref.xml>
[delete] Deleting <https://builds.apache.org/job/ActiveMQ-Java8-5.15.x/org.apache.activemq$activemq-unit-tests/ws/target/test-classes/spring-embedded-xbean-local.xml>
[delete] Deleting <https://builds.apache.org/job/ActiveMQ-Java8-5.15.x/org.apache.activemq$activemq-unit-tests/ws/target/test-classes/spring-embedded-xbean-noversion.xml>
[delete] Deleting <https://builds.apache.org/job/ActiveMQ-Java8-5.15.x/org.apache.activemq$activemq-unit-tests/ws/target/test-classes/spring-embedded-xbean.xml>
[delete] Deleting <https://builds.apache.org/job/ActiveMQ-Java8-5.15.x/org.apache.activemq$activemq-unit-tests/ws/target/test-classes/spring-embedded.xml>
[delete] Deleting <https://builds.apache.org/job/ActiveMQ-Java8-5.15.x/org.apache.activemq$activemq-unit-tests/ws/target/test-classes/spring-jndi.xml>
[delete] Deleting <https://builds.apache.org/job/ActiveMQ-Java8-5.15.x/org.apache.activemq$activemq-unit-tests/ws/target/test-classes/spring-queue.xml>
[delete] Deleting <https://builds.apache.org/job/ActiveMQ-Java8-5.15.x/org.apache.activemq$activemq-unit-tests/ws/target/test-classes/spring-start-false.xml>
[delete] Deleting <https://builds.apache.org/job/ActiveMQ-Java8-5.15.x/org.apache.activemq$activemq-unit-tests/ws/target/test-classes/spring.xml>
[delete] Deleting <https://builds.apache.org/job/ActiveMQ-Java8-5.15.x/org.apache.activemq$activemq-unit-tests/ws/target/test-classes/ssl-domain-JaasDualAuthenticationNetworkBridge.properties>
[delete] Deleting <https://builds.apache.org/job/ActiveMQ-Java8-5.15.x/org.apache.activemq$activemq-unit-tests/ws/target/test-classes/test.properties>
[delete] Deleting <https://builds.apache.org/job/ActiveMQ-Java8-5.15.x/org.apache.activemq$activemq-unit-tests/ws/target/test-classes/users-JaasDualAuthenticationNetworkBridge.properties>
[INFO] Executed tasks
[INFO]
[INFO] --- maven-jar-plugin:2.4:test-jar (default) @ activemq-unit-tests ---
[INFO] Building jar: <https://builds.apache.org/job/ActiveMQ-Java8-5.15.x/org.apache.activemq$activemq-unit-tests/ws/target/activemq-unit-tests-5.15.14-SNAPSHOT-tests.jar>
[INFO]
[INFO] --- ianal-maven-plugin:1.0-alpha-1:verify-legal-files (default) @ activemq-unit-tests ---
[INFO] Checking legal files in: activemq-unit-tests-5.15.14-SNAPSHOT.jar
[INFO] Checking legal files in: activemq-unit-tests-5.15.14-SNAPSHOT-tests.jar
[INFO]
[INFO] --- maven-install-plugin:2.5.2:install (default-install) @ activemq-unit-tests ---
[INFO] Installing <https://builds.apache.org/job/ActiveMQ-Java8-5.15.x/org.apache.activemq$activemq-unit-tests/ws/target/activemq-unit-tests-5.15.14-SNAPSHOT.jar> to /home/jenkins/jenkins-slave/maven-repositories/0/org/apache/activemq/activemq-unit-tests/5.15.14-SNAPSHOT/activemq-unit-tests-5.15.14-SNAPSHOT.jar
[INFO] Installing <https://builds.apache.org/job/ActiveMQ-Java8-5.15.x/org.apache.activemq$activemq-unit-tests/ws/pom.xml> to /home/jenkins/jenkins-slave/maven-repositories/0/org/apache/activemq/activemq-unit-tests/5.15.14-SNAPSHOT/activemq-unit-tests-5.15.14-SNAPSHOT.pom
[INFO] Installing <https://builds.apache.org/job/ActiveMQ-Java8-5.15.x/org.apache.activemq$activemq-unit-tests/ws/target/activemq-unit-tests-5.15.14-SNAPSHOT-tests.jar> to /home/jenkins/jenkins-slave/maven-repositories/0/org/apache/activemq/activemq-unit-tests/5.15.14-SNAPSHOT/activemq-unit-tests-5.15.14-SNAPSHOT-tests.jar
[INFO]
[INFO] --- maven-deploy-plugin:2.8.2:deploy (default-deploy) @ activemq-unit-tests ---
[INFO] Downloading from apache.snapshots.https: https://repository.apache.org/content/repositories/snapshots/org/apache/activemq/activemq-unit-tests/5.15.14-SNAPSHOT/maven-metadata.xml
[INFO] Downloaded from apache.snapshots.https: https://repository.apache.org/content/repositories/snapshots/org/apache/activemq/activemq-unit-tests/5.15.14-SNAPSHOT/maven-metadata.xml (1.0 kB at 18 B/s)
[INFO] Uploading to apache.snapshots.https: https://repository.apache.org/content/repositories/snapshots/org/apache/activemq/activemq-unit-tests/5.15.14-SNAPSHOT/activemq-unit-tests-5.15.14-20200526.115546-2.jar
[WARNING] Failed to upload checksum org/apache/activemq/activemq-unit-tests/5.15.14-SNAPSHOT/activemq-unit-tests-5.15.14-20200526.115546-2.jar.sha1: Transfer failed for https://repository.apache.org/content/repositories/snapshots/org/apache/activemq/activemq-unit-tests/5.15.14-SNAPSHOT/activemq-unit-tests-5.15.14-20200526.115546-2.jar.sha1 502 Proxy Error
[INFO] Uploaded to apache.snapshots.https: https://repository.apache.org/content/repositories/snapshots/org/apache/activemq/activemq-unit-tests/5.15.14-SNAPSHOT/activemq-unit-tests-5.15.14-20200526.115546-2.jar (18 kB at 139 B/s)
[INFO] Uploading to apache.snapshots.https: https://repository.apache.org/content/repositories/snapshots/org/apache/activemq/activemq-unit-tests/5.15.14-SNAPSHOT/activemq-unit-tests-5.15.14-20200526.115546-2.pom
[WARNING] Failed to upload checksum org/apache/activemq/activemq-unit-tests/5.15.14-SNAPSHOT/activemq-unit-tests-5.15.14-20200526.115546-2.pom.sha1: Transfer failed for https://repository.apache.org/content/repositories/snapshots/org/apache/activemq/activemq-unit-tests/5.15.14-SNAPSHOT/activemq-unit-tests-5.15.14-20200526.115546-2.pom.sha1
[WARNING] Failed to upload checksum org/apache/activemq/activemq-unit-tests/5.15.14-SNAPSHOT/activemq-unit-tests-5.15.14-20200526.115546-2.pom.md5: Transfer failed for https://repository.apache.org/content/repositories/snapshots/org/apache/activemq/activemq-unit-tests/5.15.14-SNAPSHOT/activemq-unit-tests-5.15.14-20200526.115546-2.pom.md5 503 Service Unavailable
[INFO] Uploaded to apache.snapshots.https: https://repository.apache.org/content/repositories/snapshots/org/apache/activemq/activemq-unit-tests/5.15.14-SNAPSHOT/activemq-unit-tests-5.15.14-20200526.115546-2.pom (73 kB at 1.1 kB/s)
[INFO] Downloading from apache.snapshots.https: https://repository.apache.org/content/repositories/snapshots/org/apache/activemq/activemq-unit-tests/maven-metadata.xml
[WARNING] Could not transfer metadata org.apache.activemq:activemq-unit-tests/maven-metadata.xml from/to apache.snapshots.https (https://repository.apache.org/content/repositories/snapshots): Transfer failed for https://repository.apache.org/content/repositories/snapshots/org/apache/activemq/activemq-unit-tests/maven-metadata.xml 503 Service Unavailable
Jenkins build is still unstable: ActiveMQ-Java8-5.15.x » ActiveMQ :: Unit Tests #507
Posted by Apache Jenkins Server <je...@builds.apache.org>.
See <https://builds.apache.org/job/ActiveMQ-Java8-5.15.x/org.apache.activemq$activemq-unit-tests/507/display/redirect?page=changes>
Jenkins build is still unstable: ActiveMQ-Java8-5.15.x » ActiveMQ :: Unit Tests #506
Posted by Apache Jenkins Server <je...@builds.apache.org>.
See <https://builds.apache.org/job/ActiveMQ-Java8-5.15.x/org.apache.activemq$activemq-unit-tests/506/display/redirect>