You are viewing a plain text version of this content. The canonical link for it is here.
Posted to dev@beam.apache.org by Apache Jenkins Server <je...@builds.apache.org> on 2018/04/05 08:28:52 UTC

Build failed in Jenkins: beam_Release_NightlySnapshot #736

See <https://builds.apache.org/job/beam_Release_NightlySnapshot/736/display/redirect?page=changes>

Changes:

[rmannibucau] [BEAM-3993] read gitignore and add it in rat exclusions

[lcwik] [BEAM-3993] Remove duplicate definitions between .gitignore and

[herohde] [BEAM-3982] Register transform types and functions

[ankurgoenka] Fixing lint errrors

[iemejia] [BEAM-3875] Update Spark runner to use Spark version 2.3.0

[rmannibucau] [BEAM-3409] waitUntilFinish should wait teardown even for the direct

[lcwik] BEAM-3256 Add archetype testing/generation to existing GradleBuild

[lcwik] [BEAM-3250] Creating a gradle Jenkins config for Flink PostCommit.

[lcwik] Replace Maven based Flink ValidatesRunner postcommit with Gradle based

[lcwik] [BEAM-3249] Drop Java Maven PreCommit.

[aaltay] Fix Python streaming sordcount IT to unblock PostCommit (#5015)

[ehudm] Update Python Gradle tasks to run in a venv.

[ehudm] Add Gradle based Python precommit.

[markliu] [BEAM-3946] Fix pubsub_matcher_test which depends on

[amyrvold] Rename flink job to fix seed

[ehudm] Add HadoopFileSystemOptions support for Dataflow.

[ehudm] Fix HadoopFileSystem.match bugs.

[ehudm] Test HDFS reads in integration test.

[ehudm] Fix linter errors and add missing license.

[github] [BEAM-3774] Adds support for reading from/writing to more BQ

[aaltay] [BEAM-3250] Migrate Apex and Gearpump ValidatesRunner tests to Gradle

[robertwb] Secure GRPC channel for SDK worker (#4984)

------------------------------------------
[...truncated 2.82 MB...]
2018-04-05T08:26:43.174 [INFO] Excluding org.glassfish.jersey.containers:jersey-container-servlet-core:jar:2.22.2 from the shaded jar.
2018-04-05T08:26:43.174 [INFO] Excluding io.netty:netty-all:jar:4.1.17.Final from the shaded jar.
2018-04-05T08:26:43.174 [INFO] Excluding io.netty:netty:jar:3.9.9.Final from the shaded jar.
2018-04-05T08:26:43.174 [INFO] Excluding io.dropwizard.metrics:metrics-jvm:jar:3.1.5 from the shaded jar.
2018-04-05T08:26:43.174 [INFO] Excluding io.dropwizard.metrics:metrics-json:jar:3.1.5 from the shaded jar.
2018-04-05T08:26:43.174 [INFO] Excluding io.dropwizard.metrics:metrics-graphite:jar:3.1.5 from the shaded jar.
2018-04-05T08:26:43.174 [INFO] Excluding org.apache.ivy:ivy:jar:2.4.0 from the shaded jar.
2018-04-05T08:26:43.174 [INFO] Excluding oro:oro:jar:2.0.8 from the shaded jar.
2018-04-05T08:26:43.174 [INFO] Excluding net.razorvine:pyrolite:jar:4.13 from the shaded jar.
2018-04-05T08:26:43.174 [INFO] Excluding net.sf.py4j:py4j:jar:0.10.6 from the shaded jar.
2018-04-05T08:26:43.174 [INFO] Excluding org.apache.spark:spark-tags_2.11:jar:2.3.0 from the shaded jar.
2018-04-05T08:26:43.174 [INFO] Excluding org.apache.commons:commons-crypto:jar:1.0.0 from the shaded jar.
2018-04-05T08:26:43.174 [INFO] Excluding org.spark-project.spark:unused:jar:1.0.0 from the shaded jar.
2018-04-05T08:26:43.174 [INFO] Excluding org.apache.spark:spark-streaming_2.11:jar:2.3.0 from the shaded jar.
2018-04-05T08:26:44.121 [INFO] Replacing original artifact with shaded artifact.
2018-04-05T08:26:44.229 [INFO] 
2018-04-05T08:26:44.229 [INFO] --- maven-assembly-plugin:3.1.0:single (source-release-assembly) @ beam-sdks-java-javadoc ---
2018-04-05T08:26:44.232 [INFO] Skipping the assembly in this project because it's not the Execution Root
2018-04-05T08:26:44.340 [INFO] 
2018-04-05T08:26:44.340 [INFO] --- maven-source-plugin:3.0.1:jar-no-fork (attach-sources) @ beam-sdks-java-javadoc ---
2018-04-05T08:26:44.448 [INFO] 
2018-04-05T08:26:44.448 [INFO] --- maven-source-plugin:3.0.1:test-jar-no-fork (attach-test-sources) @ beam-sdks-java-javadoc ---
2018-04-05T08:26:44.556 [INFO] 
2018-04-05T08:26:44.556 [INFO] --- maven-javadoc-plugin:3.0.0-M1:jar (attach-javadocs) @ beam-sdks-java-javadoc ---
2018-04-05T08:26:44.559 [INFO] Not executing Javadoc as the project is not a Java classpath-capable package
2018-04-05T08:26:44.667 [INFO] 
2018-04-05T08:26:44.667 [INFO] --- reproducible-build-maven-plugin:0.4:strip-jar (default) @ beam-sdks-java-javadoc ---
2018-04-05T08:26:44.668 [INFO] Stripping <https://builds.apache.org/job/beam_Release_NightlySnapshot/ws/src/sdks/java/javadoc/target/javadoc.jar>
2018-04-05T08:26:44.838 [INFO] 
2018-04-05T08:26:44.838 [INFO] --- maven-dependency-plugin:3.0.2:analyze-only (default) @ beam-sdks-java-javadoc ---
2018-04-05T08:26:44.839 [INFO] Skipping plugin execution
2018-04-05T08:26:44.947 [INFO] 
2018-04-05T08:26:44.948 [INFO] --- maven-install-plugin:2.5.2:install (default-install) @ beam-sdks-java-javadoc ---
2018-04-05T08:26:44.949 [INFO] Installing <https://builds.apache.org/job/beam_Release_NightlySnapshot/ws/src/sdks/java/javadoc/pom.xml> to <https://builds.apache.org/job/beam_Release_NightlySnapshot/ws/.repository/org/apache/beam/beam-sdks-java-javadoc/2.5.0-SNAPSHOT/beam-sdks-java-javadoc-2.5.0-SNAPSHOT.pom>
2018-04-05T08:26:44.984 [INFO] Installing <https://builds.apache.org/job/beam_Release_NightlySnapshot/ws/src/sdks/java/javadoc/target/javadoc.jar> to <https://builds.apache.org/job/beam_Release_NightlySnapshot/ws/.repository/org/apache/beam/beam-sdks-java-javadoc/2.5.0-SNAPSHOT/beam-sdks-java-javadoc-2.5.0-SNAPSHOT.jar>
2018-04-05T08:26:45.139 [INFO] 
2018-04-05T08:26:45.139 [INFO] --- maven-deploy-plugin:2.8.2:deploy (default-deploy) @ beam-sdks-java-javadoc ---
2018-04-05T08:26:45.142 [INFO] Downloading from apache.snapshots.https: https://repository.apache.org/content/repositories/snapshots/org/apache/beam/beam-sdks-java-javadoc/2.5.0-SNAPSHOT/maven-metadata.xml
2018-04-05T08:26:45.397 [INFO] Downloaded from apache.snapshots.https: https://repository.apache.org/content/repositories/snapshots/org/apache/beam/beam-sdks-java-javadoc/2.5.0-SNAPSHOT/maven-metadata.xml (790 B at 3.1 kB/s)
2018-04-05T08:26:45.398 [INFO] Uploading to apache.snapshots.https: https://repository.apache.org/content/repositories/snapshots/org/apache/beam/beam-sdks-java-javadoc/2.5.0-SNAPSHOT/beam-sdks-java-javadoc-2.5.0-20180405.082645-23.pom
2018-04-05T08:26:45.874 [INFO] Uploaded to apache.snapshots.https: https://repository.apache.org/content/repositories/snapshots/org/apache/beam/beam-sdks-java-javadoc/2.5.0-SNAPSHOT/beam-sdks-java-javadoc-2.5.0-20180405.082645-23.pom (11 kB at 24 kB/s)
2018-04-05T08:26:45.874 [INFO] Downloading from apache.snapshots.https: https://repository.apache.org/content/repositories/snapshots/org/apache/beam/beam-sdks-java-javadoc/maven-metadata.xml
2018-04-05T08:26:46.107 [INFO] Downloaded from apache.snapshots.https: https://repository.apache.org/content/repositories/snapshots/org/apache/beam/beam-sdks-java-javadoc/maven-metadata.xml (397 B at 1.7 kB/s)
2018-04-05T08:26:46.121 [INFO] Uploading to apache.snapshots.https: https://repository.apache.org/content/repositories/snapshots/org/apache/beam/beam-sdks-java-javadoc/2.5.0-SNAPSHOT/maven-metadata.xml
2018-04-05T08:26:46.586 [INFO] Uploaded to apache.snapshots.https: https://repository.apache.org/content/repositories/snapshots/org/apache/beam/beam-sdks-java-javadoc/2.5.0-SNAPSHOT/maven-metadata.xml (790 B at 1.7 kB/s)
2018-04-05T08:26:46.586 [INFO] Uploading to apache.snapshots.https: https://repository.apache.org/content/repositories/snapshots/org/apache/beam/beam-sdks-java-javadoc/maven-metadata.xml
2018-04-05T08:26:47.025 [INFO] Uploaded to apache.snapshots.https: https://repository.apache.org/content/repositories/snapshots/org/apache/beam/beam-sdks-java-javadoc/maven-metadata.xml (397 B at 904 B/s)
2018-04-05T08:26:47.027 [INFO] Uploading to apache.snapshots.https: https://repository.apache.org/content/repositories/snapshots/org/apache/beam/beam-sdks-java-javadoc/2.5.0-SNAPSHOT/beam-sdks-java-javadoc-2.5.0-20180405.082645-23.jar
2018-04-05T08:26:48.067 [INFO] Uploaded to apache.snapshots.https: https://repository.apache.org/content/repositories/snapshots/org/apache/beam/beam-sdks-java-javadoc/2.5.0-SNAPSHOT/beam-sdks-java-javadoc-2.5.0-20180405.082645-23.jar (5.2 MB at 5.0 MB/s)
2018-04-05T08:26:48.067 [INFO] Uploading to apache.snapshots.https: https://repository.apache.org/content/repositories/snapshots/org/apache/beam/beam-sdks-java-javadoc/2.5.0-SNAPSHOT/maven-metadata.xml
2018-04-05T08:26:48.518 [INFO] Uploaded to apache.snapshots.https: https://repository.apache.org/content/repositories/snapshots/org/apache/beam/beam-sdks-java-javadoc/2.5.0-SNAPSHOT/maven-metadata.xml (790 B at 1.8 kB/s)
[JENKINS] Archiving disabled
[JENKINS] Archiving disabled
[JENKINS] Archiving disabled
[JENKINS] Archiving disabled
[JENKINS] Archiving disabled
[JENKINS] Archiving disabled
[JENKINS] Archiving disabled
[JENKINS] Archiving disabled
[JENKINS] Archiving disabled
[JENKINS] Archiving disabled
[JENKINS] Archiving disabled
[JENKINS] Archiving disabled
[JENKINS] Archiving disabled
[JENKINS] Archiving disabled
[JENKINS] Archiving disabled
[JENKINS] Archiving disabled
[JENKINS] Archiving disabled
[JENKINS] Archiving disabled
[JENKINS] Archiving disabled
[JENKINS] Archiving disabled
[JENKINS] Archiving disabled
[JENKINS] Archiving disabled
[JENKINS] Archiving disabled
[JENKINS] Archiving disabled
[JENKINS] Archiving disabled
[JENKINS] Archiving disabled
[JENKINS] Archiving disabled
[JENKINS] Archiving disabled
[JENKINS] Archiving disabled
[JENKINS] Archiving disabled
[JENKINS] Archiving disabled
[JENKINS] Archiving disabled
[JENKINS] Archiving disabled
[JENKINS] Archiving disabled
[JENKINS] Archiving disabled
[JENKINS] Archiving disabled
[JENKINS] Archiving disabled
[JENKINS] Archiving disabled
[JENKINS] Archiving disabled
[JENKINS] Archiving disabled
[JENKINS] Archiving disabled
[JENKINS] Archiving disabled
[JENKINS] Archiving disabled
[JENKINS] Archiving disabled
[JENKINS] Archiving disabled
[JENKINS] Archiving disabled
[JENKINS] Archiving disabled
[JENKINS] Archiving disabled
[JENKINS] Archiving disabled
[JENKINS] Archiving disabled
[JENKINS] Archiving disabled
[JENKINS] Archiving disabled
[JENKINS] Archiving disabled
[JENKINS] Archiving disabled
[JENKINS] Archiving disabled
[JENKINS] Archiving disabled
[JENKINS] Archiving disabled
[JENKINS] Archiving disabled
[JENKINS] Archiving disabled
[JENKINS] Archiving disabled
[JENKINS] Archiving disabled
[JENKINS] Archiving disabled
[JENKINS] Archiving disabled
[JENKINS] Archiving disabled
[JENKINS] Archiving disabled
[JENKINS] Archiving disabled
[JENKINS] Archiving disabled
[JENKINS] Archiving disabled
[JENKINS] Archiving disabled
[JENKINS] Archiving disabled
[JENKINS] Archiving disabled
[JENKINS] Archiving disabled
[JENKINS] Archiving disabled
[JENKINS] Archiving disabled
[JENKINS] Archiving disabled
[JENKINS] Archiving disabled
2018-04-05T08:28:11.395 [INFO] ------------------------------------------------------------------------
2018-04-05T08:28:11.395 [INFO] Reactor Summary:
2018-04-05T08:28:11.396 [INFO] 
2018-04-05T08:28:11.396 [INFO] Apache Beam :: Parent .............................. SUCCESS [ 22.852 s]
2018-04-05T08:28:11.396 [INFO] Apache Beam :: SDKs :: Java :: Build Tools ......... SUCCESS [ 15.029 s]
2018-04-05T08:28:11.396 [INFO] Apache Beam :: Model ............................... SUCCESS [  4.827 s]
2018-04-05T08:28:11.396 [INFO] Apache Beam :: Model :: Pipeline ................... SUCCESS [ 26.776 s]
2018-04-05T08:28:11.396 [INFO] Apache Beam :: Model :: Job Management ............. SUCCESS [ 18.372 s]
2018-04-05T08:28:11.396 [INFO] Apache Beam :: Model :: Fn Execution ............... SUCCESS [ 24.755 s]
2018-04-05T08:28:11.396 [INFO] Apache Beam :: SDKs ................................ SUCCESS [  5.312 s]
2018-04-05T08:28:11.396 [INFO] Apache Beam :: SDKs :: Go .......................... FAILURE [ 26.298 s]
2018-04-05T08:28:11.396 [INFO] Apache Beam :: SDKs :: Go :: Container ............. SKIPPED
2018-04-05T08:28:11.396 [INFO] Apache Beam :: SDKs :: Java ........................ SUCCESS [  5.127 s]
2018-04-05T08:28:11.396 [INFO] Apache Beam :: SDKs :: Java :: Core ................ SUCCESS [02:55 min]
[JENKINS] Archiving disabled2018-04-05T08:28:11.396 [INFO] Apache Beam :: SDKs :: Java :: Fn Execution ........ SUCCESS [ 36.034 s]
2018-04-05T08:28:11.396 [INFO] Apache Beam :: SDKs :: Java :: Extensions .......... SUCCESS [  4.889 s]

2018-04-05T08:28:11.396 [INFO] Apache Beam :: SDKs :: Java :: Extensions :: Google Cloud Platform Core SUCCESS [ 32.698 s]
2018-04-05T08:28:11.396 [INFO] Apache Beam :: Runners ............................. SUCCESS [  5.208 s]
2018-04-05T08:28:11.396 [INFO] Apache Beam :: Runners :: Core Construction Java ... SUCCESS [ 35.927 s]
2018-04-05T08:28:11.396 [INFO] Apache Beam :: Runners :: Core Java ................ SUCCESS [ 50.184 s]
2018-04-05T08:28:11.396 [INFO] Apache Beam :: SDKs :: Java :: Harness ............. SUCCESS [ 39.906 s]
2018-04-05T08:28:11.396 [INFO] Apache Beam :: SDKs :: Java :: Container ........... SUCCESS [ 11.018 s]
2018-04-05T08:28:11.396 [INFO] Apache Beam :: SDKs :: Java :: IO .................. SUCCESS [  4.948 s]
2018-04-05T08:28:11.396 [INFO] Apache Beam :: SDKs :: Java :: IO :: Amazon Web Services SUCCESS [ 25.670 s]
2018-04-05T08:28:11.396 [INFO] Apache Beam :: Runners :: Local Java Core .......... SUCCESS [ 17.350 s]
2018-04-05T08:28:11.396 [INFO] Apache Beam :: Runners :: Direct Java .............. SUCCESS [05:10 min]
2018-04-05T08:28:11.396 [INFO] Apache Beam :: SDKs :: Java :: IO :: AMQP .......... SUCCESS [ 27.824 s]
2018-04-05T08:28:11.396 [INFO] Apache Beam :: SDKs :: Java :: IO :: Common ........ SUCCESS [ 13.062 s]
2018-04-05T08:28:11.396 [INFO] Apache Beam :: SDKs :: Java :: IO :: Cassandra ..... SUCCESS [ 29.872 s]
2018-04-05T08:28:11.396 [INFO] Apache Beam :: SDKs :: Java :: IO :: Elasticsearch . SUCCESS [ 19.450 s]
2018-04-05T08:28:11.396 [INFO] Apache Beam :: SDKs :: Java :: IO :: Elasticsearch-Tests SUCCESS [  6.492 s]
2018-04-05T08:28:11.396 [INFO] Apache Beam :: SDKs :: Java :: IO :: Elasticsearch-Tests :: Common SUCCESS [ 10.315 s]
2018-04-05T08:28:11.396 [INFO] Apache Beam :: SDKs :: Java :: IO :: Elasticsearch-Tests :: 2.x SUCCESS [ 27.540 s]
2018-04-05T08:28:11.396 [INFO] Apache Beam :: SDKs :: Java :: IO :: Elasticsearch-Tests :: 5.x SUCCESS [ 30.567 s]
2018-04-05T08:28:11.396 [INFO] Apache Beam :: SDKs :: Java :: IO :: XML ........... SUCCESS [ 32.017 s]
2018-04-05T08:28:11.396 [INFO] Apache Beam :: SDKs :: Java :: Extensions :: Protobuf SUCCESS [ 21.107 s]
2018-04-05T08:28:11.396 [INFO] Apache Beam :: SDKs :: Java :: IO :: Google Cloud Platform SUCCESS [01:48 min]
2018-04-05T08:28:11.396 [INFO] Apache Beam :: Runners :: Google Cloud Dataflow .... SUCCESS [08:10 min]
2018-04-05T08:28:11.396 [INFO] Apache Beam :: SDKs :: Java :: IO :: File-based-io-tests SUCCESS [ 13.542 s]
2018-04-05T08:28:11.396 [INFO] Apache Beam :: SDKs :: Java :: IO :: Hadoop Common . SUCCESS [ 23.625 s]
2018-04-05T08:28:11.396 [INFO] Apache Beam :: SDKs :: Java :: IO :: Hadoop File System SUCCESS [ 39.259 s]
2018-04-05T08:28:11.396 [INFO] Apache Beam :: SDKs :: Java :: IO :: JDBC .......... SUCCESS [01:04 min]
2018-04-05T08:28:11.396 [INFO] Apache Beam :: SDKs :: Java :: IO :: Hadoop Input Format SUCCESS [01:11 min]
2018-04-05T08:28:11.397 [INFO] Apache Beam :: SDKs :: Java :: IO :: HBase ......... SUCCESS [01:28 min]
2018-04-05T08:28:11.397 [INFO] Apache Beam :: SDKs :: Java :: IO :: HCatalog ...... SUCCESS [ 53.986 s]
2018-04-05T08:28:11.397 [INFO] Apache Beam :: SDKs :: Java :: IO :: JMS ........... SUCCESS [ 25.692 s]
2018-04-05T08:28:11.397 [INFO] Apache Beam :: SDKs :: Java :: IO :: Kafka ......... SUCCESS [ 41.031 s]
2018-04-05T08:28:11.397 [INFO] Apache Beam :: SDKs :: Java :: IO :: Kinesis ....... SUCCESS [ 32.997 s]
2018-04-05T08:28:11.397 [INFO] Apache Beam :: SDKs :: Java :: IO :: MongoDB ....... SUCCESS [ 40.353 s]
2018-04-05T08:28:11.397 [INFO] Apache Beam :: SDKs :: Java :: IO :: MQTT .......... SUCCESS [ 30.068 s]
2018-04-05T08:28:11.397 [INFO] Apache Beam :: SDKs :: Java :: IO :: Redis ......... SUCCESS [ 23.305 s]
2018-04-05T08:28:11.397 [INFO] Apache Beam :: SDKs :: Java :: IO :: Solr .......... SUCCESS [ 39.868 s]
2018-04-05T08:28:11.397 [INFO] Apache Beam :: SDKs :: Java :: IO :: Tika .......... SUCCESS [ 28.344 s]
2018-04-05T08:28:11.397 [INFO] Apache Beam :: SDKs :: Java :: Maven Archetypes .... SUCCESS [  4.602 s]
2018-04-05T08:28:11.397 [INFO] Apache Beam :: SDKs :: Java :: Maven Archetypes :: Starter SUCCESS [ 18.301 s]
2018-04-05T08:28:11.397 [INFO] Apache Beam :: Examples ............................ SUCCESS [  5.357 s]
2018-04-05T08:28:11.397 [INFO] Apache Beam :: Examples :: Java .................... SUCCESS [05:07 min]
2018-04-05T08:28:11.397 [INFO] Apache Beam :: SDKs :: Java :: Maven Archetypes :: Examples SUCCESS [ 32.116 s]
2018-04-05T08:28:11.397 [INFO] Apache Beam :: SDKs :: Java :: Extensions :: Jackson SUCCESS [ 22.194 s]
2018-04-05T08:28:11.397 [INFO] Apache Beam :: SDKs :: Java :: Extensions :: Join library SUCCESS [ 22.326 s]
2018-04-05T08:28:11.397 [INFO] Apache Beam :: SDKs :: Java :: Extensions :: Sketching SUCCESS [ 27.474 s]
2018-04-05T08:28:11.397 [INFO] Apache Beam :: SDKs :: Java :: Extensions :: Sorter  SUCCESS [ 37.173 s]
2018-04-05T08:28:11.397 [INFO] Apache Beam :: SDKs :: Java :: Extensions :: SQL ... SUCCESS [01:19 min]
2018-04-05T08:28:11.397 [INFO] Apache Beam :: SDKs :: Java :: Nexmark ............. SUCCESS [03:09 min]
2018-04-05T08:28:11.397 [INFO] Apache Beam :: SDKs :: Python ...................... SUCCESS [22:44 min]
2018-04-05T08:28:11.397 [INFO] Apache Beam :: SDKs :: Python :: Container ......... SUCCESS [ 11.206 s]
2018-04-05T08:28:11.397 [INFO] Apache Beam :: Runners :: Java Fn Execution ........ SUCCESS [ 29.361 s]
2018-04-05T08:28:11.397 [INFO] Apache Beam :: Runners :: Java Local Artifact Service SUCCESS [ 22.060 s]
2018-04-05T08:28:11.397 [INFO] Apache Beam :: Runners :: Reference ................ SUCCESS [  6.322 s]
2018-04-05T08:28:11.397 [INFO] Apache Beam :: Runners :: Reference :: Java ........ SUCCESS [ 16.441 s]
2018-04-05T08:28:11.397 [INFO] Apache Beam :: Runners :: Reference :: Job Orchestrator SUCCESS [ 21.492 s]
2018-04-05T08:28:11.397 [INFO] Apache Beam :: Runners :: Flink .................... SUCCESS [ 50.046 s]
2018-04-05T08:28:11.397 [INFO] Apache Beam :: Runners :: Gearpump ................. SUCCESS [ 31.913 s]
2018-04-05T08:28:11.397 [INFO] Apache Beam :: Runners :: Spark .................... SUCCESS [02:08 min]
2018-04-05T08:28:11.397 [INFO] Apache Beam :: Runners :: Apex ..................... SUCCESS [01:10 min]
2018-04-05T08:28:11.397 [INFO] Apache Beam :: Runners :: Google Cloud Platform .... SUCCESS [  5.203 s]
2018-04-05T08:28:11.397 [INFO] Apache Beam :: Runners :: Google Cloud Platform :: GCE metadata provisioning SUCCESS [  9.501 s]
2018-04-05T08:28:11.397 [INFO] Apache Beam :: Runners :: Google Cloud Platform :: GCS artifact proxy FAILURE [  2.749 s]
2018-04-05T08:28:11.397 [INFO] Apache Beam :: SDKs :: Java :: Aggregated Javadoc .. SUCCESS [ 37.825 s]
2018-04-05T08:28:11.397 [INFO] ------------------------------------------------------------------------
2018-04-05T08:28:11.397 [INFO] BUILD FAILURE
2018-04-05T08:28:11.397 [INFO] ------------------------------------------------------------------------
2018-04-05T08:28:11.397 [INFO] Total time: 01:26 h
2018-04-05T08:28:11.397 [INFO] Finished at: 2018-04-05T08:28:11Z
2018-04-05T08:28:12.276 [INFO] Final Memory: 390M/1641M
2018-04-05T08:28:12.276 [INFO] ------------------------------------------------------------------------
Waiting for Jenkins to finish collecting data
2018-04-05T08:28:13.104 [ERROR] Failed to execute goal com.igormaznitsa:mvn-golang-wrapper:2.1.6:test (go-test) on project beam-sdks-go: Process exit code : 2 -> [Help 1]
2018-04-05T08:28:13.104 [ERROR] Failed to execute goal com.igormaznitsa:mvn-golang-wrapper:2.1.6:build (go-build) on project beam-runners-gcp-gcsproxy: Can't find generated target file : <https://builds.apache.org/job/beam_Release_NightlySnapshot/ws/src/runners/gcp/gcsproxy/target/gcsproxy> -> [Help 1]
2018-04-05T08:28:13.104 [ERROR] 
2018-04-05T08:28:13.104 [ERROR] To see the full stack trace of the errors, re-run Maven with the -e switch.
2018-04-05T08:28:13.104 [ERROR] Re-run Maven using the -X switch to enable full debug logging.
2018-04-05T08:28:13.104 [ERROR] 
2018-04-05T08:28:13.104 [ERROR] For more information about the errors and possible solutions, please read the following articles:
2018-04-05T08:28:13.104 [ERROR] [Help 1] http://cwiki.apache.org/confluence/display/MAVEN/MojoFailureException
2018-04-05T08:28:13.104 [ERROR] 
2018-04-05T08:28:13.104 [ERROR] After correcting the problems, you can resume the build with the command
2018-04-05T08:28:13.104 [ERROR]   mvn <goals> -rf :beam-sdks-go
channel stopped
Not sending mail to unregistered user aljoscha.krettek@gmail.com
Not sending mail to unregistered user ehudm@google.com
Not sending mail to unregistered user rober@frantil.com
Not sending mail to unregistered user ankurgoenka@gmail.com
Not sending mail to unregistered user dawid@getindata.com
Not sending mail to unregistered user sidhom@google.com
Not sending mail to unregistered user ccy@google.com
Not sending mail to unregistered user andreas.ehrencrona@velik.it
Not sending mail to unregistered user herohde@google.com
Not sending mail to unregistered user github@alasdairhodge.co.uk
Not sending mail to unregistered user mariand@google.com
Not sending mail to unregistered user aaltay@gmail.com
Not sending mail to unregistered user wcn@google.com
Not sending mail to unregistered user boyuanz@google.com
Not sending mail to unregistered user amyrvold@google.com
Not sending mail to unregistered user mairbek@google.com
Not sending mail to unregistered user jb@nanthrax.net
Not sending mail to unregistered user XuMingmin@users.noreply.github.com
Not sending mail to unregistered user markliu@google.com
Not sending mail to unregistered user szewinho@gmail.com
Not sending mail to unregistered user grzegorz.kolakowski@getindata.com
Not sending mail to unregistered user aromanenko.dev@gmail.com