You are viewing a plain text version of this content. The canonical link for it is here.
Posted to builds@solr.apache.org by Apache Jenkins Server <je...@builds.apache.org> on 2024/05/26 11:38:40 UTC
[JENKINS] Lucene » Lucene-Solr-Tests-8.11 - Build # 864 - Still Unstable!
Build: https://ci-builds.apache.org/job/Lucene/job/Lucene-Solr-Tests-8.11/864/
1 tests failed.
FAILED: org.apache.solr.cloud.autoscaling.AutoScalingHandlerTest.testReadApi
Error Message:
expected:<2> but was:<3>
Stack Trace:
java.lang.AssertionError: expected:<2> but was:<3>
at __randomizedtesting.SeedInfo.seed([9D7470B451B8BF5C:CA5D8B018A4A5D47]:0)
at org.junit.Assert.fail(Assert.java:89)
at org.junit.Assert.failNotEquals(Assert.java:835)
at org.junit.Assert.assertEquals(Assert.java:647)
at org.junit.Assert.assertEquals(Assert.java:633)
at org.apache.solr.cloud.autoscaling.AutoScalingHandlerTest.testReadApi(AutoScalingHandlerTest.java:920)
at sun.reflect.NativeMethodAccessorImpl.invoke0(Native Method)
at sun.reflect.NativeMethodAccessorImpl.invoke(NativeMethodAccessorImpl.java:62)
at sun.reflect.DelegatingMethodAccessorImpl.invoke(DelegatingMethodAccessorImpl.java:43)
at java.lang.reflect.Method.invoke(Method.java:498)
at com.carrotsearch.randomizedtesting.RandomizedRunner.invoke(RandomizedRunner.java:1758)
at com.carrotsearch.randomizedtesting.RandomizedRunner$8.evaluate(RandomizedRunner.java:946)
at com.carrotsearch.randomizedtesting.RandomizedRunner$9.evaluate(RandomizedRunner.java:982)
at com.carrotsearch.randomizedtesting.RandomizedRunner$10.evaluate(RandomizedRunner.java:996)
at com.carrotsearch.randomizedtesting.rules.SystemPropertiesRestoreRule$1.evaluate(SystemPropertiesRestoreRule.java:80)
at org.junit.rules.RunRules.evaluate(RunRules.java:20)
at org.apache.lucene.util.TestRuleSetupTeardownChained$1.evaluate(TestRuleSetupTeardownChained.java:49)
at org.apache.lucene.util.AbstractBeforeAfterRule$1.evaluate(AbstractBeforeAfterRule.java:45)
at org.apache.lucene.util.TestRuleThreadAndTestName$1.evaluate(TestRuleThreadAndTestName.java:48)
at org.apache.lucene.util.TestRuleIgnoreAfterMaxFailures$1.evaluate(TestRuleIgnoreAfterMaxFailures.java:64)
at org.apache.lucene.util.TestRuleMarkFailure$1.evaluate(TestRuleMarkFailure.java:47)
at org.junit.rules.RunRules.evaluate(RunRules.java:20)
at com.carrotsearch.randomizedtesting.rules.StatementAdapter.evaluate(StatementAdapter.java:36)
at com.carrotsearch.randomizedtesting.ThreadLeakControl$StatementRunner.run(ThreadLeakControl.java:390)
at com.carrotsearch.randomizedtesting.ThreadLeakControl.forkTimeoutingTask(ThreadLeakControl.java:843)
at com.carrotsearch.randomizedtesting.ThreadLeakControl$3.evaluate(ThreadLeakControl.java:490)
at com.carrotsearch.randomizedtesting.RandomizedRunner.runSingleTest(RandomizedRunner.java:955)
at com.carrotsearch.randomizedtesting.RandomizedRunner$5.evaluate(RandomizedRunner.java:840)
at com.carrotsearch.randomizedtesting.RandomizedRunner$6.evaluate(RandomizedRunner.java:891)
at com.carrotsearch.randomizedtesting.RandomizedRunner$7.evaluate(RandomizedRunner.java:902)
at com.carrotsearch.randomizedtesting.rules.StatementAdapter.evaluate(StatementAdapter.java:36)
at com.carrotsearch.randomizedtesting.rules.SystemPropertiesRestoreRule$1.evaluate(SystemPropertiesRestoreRule.java:80)
at org.junit.rules.RunRules.evaluate(RunRules.java:20)
at org.apache.lucene.util.AbstractBeforeAfterRule$1.evaluate(AbstractBeforeAfterRule.java:45)
at com.carrotsearch.randomizedtesting.rules.StatementAdapter.evaluate(StatementAdapter.java:36)
at org.apache.lucene.util.TestRuleStoreClassName$1.evaluate(TestRuleStoreClassName.java:41)
at com.carrotsearch.randomizedtesting.rules.NoShadowingOrOverridesOnMethodsRule$1.evaluate(NoShadowingOrOverridesOnMethodsRule.java:40)
at com.carrotsearch.randomizedtesting.rules.NoShadowingOrOverridesOnMethodsRule$1.evaluate(NoShadowingOrOverridesOnMethodsRule.java:40)
at com.carrotsearch.randomizedtesting.rules.StatementAdapter.evaluate(StatementAdapter.java:36)
at com.carrotsearch.randomizedtesting.rules.StatementAdapter.evaluate(StatementAdapter.java:36)
at com.carrotsearch.randomizedtesting.rules.StatementAdapter.evaluate(StatementAdapter.java:36)
at org.apache.lucene.util.TestRuleAssertionsRequired$1.evaluate(TestRuleAssertionsRequired.java:53)
at org.apache.lucene.util.TestRuleMarkFailure$1.evaluate(TestRuleMarkFailure.java:47)
at org.apache.lucene.util.TestRuleIgnoreAfterMaxFailures$1.evaluate(TestRuleIgnoreAfterMaxFailures.java:64)
at org.apache.lucene.util.TestRuleIgnoreTestSuites$1.evaluate(TestRuleIgnoreTestSuites.java:54)
at org.junit.rules.RunRules.evaluate(RunRules.java:20)
at com.carrotsearch.randomizedtesting.rules.StatementAdapter.evaluate(StatementAdapter.java:36)
at com.carrotsearch.randomizedtesting.ThreadLeakControl$StatementRunner.run(ThreadLeakControl.java:390)
at com.carrotsearch.randomizedtesting.ThreadLeakControl.lambda$forkTimeoutingTask$0(ThreadLeakControl.java:850)
at java.lang.Thread.run(Thread.java:750)
Build Log:
[...truncated 15453 lines...]
[junit4] Suite: org.apache.solr.cloud.autoscaling.AutoScalingHandlerTest
[junit4] 2> 1805150 INFO (SUITE-AutoScalingHandlerTest-seed#[9D7470B451B8BF5C]-worker) [ ] o.a.s.SolrTestCase Setting 'solr.default.confdir' system property to test-framework derived value of '/home/jenkins/jenkins-slave/workspace/Lucene/Lucene-Solr-Tests-8.11/solr/server/solr/configsets/_default/conf'
[junit4] 2> 1805151 INFO (SUITE-AutoScalingHandlerTest-seed#[9D7470B451B8BF5C]-worker) [ ] o.a.s.u.ErrorLogMuter Closing ErrorLogMuter-regex-517 after mutting 0 log messages
[junit4] 2> 1805151 INFO (SUITE-AutoScalingHandlerTest-seed#[9D7470B451B8BF5C]-worker) [ ] o.a.s.u.ErrorLogMuter Creating ErrorLogMuter-regex-518 for ERROR logs matching regex: ignore_exception
[junit4] 2> 1805152 INFO (SUITE-AutoScalingHandlerTest-seed#[9D7470B451B8BF5C]-worker) [ ] o.a.s.SolrTestCaseJ4 Created dataDir: /home/jenkins/jenkins-slave/workspace/Lucene/Lucene-Solr-Tests-8.11/solr/build/solr-core/test/J2/temp/solr.cloud.autoscaling.AutoScalingHandlerTest_9D7470B451B8BF5C-001/data-dir-170-001
[junit4] 2> 1805152 WARN (SUITE-AutoScalingHandlerTest-seed#[9D7470B451B8BF5C]-worker) [ ] o.a.s.SolrTestCaseJ4 startTrackingSearchers: numOpens=25 numCloses=25
[junit4] 2> 1805152 INFO (SUITE-AutoScalingHandlerTest-seed#[9D7470B451B8BF5C]-worker) [ ] o.a.s.SolrTestCaseJ4 Using PointFields (NUMERIC_POINTS_SYSPROP=true) w/NUMERIC_DOCVALUES_SYSPROP=false
[junit4] 2> 1805154 INFO (SUITE-AutoScalingHandlerTest-seed#[9D7470B451B8BF5C]-worker) [ ] o.a.s.SolrTestCaseJ4 Randomized ssl (true) and clientAuth (true) via: @org.apache.solr.util.RandomizeSSL(reason=, ssl=NaN, value=NaN, clientAuth=NaN)
[junit4] 2> 1805154 INFO (SUITE-AutoScalingHandlerTest-seed#[9D7470B451B8BF5C]-worker) [ ] o.a.s.SolrTestCaseJ4 SecureRandom sanity checks: test.solr.allowed.securerandom=null & java.security.egd=file:/dev/./urandom
[junit4] 2> 1805155 INFO (SUITE-AutoScalingHandlerTest-seed#[9D7470B451B8BF5C]-worker) [ ] o.a.s.c.MiniSolrCloudCluster Starting cluster of 2 servers in /home/jenkins/jenkins-slave/workspace/Lucene/Lucene-Solr-Tests-8.11/solr/build/solr-core/test/J2/temp/solr.cloud.autoscaling.AutoScalingHandlerTest_9D7470B451B8BF5C-001/tempDir-001
[junit4] 2> 1805155 INFO (SUITE-AutoScalingHandlerTest-seed#[9D7470B451B8BF5C]-worker) [ ] o.a.s.c.ZkTestServer STARTING ZK TEST SERVER
[junit4] 2> 1805155 INFO (ZkTestServer Run Thread) [ ] o.a.s.c.ZkTestServer client port: 0.0.0.0/0.0.0.0:0
[junit4] 2> 1805155 INFO (ZkTestServer Run Thread) [ ] o.a.s.c.ZkTestServer Starting server
[junit4] 2> 1805156 WARN (ZkTestServer Run Thread) [ ] o.a.z.s.ServerCnxnFactory maxCnxns is not configured, using default value 0.
[junit4] 2> 1805255 INFO (SUITE-AutoScalingHandlerTest-seed#[9D7470B451B8BF5C]-worker) [ ] o.a.s.c.ZkTestServer start zk server on port: 40177
[junit4] 2> 1805255 INFO (SUITE-AutoScalingHandlerTest-seed#[9D7470B451B8BF5C]-worker) [ ] o.a.s.c.ZkTestServer waitForServerUp: 127.0.0.1:40177
[junit4] 2> 1805255 INFO (SUITE-AutoScalingHandlerTest-seed#[9D7470B451B8BF5C]-worker) [ ] o.a.s.c.ZkTestServer parse host and port list: 127.0.0.1:40177
[junit4] 2> 1805255 INFO (SUITE-AutoScalingHandlerTest-seed#[9D7470B451B8BF5C]-worker) [ ] o.a.s.c.ZkTestServer connecting to 127.0.0.1 40177
[junit4] 2> 1805257 INFO (SUITE-AutoScalingHandlerTest-seed#[9D7470B451B8BF5C]-worker) [ ] o.a.s.c.c.ConnectionManager Waiting for client to connect to ZooKeeper
[junit4] 2> 1805259 INFO (zkConnectionManagerCallback-19433-thread-1) [ ] o.a.s.c.c.ConnectionManager zkClient has connected
[junit4] 2> 1805259 INFO (SUITE-AutoScalingHandlerTest-seed#[9D7470B451B8BF5C]-worker) [ ] o.a.s.c.c.ConnectionManager Client is connected to ZooKeeper
[junit4] 2> 1805261 INFO (SUITE-AutoScalingHandlerTest-seed#[9D7470B451B8BF5C]-worker) [ ] o.a.s.c.c.ConnectionManager Waiting for client to connect to ZooKeeper
[junit4] 2> 1805262 INFO (zkConnectionManagerCallback-19435-thread-1) [ ] o.a.s.c.c.ConnectionManager zkClient has connected
[junit4] 2> 1805262 INFO (SUITE-AutoScalingHandlerTest-seed#[9D7470B451B8BF5C]-worker) [ ] o.a.s.c.c.ConnectionManager Client is connected to ZooKeeper
[junit4] 2> 1805263 INFO (SUITE-AutoScalingHandlerTest-seed#[9D7470B451B8BF5C]-worker) [ ] o.a.s.c.c.ConnectionManager Waiting for client to connect to ZooKeeper
[junit4] 2> 1805263 INFO (zkConnectionManagerCallback-19437-thread-1) [ ] o.a.s.c.c.ConnectionManager zkClient has connected
[junit4] 2> 1805263 INFO (SUITE-AutoScalingHandlerTest-seed#[9D7470B451B8BF5C]-worker) [ ] o.a.s.c.c.ConnectionManager Client is connected to ZooKeeper
[junit4] 2> 1805367 INFO (jetty-launcher-19438-thread-2) [ ] o.a.s.c.s.e.JettySolrRunner Start Jetty (configured port=0, binding port=0)
[junit4] 2> 1805367 INFO (jetty-launcher-19438-thread-1) [ ] o.a.s.c.s.e.JettySolrRunner Start Jetty (configured port=0, binding port=0)
[junit4] 2> 1805367 INFO (jetty-launcher-19438-thread-2) [ ] o.a.s.c.s.e.JettySolrRunner Trying to start Jetty on port 0 try number 2 ...
[junit4] 2> 1805367 INFO (jetty-launcher-19438-thread-1) [ ] o.a.s.c.s.e.JettySolrRunner Trying to start Jetty on port 0 try number 2 ...
[junit4] 2> 1805367 INFO (jetty-launcher-19438-thread-1) [ ] o.e.j.s.Server jetty-9.4.53.v20231009; built: 2023-10-09T12:29:09.265Z; git: 27bde00a0b95a1d5bbee0eae7984f891d2d0f8c9; jvm 1.8.0_362-b09
[junit4] 2> 1805367 INFO (jetty-launcher-19438-thread-2) [ ] o.e.j.s.Server jetty-9.4.53.v20231009; built: 2023-10-09T12:29:09.265Z; git: 27bde00a0b95a1d5bbee0eae7984f891d2d0f8c9; jvm 1.8.0_362-b09
[junit4] 2> 1805368 INFO (jetty-launcher-19438-thread-1) [ ] o.e.j.s.session DefaultSessionIdManager workerName=node0
[junit4] 2> 1805368 INFO (jetty-launcher-19438-thread-1) [ ] o.e.j.s.session No SessionScavenger set, using defaults
[junit4] 2> 1805369 INFO (jetty-launcher-19438-thread-1) [ ] o.e.j.s.session node0 Scavenging every 600000ms
[junit4] 2> 1805369 INFO (jetty-launcher-19438-thread-2) [ ] o.e.j.s.session DefaultSessionIdManager workerName=node0
[junit4] 2> 1805369 INFO (jetty-launcher-19438-thread-2) [ ] o.e.j.s.session No SessionScavenger set, using defaults
[junit4] 2> 1805369 INFO (jetty-launcher-19438-thread-2) [ ] o.e.j.s.session node0 Scavenging every 660000ms
[junit4] 2> 1805369 INFO (jetty-launcher-19438-thread-1) [ ] o.e.j.s.h.ContextHandler Started o.e.j.s.ServletContextHandler@7ada5a2f{/solr,null,AVAILABLE}
[junit4] 2> 1805369 INFO (jetty-launcher-19438-thread-2) [ ] o.e.j.s.h.ContextHandler Started o.e.j.s.ServletContextHandler@3d11cdec{/solr,null,AVAILABLE}
[junit4] 2> 1805370 INFO (jetty-launcher-19438-thread-1) [ ] o.e.j.s.AbstractConnector Started ServerConnector@7a07d973{SSL, (ssl, http/1.1)}{127.0.0.1:37115}
[junit4] 2> 1805370 INFO (jetty-launcher-19438-thread-2) [ ] o.e.j.s.AbstractConnector Started ServerConnector@5d3f6ae6{SSL, (ssl, http/1.1)}{127.0.0.1:37631}
[junit4] 2> 1805370 INFO (jetty-launcher-19438-thread-1) [ ] o.e.j.s.Server Started @1805404ms
[junit4] 2> 1805370 INFO (jetty-launcher-19438-thread-2) [ ] o.e.j.s.Server Started @1805404ms
[junit4] 2> 1805370 INFO (jetty-launcher-19438-thread-1) [ ] o.a.s.c.s.e.JettySolrRunner Jetty properties: {hostContext=/solr, zkHost=127.0.0.1:40177/solr, hostPort=37115}
[junit4] 2> 1805370 INFO (jetty-launcher-19438-thread-2) [ ] o.a.s.c.s.e.JettySolrRunner Jetty properties: {hostContext=/solr, zkHost=127.0.0.1:40177/solr, hostPort=37631}
[junit4] 2> 1805370 ERROR (jetty-launcher-19438-thread-2) [ ] o.a.s.u.StartupLoggingUtils Missing Java Option solr.log.dir. Logging may be missing or incomplete.
[junit4] 2> 1805370 ERROR (jetty-launcher-19438-thread-1) [ ] o.a.s.u.StartupLoggingUtils Missing Java Option solr.log.dir. Logging may be missing or incomplete.
[junit4] 2> 1805370 INFO (jetty-launcher-19438-thread-2) [ ] o.a.s.s.SolrDispatchFilter Using logger factory org.apache.logging.slf4j.Log4jLoggerFactory
[junit4] 2> 1805370 INFO (jetty-launcher-19438-thread-1) [ ] o.a.s.s.SolrDispatchFilter Using logger factory org.apache.logging.slf4j.Log4jLoggerFactory
[junit4] 2> 1805370 INFO (jetty-launcher-19438-thread-2) [ ] o.a.s.s.SolrDispatchFilter ___ _ Welcome to Apache Solr™ version 8.11.4
[junit4] 2> 1805370 INFO (jetty-launcher-19438-thread-1) [ ] o.a.s.s.SolrDispatchFilter ___ _ Welcome to Apache Solr™ version 8.11.4
[junit4] 2> 1805370 INFO (jetty-launcher-19438-thread-2) [ ] o.a.s.s.SolrDispatchFilter / __| ___| |_ _ Starting in cloud mode on port null
[junit4] 2> 1805370 INFO (jetty-launcher-19438-thread-1) [ ] o.a.s.s.SolrDispatchFilter / __| ___| |_ _ Starting in cloud mode on port null
[junit4] 2> 1805370 INFO (jetty-launcher-19438-thread-2) [ ] o.a.s.s.SolrDispatchFilter \__ \/ _ \ | '_| Install dir: /home/jenkins/jenkins-slave/workspace/Lucene/Lucene-Solr-Tests-8.11/solr
[junit4] 2> 1805370 INFO (jetty-launcher-19438-thread-1) [ ] o.a.s.s.SolrDispatchFilter \__ \/ _ \ | '_| Install dir: /home/jenkins/jenkins-slave/workspace/Lucene/Lucene-Solr-Tests-8.11/solr
[junit4] 2> 1805370 INFO (jetty-launcher-19438-thread-2) [ ] o.a.s.s.SolrDispatchFilter |___/\___/_|_| Start time: 2024-05-26T11:04:19.023Z
[junit4] 2> 1805370 INFO (jetty-launcher-19438-thread-1) [ ] o.a.s.s.SolrDispatchFilter |___/\___/_|_| Start time: 2024-05-26T11:04:19.023Z
[junit4] 2> 1805371 INFO (jetty-launcher-19438-thread-2) [ ] o.a.s.c.c.ConnectionManager Waiting for client to connect to ZooKeeper
[junit4] 2> 1805372 INFO (jetty-launcher-19438-thread-1) [ ] o.a.s.c.c.ConnectionManager Waiting for client to connect to ZooKeeper
[junit4] 2> 1805372 INFO (zkConnectionManagerCallback-19440-thread-1) [ ] o.a.s.c.c.ConnectionManager zkClient has connected
[junit4] 2> 1805372 INFO (jetty-launcher-19438-thread-2) [ ] o.a.s.c.c.ConnectionManager Client is connected to ZooKeeper
[junit4] 2> 1805372 INFO (zkConnectionManagerCallback-19442-thread-1) [ ] o.a.s.c.c.ConnectionManager zkClient has connected
[junit4] 2> 1805372 INFO (jetty-launcher-19438-thread-2) [ ] o.a.s.s.SolrDispatchFilter solr.xml found in ZooKeeper. Loading...
[junit4] 2> 1805372 INFO (jetty-launcher-19438-thread-1) [ ] o.a.s.c.c.ConnectionManager Client is connected to ZooKeeper
[junit4] 2> 1805373 INFO (jetty-launcher-19438-thread-1) [ ] o.a.s.s.SolrDispatchFilter solr.xml found in ZooKeeper. Loading...
[junit4] 2> 1805379 WARN (jetty-launcher-19438-thread-1-SendThread(127.0.0.1:40177)) [ ] o.a.z.ClientCnxn An exception was thrown while closing send thread for session 0x100d70f1aae0004.
[junit4] 2> => EndOfStreamException: Unable to read additional data from server sessionid 0x100d70f1aae0004, likely server has closed socket
[junit4] 2> at org.apache.zookeeper.ClientCnxnSocketNIO.doIO(ClientCnxnSocketNIO.java:77)
[junit4] 2> org.apache.zookeeper.ClientCnxn$EndOfStreamException: Unable to read additional data from server sessionid 0x100d70f1aae0004, likely server has closed socket
[junit4] 2> at org.apache.zookeeper.ClientCnxnSocketNIO.doIO(ClientCnxnSocketNIO.java:77) ~[zookeeper-3.6.2.jar:3.6.2]
[junit4] 2> at org.apache.zookeeper.ClientCnxnSocketNIO.doTransport(ClientCnxnSocketNIO.java:350) ~[zookeeper-3.6.2.jar:3.6.2]
[junit4] 2> at org.apache.zookeeper.ClientCnxn$SendThread.run(ClientCnxn.java:1275) [zookeeper-3.6.2.jar:3.6.2]
[junit4] 2> 1806688 INFO (jetty-launcher-19438-thread-1) [ ] o.a.s.h.c.HttpShardHandlerFactory Host whitelist initialized: WhitelistHostChecker [whitelistHosts=null, whitelistHostCheckingEnabled=true]
[junit4] 2> 1806689 WARN (jetty-launcher-19438-thread-1) [ ] o.a.s.c.s.i.Http2SolrClient Create Http2SolrClient with HTTP/1.1 transport since Java 8 or lower versions does not support SSL + HTTP/2
[junit4] 2> 1806712 WARN (jetty-launcher-19438-thread-1) [ ] o.e.j.u.s.S.config Trusting all certificates configured for Client@6ff57420[provider=null,keyStore=null,trustStore=null]
[junit4] 2> 1806712 WARN (jetty-launcher-19438-thread-1) [ ] o.e.j.u.s.S.config No Client EndPointIdentificationAlgorithm configured for Client@6ff57420[provider=null,keyStore=null,trustStore=null]
[junit4] 2> 1806734 WARN (jetty-launcher-19438-thread-1) [ ] o.a.s.c.s.i.Http2SolrClient Create Http2SolrClient with HTTP/1.1 transport since Java 8 or lower versions does not support SSL + HTTP/2
[junit4] 2> 1806776 WARN (jetty-launcher-19438-thread-1) [ ] o.e.j.u.s.S.config Trusting all certificates configured for Client@7fc8cfa6[provider=null,keyStore=null,trustStore=null]
[junit4] 2> 1806776 WARN (jetty-launcher-19438-thread-1) [ ] o.e.j.u.s.S.config No Client EndPointIdentificationAlgorithm configured for Client@7fc8cfa6[provider=null,keyStore=null,trustStore=null]
[junit4] 2> 1806777 INFO (jetty-launcher-19438-thread-1) [ ] o.a.s.c.ZkContainer Zookeeper client=127.0.0.1:40177/solr
[junit4] 2> 1806791 INFO (jetty-launcher-19438-thread-1) [ ] o.a.s.c.c.ConnectionManager Waiting for client to connect to ZooKeeper
[junit4] 2> 1806803 INFO (zkConnectionManagerCallback-19456-thread-1) [ ] o.a.s.c.c.ConnectionManager zkClient has connected
[junit4] 2> 1806803 INFO (jetty-launcher-19438-thread-1) [ ] o.a.s.c.c.ConnectionManager Client is connected to ZooKeeper
[junit4] 2> 1806908 INFO (jetty-launcher-19438-thread-1) [n:127.0.0.1:37115_solr ] o.a.s.c.c.ConnectionManager Waiting for client to connect to ZooKeeper
[junit4] 2> 1806910 INFO (zkConnectionManagerCallback-19458-thread-1) [ ] o.a.s.c.c.ConnectionManager zkClient has connected
[junit4] 2> 1806910 INFO (jetty-launcher-19438-thread-1) [n:127.0.0.1:37115_solr ] o.a.s.c.c.ConnectionManager Client is connected to ZooKeeper
[junit4] 2> 1806971 WARN (jetty-launcher-19438-thread-1) [n:127.0.0.1:37115_solr ] o.a.s.c.ZkController Contents of zookeeper /security.json are world-readable; consider setting up ACLs as described in https://solr.apache.org/guide/zookeeper-access-control.html
[junit4] 2> 1806980 INFO (jetty-launcher-19438-thread-1) [n:127.0.0.1:37115_solr ] o.a.s.c.OverseerElectionContext I am going to be the leader 127.0.0.1:37115_solr
[junit4] 2> 1806981 INFO (jetty-launcher-19438-thread-1) [n:127.0.0.1:37115_solr ] o.a.s.c.Overseer Overseer (id=72294053910020102-127.0.0.1:37115_solr-n_0000000000) starting
[junit4] 2> 1807000 INFO (OverseerStateUpdate-72294053910020102-127.0.0.1:37115_solr-n_0000000000) [n:127.0.0.1:37115_solr ] o.a.s.c.Overseer Starting to work on the main queue : 127.0.0.1:37115_solr
[junit4] 2> 1807004 INFO (jetty-launcher-19438-thread-1) [n:127.0.0.1:37115_solr ] o.a.s.c.ZkController Register node as live in ZooKeeper:/live_nodes/127.0.0.1:37115_solr
[junit4] 2> 1807007 INFO (jetty-launcher-19438-thread-1) [n:127.0.0.1:37115_solr ] o.a.s.c.ZkController non-data nodes now []
[junit4] 2> 1807008 INFO (jetty-launcher-19438-thread-1) [n:127.0.0.1:37115_solr ] o.a.s.p.PackageLoader /packages.json updated to version -1
[junit4] 2> 1807009 WARN (jetty-launcher-19438-thread-1) [n:127.0.0.1:37115_solr ] o.a.s.c.CoreContainer Not all security plugins configured! authentication=disabled authorization=disabled. Solr is only as secure as you make it. Consider configuring authentication/authorization before exposing Solr to users internal or external. See https://s.apache.org/solrsecurity for more info
[junit4] 2> 1807016 INFO (zkCallback-19457-thread-1) [ ] o.a.s.c.c.ZkStateReader Updated live nodes from ZooKeeper... (0) -> (1)
[junit4] 2> 1807051 INFO (jetty-launcher-19438-thread-1) [n:127.0.0.1:37115_solr ] o.a.s.h.a.MetricsHistoryHandler No .system collection, keeping metrics history in memory.
[junit4] 2> 1807084 INFO (jetty-launcher-19438-thread-1) [n:127.0.0.1:37115_solr ] o.a.s.m.r.SolrJmxReporter JMX monitoring for 'solr_37115.solr.node' (registry 'solr.node') enabled at server: com.sun.jmx.mbeanserver.JmxMBeanServer@68bfc8a6
[junit4] 2> 1807091 INFO (jetty-launcher-19438-thread-1) [n:127.0.0.1:37115_solr ] o.a.s.m.r.SolrJmxReporter JMX monitoring for 'solr_37115.solr.jvm' (registry 'solr.jvm') enabled at server: com.sun.jmx.mbeanserver.JmxMBeanServer@68bfc8a6
[junit4] 2> 1807092 INFO (jetty-launcher-19438-thread-1) [n:127.0.0.1:37115_solr ] o.a.s.m.r.SolrJmxReporter JMX monitoring for 'solr_37115.solr.jetty' (registry 'solr.jetty') enabled at server: com.sun.jmx.mbeanserver.JmxMBeanServer@68bfc8a6
[junit4] 2> 1807093 INFO (jetty-launcher-19438-thread-1) [n:127.0.0.1:37115_solr ] o.a.s.c.CorePropertiesLocator Found 0 core definitions underneath /home/jenkins/jenkins-slave/workspace/Lucene/Lucene-Solr-Tests-8.11/solr/build/solr-core/test/J2/temp/solr.cloud.autoscaling.AutoScalingHandlerTest_9D7470B451B8BF5C-001/tempDir-001/node1
[junit4] 2> 1807148 INFO (jetty-launcher-19438-thread-2) [ ] o.a.s.h.c.HttpShardHandlerFactory Host whitelist initialized: WhitelistHostChecker [whitelistHosts=null, whitelistHostCheckingEnabled=true]
[junit4] 2> 1807148 WARN (jetty-launcher-19438-thread-2) [ ] o.a.s.c.s.i.Http2SolrClient Create Http2SolrClient with HTTP/1.1 transport since Java 8 or lower versions does not support SSL + HTTP/2
[junit4] 2> 1807149 WARN (jetty-launcher-19438-thread-2) [ ] o.e.j.u.s.S.config Trusting all certificates configured for Client@1638d883[provider=null,keyStore=null,trustStore=null]
[junit4] 2> 1807149 WARN (jetty-launcher-19438-thread-2) [ ] o.e.j.u.s.S.config No Client EndPointIdentificationAlgorithm configured for Client@1638d883[provider=null,keyStore=null,trustStore=null]
[junit4] 2> 1807161 WARN (jetty-launcher-19438-thread-2) [ ] o.a.s.c.s.i.Http2SolrClient Create Http2SolrClient with HTTP/1.1 transport since Java 8 or lower versions does not support SSL + HTTP/2
[junit4] 2> 1807162 WARN (jetty-launcher-19438-thread-2) [ ] o.e.j.u.s.S.config Trusting all certificates configured for Client@39bfee5c[provider=null,keyStore=null,trustStore=null]
[junit4] 2> 1807162 WARN (jetty-launcher-19438-thread-2) [ ] o.e.j.u.s.S.config No Client EndPointIdentificationAlgorithm configured for Client@39bfee5c[provider=null,keyStore=null,trustStore=null]
[junit4] 2> 1807163 INFO (jetty-launcher-19438-thread-2) [ ] o.a.s.c.ZkContainer Zookeeper client=127.0.0.1:40177/solr
[junit4] 2> 1807164 INFO (jetty-launcher-19438-thread-2) [ ] o.a.s.c.c.ConnectionManager Waiting for client to connect to ZooKeeper
[junit4] 2> 1807165 INFO (zkConnectionManagerCallback-19478-thread-1) [ ] o.a.s.c.c.ConnectionManager zkClient has connected
[junit4] 2> 1807165 INFO (jetty-launcher-19438-thread-2) [ ] o.a.s.c.c.ConnectionManager Client is connected to ZooKeeper
[junit4] 2> 1807267 INFO (jetty-launcher-19438-thread-2) [n:127.0.0.1:37631_solr ] o.a.s.c.c.ConnectionManager Waiting for client to connect to ZooKeeper
[junit4] 2> 1807271 INFO (zkConnectionManagerCallback-19480-thread-1) [ ] o.a.s.c.c.ConnectionManager zkClient has connected
[junit4] 2> 1807271 INFO (jetty-launcher-19438-thread-2) [n:127.0.0.1:37631_solr ] o.a.s.c.c.ConnectionManager Client is connected to ZooKeeper
[junit4] 2> 1807277 WARN (jetty-launcher-19438-thread-2) [n:127.0.0.1:37631_solr ] o.a.s.c.ZkController Contents of zookeeper /security.json are world-readable; consider setting up ACLs as described in https://solr.apache.org/guide/zookeeper-access-control.html
[junit4] 2> 1807278 INFO (jetty-launcher-19438-thread-2) [n:127.0.0.1:37631_solr ] o.a.s.c.c.ZkStateReader Updated live nodes from ZooKeeper... (0) -> (1)
[junit4] 2> 1807281 INFO (jetty-launcher-19438-thread-2) [n:127.0.0.1:37631_solr ] o.a.s.c.ZkController Publish node=127.0.0.1:37631_solr as DOWN
[junit4] 2> 1807281 INFO (jetty-launcher-19438-thread-2) [n:127.0.0.1:37631_solr ] o.a.s.c.TransientSolrCoreCacheDefault Allocating transient core cache for max 2147483647 cores with initial capacity of 1024
[junit4] 2> 1807281 INFO (jetty-launcher-19438-thread-2) [n:127.0.0.1:37631_solr ] o.a.s.c.ZkController Register node as live in ZooKeeper:/live_nodes/127.0.0.1:37631_solr
[junit4] 2> 1807282 INFO (zkCallback-19457-thread-1) [ ] o.a.s.c.c.ZkStateReader Updated live nodes from ZooKeeper... (1) -> (2)
[junit4] 2> 1807282 INFO (zkCallback-19479-thread-1) [ ] o.a.s.c.c.ZkStateReader Updated live nodes from ZooKeeper... (1) -> (2)
[junit4] 2> 1807283 INFO (jetty-launcher-19438-thread-2) [n:127.0.0.1:37631_solr ] o.a.s.c.ZkController non-data nodes now []
[junit4] 2> 1807284 INFO (jetty-launcher-19438-thread-2) [n:127.0.0.1:37631_solr ] o.a.s.p.PackageLoader /packages.json updated to version -1
[junit4] 2> 1807284 WARN (jetty-launcher-19438-thread-2) [n:127.0.0.1:37631_solr ] o.a.s.c.CoreContainer Not all security plugins configured! authentication=disabled authorization=disabled. Solr is only as secure as you make it. Consider configuring authentication/authorization before exposing Solr to users internal or external. See https://s.apache.org/solrsecurity for more info
[junit4] 2> 1807323 INFO (jetty-launcher-19438-thread-2) [n:127.0.0.1:37631_solr ] o.a.s.h.a.MetricsHistoryHandler No .system collection, keeping metrics history in memory.
[junit4] 2> 1807342 INFO (jetty-launcher-19438-thread-2) [n:127.0.0.1:37631_solr ] o.a.s.m.r.SolrJmxReporter JMX monitoring for 'solr_37631.solr.node' (registry 'solr.node') enabled at server: com.sun.jmx.mbeanserver.JmxMBeanServer@68bfc8a6
[junit4] 2> 1807351 INFO (jetty-launcher-19438-thread-2) [n:127.0.0.1:37631_solr ] o.a.s.m.r.SolrJmxReporter JMX monitoring for 'solr_37631.solr.jvm' (registry 'solr.jvm') enabled at server: com.sun.jmx.mbeanserver.JmxMBeanServer@68bfc8a6
[junit4] 2> 1807351 INFO (jetty-launcher-19438-thread-2) [n:127.0.0.1:37631_solr ] o.a.s.m.r.SolrJmxReporter JMX monitoring for 'solr_37631.solr.jetty' (registry 'solr.jetty') enabled at server: com.sun.jmx.mbeanserver.JmxMBeanServer@68bfc8a6
[junit4] 2> 1807352 INFO (jetty-launcher-19438-thread-2) [n:127.0.0.1:37631_solr ] o.a.s.c.CorePropertiesLocator Found 0 core definitions underneath /home/jenkins/jenkins-slave/workspace/Lucene/Lucene-Solr-Tests-8.11/solr/build/solr-core/test/J2/temp/solr.cloud.autoscaling.AutoScalingHandlerTest_9D7470B451B8BF5C-001/tempDir-001/node2
[junit4] 2> 1807372 INFO (SUITE-AutoScalingHandlerTest-seed#[9D7470B451B8BF5C]-worker) [ ] o.a.s.c.MiniSolrCloudCluster waitForAllNodes: numServers=2
[junit4] 2> 1807375 INFO (SUITE-AutoScalingHandlerTest-seed#[9D7470B451B8BF5C]-worker) [ ] o.a.s.c.c.ConnectionManager Waiting for client to connect to ZooKeeper
[junit4] 2> 1807376 INFO (zkConnectionManagerCallback-19493-thread-1) [ ] o.a.s.c.c.ConnectionManager zkClient has connected
[junit4] 2> 1807376 INFO (SUITE-AutoScalingHandlerTest-seed#[9D7470B451B8BF5C]-worker) [ ] o.a.s.c.c.ConnectionManager Client is connected to ZooKeeper
[junit4] 2> 1807377 INFO (SUITE-AutoScalingHandlerTest-seed#[9D7470B451B8BF5C]-worker) [ ] o.a.s.c.c.ZkStateReader Updated live nodes from ZooKeeper... (0) -> (2)
[junit4] 2> 1807378 INFO (SUITE-AutoScalingHandlerTest-seed#[9D7470B451B8BF5C]-worker) [ ] o.a.s.c.s.i.ZkClientClusterStateProvider Cluster at 127.0.0.1:40177/solr ready
[junit4] 2> 1807398 INFO (TEST-AutoScalingHandlerTest.testSuggestionsWithPayload-seed#[9D7470B451B8BF5C]) [ ] o.a.s.SolrTestCaseJ4 ###Starting testSuggestionsWithPayload
[junit4] 2> 1807441 INFO (qtp905784199-30731) [n:127.0.0.1:37115_solr ] o.a.s.s.HttpSolrCall HttpSolrCall.init(https://127.0.0.1:37115/solr/admin/collections?action=CREATE&name=testSuggestionsWithPayload.COLL&collection.configName=conf&numShards=1&maxShardsPerNode=4&nrtReplicas=2&wt=javabin&version=2)
[junit4] 2> 1807448 INFO (OverseerThreadFactory-19465-thread-1-processing-n:127.0.0.1:37115_solr) [n:127.0.0.1:37115_solr ] o.a.s.c.a.c.CreateCollectionCmd Create collection testSuggestionsWithPayload.COLL
[junit4] 2> 1807554 INFO (OverseerStateUpdate-72294053910020102-127.0.0.1:37115_solr-n_0000000000) [n:127.0.0.1:37115_solr ] o.a.s.c.o.SliceMutator createReplica() {
[junit4] 2> "operation":"ADDREPLICA",
[junit4] 2> "collection":"testSuggestionsWithPayload.COLL",
[junit4] 2> "shard":"shard1",
[junit4] 2> "core":"testSuggestionsWithPayload.COLL_shard1_replica_n1",
[junit4] 2> "state":"down",
[junit4] 2> "node_name":"127.0.0.1:37115_solr",
[junit4] 2> "base_url":"https://127.0.0.1:37115/solr",
[junit4] 2> "type":"NRT",
[junit4] 2> "waitForFinalState":"false"}
[junit4] 2> 1807556 INFO (OverseerStateUpdate-72294053910020102-127.0.0.1:37115_solr-n_0000000000) [n:127.0.0.1:37115_solr ] o.a.s.c.o.SliceMutator createReplica() {
[junit4] 2> "operation":"ADDREPLICA",
[junit4] 2> "collection":"testSuggestionsWithPayload.COLL",
[junit4] 2> "shard":"shard1",
[junit4] 2> "core":"testSuggestionsWithPayload.COLL_shard1_replica_n2",
[junit4] 2> "state":"down",
[junit4] 2> "node_name":"127.0.0.1:37631_solr",
[junit4] 2> "base_url":"https://127.0.0.1:37631/solr",
[junit4] 2> "type":"NRT",
[junit4] 2> "waitForFinalState":"false"}
[junit4] 2> 1807776 INFO (qtp905784199-30727) [n:127.0.0.1:37115_solr ] o.a.s.s.HttpSolrCall HttpSolrCall.init(https://127.0.0.1:37115/solr/admin/cores?null)
[junit4] 2> 1807776 INFO (qtp905784199-30727) [n:127.0.0.1:37115_solr x:testSuggestionsWithPayload.COLL_shard1_replica_n1 ] o.a.s.h.a.CoreAdminOperation core create command qt=/admin/cores&coreNodeName=core_node3&collection.configName=conf&newCollection=true&name=testSuggestionsWithPayload.COLL_shard1_replica_n1&action=CREATE&numShards=1&collection=testSuggestionsWithPayload.COLL&shard=shard1&wt=javabin&version=2&replicaType=NRT
[junit4] 2> 1807777 INFO (qtp905784199-30727) [n:127.0.0.1:37115_solr x:testSuggestionsWithPayload.COLL_shard1_replica_n1 ] o.a.s.c.TransientSolrCoreCacheDefault Allocating transient core cache for max 2147483647 cores with initial capacity of 1024
[junit4] 2> 1807785 INFO (qtp905784199-30727) [n:127.0.0.1:37115_solr c:testSuggestionsWithPayload.COLL s:shard1 r:core_node3 x:testSuggestionsWithPayload.COLL_shard1_replica_n1 ] o.a.s.c.SolrConfig Using Lucene MatchVersion: 8.11.4
[junit4] 2> 1807786 INFO (qtp905784199-30727) [n:127.0.0.1:37115_solr c:testSuggestionsWithPayload.COLL s:shard1 r:core_node3 x:testSuggestionsWithPayload.COLL_shard1_replica_n1 ] o.a.s.s.IndexSchema Schema name=minimal
[junit4] 2> 1807786 INFO (qtp905784199-30727) [n:127.0.0.1:37115_solr c:testSuggestionsWithPayload.COLL s:shard1 r:core_node3 x:testSuggestionsWithPayload.COLL_shard1_replica_n1 ] o.a.s.s.IndexSchema Loaded schema minimal/1.1 with uniqueid field id
[junit4] 2> 1807786 INFO (qtp905784199-30727) [n:127.0.0.1:37115_solr c:testSuggestionsWithPayload.COLL s:shard1 r:core_node3 x:testSuggestionsWithPayload.COLL_shard1_replica_n1 ] o.a.s.c.CoreContainer Creating SolrCore 'testSuggestionsWithPayload.COLL_shard1_replica_n1' using configuration from configset conf, trusted=true
[junit4] 2> 1807787 INFO (qtp905784199-30727) [n:127.0.0.1:37115_solr c:testSuggestionsWithPayload.COLL s:shard1 r:core_node3 x:testSuggestionsWithPayload.COLL_shard1_replica_n1 ] o.a.s.m.r.SolrJmxReporter JMX monitoring for 'solr_37115.solr.core.testSuggestionsWithPayload.COLL.shard1.replica_n1' (registry 'solr.core.testSuggestionsWithPayload.COLL.shard1.replica_n1') enabled at server: com.sun.jmx.mbeanserver.JmxMBeanServer@68bfc8a6
[junit4] 2> 1807787 INFO (qtp905784199-30727) [n:127.0.0.1:37115_solr c:testSuggestionsWithPayload.COLL s:shard1 r:core_node3 x:testSuggestionsWithPayload.COLL_shard1_replica_n1 ] o.a.s.c.SolrCore [[testSuggestionsWithPayload.COLL_shard1_replica_n1] ] Opening new SolrCore at [/home/jenkins/jenkins-slave/workspace/Lucene/Lucene-Solr-Tests-8.11/solr/build/solr-core/test/J2/temp/solr.cloud.autoscaling.AutoScalingHandlerTest_9D7470B451B8BF5C-001/tempDir-001/node1/testSuggestionsWithPayload.COLL_shard1_replica_n1], dataDir=[/home/jenkins/jenkins-slave/workspace/Lucene/Lucene-Solr-Tests-8.11/solr/build/solr-core/test/J2/temp/solr.cloud.autoscaling.AutoScalingHandlerTest_9D7470B451B8BF5C-001/tempDir-001/node1/testSuggestionsWithPayload.COLL_shard1_replica_n1/data/]
[junit4] 2> 1807804 INFO (qtp314936565-30728) [n:127.0.0.1:37631_solr ] o.a.s.s.HttpSolrCall HttpSolrCall.init(https://127.0.0.1:37631/solr/admin/cores?null)
[junit4] 2> 1807804 INFO (qtp314936565-30728) [n:127.0.0.1:37631_solr x:testSuggestionsWithPayload.COLL_shard1_replica_n2 ] o.a.s.h.a.CoreAdminOperation core create command qt=/admin/cores&coreNodeName=core_node4&collection.configName=conf&newCollection=true&name=testSuggestionsWithPayload.COLL_shard1_replica_n2&action=CREATE&numShards=1&collection=testSuggestionsWithPayload.COLL&shard=shard1&wt=javabin&version=2&replicaType=NRT
[junit4] 2> 1807810 INFO (qtp314936565-30728) [n:127.0.0.1:37631_solr c:testSuggestionsWithPayload.COLL s:shard1 r:core_node4 x:testSuggestionsWithPayload.COLL_shard1_replica_n2 ] o.a.s.c.SolrConfig Using Lucene MatchVersion: 8.11.4
[junit4] 2> 1807811 INFO (qtp314936565-30728) [n:127.0.0.1:37631_solr c:testSuggestionsWithPayload.COLL s:shard1 r:core_node4 x:testSuggestionsWithPayload.COLL_shard1_replica_n2 ] o.a.s.s.IndexSchema Schema name=minimal
[junit4] 2> 1807812 INFO (qtp314936565-30728) [n:127.0.0.1:37631_solr c:testSuggestionsWithPayload.COLL s:shard1 r:core_node4 x:testSuggestionsWithPayload.COLL_shard1_replica_n2 ] o.a.s.s.IndexSchema Loaded schema minimal/1.1 with uniqueid field id
[junit4] 2> 1807812 INFO (qtp314936565-30728) [n:127.0.0.1:37631_solr c:testSuggestionsWithPayload.COLL s:shard1 r:core_node4 x:testSuggestionsWithPayload.COLL_shard1_replica_n2 ] o.a.s.c.CoreContainer Creating SolrCore 'testSuggestionsWithPayload.COLL_shard1_replica_n2' using configuration from configset conf, trusted=true
[junit4] 2> 1807812 INFO (qtp314936565-30728) [n:127.0.0.1:37631_solr c:testSuggestionsWithPayload.COLL s:shard1 r:core_node4 x:testSuggestionsWithPayload.COLL_shard1_replica_n2 ] o.a.s.m.r.SolrJmxReporter JMX monitoring for 'solr_37631.solr.core.testSuggestionsWithPayload.COLL.shard1.replica_n2' (registry 'solr.core.testSuggestionsWithPayload.COLL.shard1.replica_n2') enabled at server: com.sun.jmx.mbeanserver.JmxMBeanServer@68bfc8a6
[junit4] 2> 1807812 INFO (qtp314936565-30728) [n:127.0.0.1:37631_solr c:testSuggestionsWithPayload.COLL s:shard1 r:core_node4 x:testSuggestionsWithPayload.COLL_shard1_replica_n2 ] o.a.s.c.SolrCore [[testSuggestionsWithPayload.COLL_shard1_replica_n2] ] Opening new SolrCore at [/home/jenkins/jenkins-slave/workspace/Lucene/Lucene-Solr-Tests-8.11/solr/build/solr-core/test/J2/temp/solr.cloud.autoscaling.AutoScalingHandlerTest_9D7470B451B8BF5C-001/tempDir-001/node2/testSuggestionsWithPayload.COLL_shard1_replica_n2], dataDir=[/home/jenkins/jenkins-slave/workspace/Lucene/Lucene-Solr-Tests-8.11/solr/build/solr-core/test/J2/temp/solr.cloud.autoscaling.AutoScalingHandlerTest_9D7470B451B8BF5C-001/tempDir-001/node2/testSuggestionsWithPayload.COLL_shard1_replica_n2/data/]
[junit4] 2> 1807837 INFO (qtp905784199-30727) [n:127.0.0.1:37115_solr c:testSuggestionsWithPayload.COLL s:shard1 r:core_node3 x:testSuggestionsWithPayload.COLL_shard1_replica_n1 ] o.a.s.u.UpdateHandler Using UpdateLog implementation: org.apache.solr.update.UpdateLog
[junit4] 2> 1807837 INFO (qtp905784199-30727) [n:127.0.0.1:37115_solr c:testSuggestionsWithPayload.COLL s:shard1 r:core_node3 x:testSuggestionsWithPayload.COLL_shard1_replica_n1 ] o.a.s.u.UpdateLog Initializing UpdateLog: dataDir=null defaultSyncLevel=FLUSH numRecordsToKeep=100 maxNumLogsToKeep=10 numVersionBuckets=65536
[junit4] 2> 1807838 INFO (qtp905784199-30727) [n:127.0.0.1:37115_solr c:testSuggestionsWithPayload.COLL s:shard1 r:core_node3 x:testSuggestionsWithPayload.COLL_shard1_replica_n1 ] o.a.s.u.CommitTracker Hard AutoCommit: disabled
[junit4] 2> 1807838 INFO (qtp905784199-30727) [n:127.0.0.1:37115_solr c:testSuggestionsWithPayload.COLL s:shard1 r:core_node3 x:testSuggestionsWithPayload.COLL_shard1_replica_n1 ] o.a.s.u.CommitTracker Soft AutoCommit: disabled
[junit4] 2> 1807840 INFO (qtp905784199-30727) [n:127.0.0.1:37115_solr c:testSuggestionsWithPayload.COLL s:shard1 r:core_node3 x:testSuggestionsWithPayload.COLL_shard1_replica_n1 ] o.a.s.r.ManagedResourceStorage Configured ZooKeeperStorageIO with znodeBase: /configs/conf
[junit4] 2> 1807840 INFO (qtp905784199-30727) [n:127.0.0.1:37115_solr c:testSuggestionsWithPayload.COLL s:shard1 r:core_node3 x:testSuggestionsWithPayload.COLL_shard1_replica_n1 ] o.a.s.r.ManagedResourceStorage Loaded null at path _rest_managed.json using ZooKeeperStorageIO:path=/configs/conf
[junit4] 2> 1807841 INFO (qtp905784199-30727) [n:127.0.0.1:37115_solr c:testSuggestionsWithPayload.COLL s:shard1 r:core_node3 x:testSuggestionsWithPayload.COLL_shard1_replica_n1 ] o.a.s.h.ReplicationHandler Commits will be reserved for 10000 ms
[junit4] 2> 1807841 INFO (qtp905784199-30727) [n:127.0.0.1:37115_solr c:testSuggestionsWithPayload.COLL s:shard1 r:core_node3 x:testSuggestionsWithPayload.COLL_shard1_replica_n1 ] o.a.s.u.UpdateLog Could not find max version in index or recent updates, using new clock 1800112923207532544
[junit4] 2> 1807845 INFO (qtp905784199-30727) [n:127.0.0.1:37115_solr c:testSuggestionsWithPayload.COLL s:shard1 r:core_node3 x:testSuggestionsWithPayload.COLL_shard1_replica_n1 ] o.a.s.c.ZkShardTerms Successful update of terms at /collections/testSuggestionsWithPayload.COLL/terms/shard1 to Terms{values={core_node3=0}, version=0}
[junit4] 2> 1807845 INFO (qtp905784199-30727) [n:127.0.0.1:37115_solr c:testSuggestionsWithPayload.COLL s:shard1 r:core_node3 x:testSuggestionsWithPayload.COLL_shard1_replica_n1 ] o.a.s.c.ShardLeaderElectionContextBase make sure parent is created /collections/testSuggestionsWithPayload.COLL/leaders/shard1
[junit4] 2> 1807847 INFO (searcherExecutor-19495-thread-1-processing-n:127.0.0.1:37115_solr x:testSuggestionsWithPayload.COLL_shard1_replica_n1 c:testSuggestionsWithPayload.COLL s:shard1 r:core_node3) [n:127.0.0.1:37115_solr c:testSuggestionsWithPayload.COLL s:shard1 r:core_node3 x:testSuggestionsWithPayload.COLL_shard1_replica_n1 ] o.a.s.c.SolrCore [testSuggestionsWithPayload.COLL_shard1_replica_n1] Registered new searcher autowarm time: 0 ms
[junit4] 2> 1807849 INFO (qtp905784199-30727) [n:127.0.0.1:37115_solr c:testSuggestionsWithPayload.COLL s:shard1 r:core_node3 x:testSuggestionsWithPayload.COLL_shard1_replica_n1 ] o.a.s.c.ShardLeaderElectionContext Waiting until we see more replicas up for shard shard1: total=2 found=1 timeoute in=9999ms
[junit4] 2> 1807872 INFO (qtp314936565-30728) [n:127.0.0.1:37631_solr c:testSuggestionsWithPayload.COLL s:shard1 r:core_node4 x:testSuggestionsWithPayload.COLL_shard1_replica_n2 ] o.a.s.u.UpdateHandler Using UpdateLog implementation: org.apache.solr.update.UpdateLog
[junit4] 2> 1807872 INFO (qtp314936565-30728) [n:127.0.0.1:37631_solr c:testSuggestionsWithPayload.COLL s:shard1 r:core_node4 x:testSuggestionsWithPayload.COLL_shard1_replica_n2 ] o.a.s.u.UpdateLog Initializing UpdateLog: dataDir=null defaultSyncLevel=FLUSH numRecordsToKeep=100 maxNumLogsToKeep=10 numVersionBuckets=65536
[junit4] 2> 1807873 INFO (qtp314936565-30728) [n:127.0.0.1:37631_solr c:testSuggestionsWithPayload.COLL s:shard1 r:core_node4 x:testSuggestionsWithPayload.COLL_shard1_replica_n2 ] o.a.s.u.CommitTracker Hard AutoCommit: disabled
[junit4] 2> 1807873 INFO (qtp314936565-30728) [n:127.0.0.1:37631_solr c:testSuggestionsWithPayload.COLL s:shard1 r:core_node4 x:testSuggestionsWithPayload.COLL_shard1_replica_n2 ] o.a.s.u.CommitTracker Soft AutoCommit: disabled
[junit4] 2> 1807874 INFO (qtp314936565-30728) [n:127.0.0.1:37631_solr c:testSuggestionsWithPayload.COLL s:shard1 r:core_node4 x:testSuggestionsWithPayload.COLL_shard1_replica_n2 ] o.a.s.r.ManagedResourceStorage Configured ZooKeeperStorageIO with znodeBase: /configs/conf
[junit4] 2> 1807875 INFO (qtp314936565-30728) [n:127.0.0.1:37631_solr c:testSuggestionsWithPayload.COLL s:shard1 r:core_node4 x:testSuggestionsWithPayload.COLL_shard1_replica_n2 ] o.a.s.r.ManagedResourceStorage Loaded null at path _rest_managed.json using ZooKeeperStorageIO:path=/configs/conf
[junit4] 2> 1807875 INFO (qtp314936565-30728) [n:127.0.0.1:37631_solr c:testSuggestionsWithPayload.COLL s:shard1 r:core_node4 x:testSuggestionsWithPayload.COLL_shard1_replica_n2 ] o.a.s.h.ReplicationHandler Commits will be reserved for 10000 ms
[junit4] 2> 1807875 INFO (qtp314936565-30728) [n:127.0.0.1:37631_solr c:testSuggestionsWithPayload.COLL s:shard1 r:core_node4 x:testSuggestionsWithPayload.COLL_shard1_replica_n2 ] o.a.s.u.UpdateLog Could not find max version in index or recent updates, using new clock 1800112923243184128
[junit4] 2> 1807879 INFO (searcherExecutor-19497-thread-1-processing-n:127.0.0.1:37631_solr x:testSuggestionsWithPayload.COLL_shard1_replica_n2 c:testSuggestionsWithPayload.COLL s:shard1 r:core_node4) [n:127.0.0.1:37631_solr c:testSuggestionsWithPayload.COLL s:shard1 r:core_node4 x:testSuggestionsWithPayload.COLL_shard1_replica_n2 ] o.a.s.c.SolrCore [testSuggestionsWithPayload.COLL_shard1_replica_n2] Registered new searcher autowarm time: 0 ms
[junit4] 2> 1807879 INFO (qtp314936565-30728) [n:127.0.0.1:37631_solr c:testSuggestionsWithPayload.COLL s:shard1 r:core_node4 x:testSuggestionsWithPayload.COLL_shard1_replica_n2 ] o.a.s.c.ZkShardTerms Successful update of terms at /collections/testSuggestionsWithPayload.COLL/terms/shard1 to Terms{values={core_node3=0, core_node4=0}, version=1}
[junit4] 2> 1807879 INFO (qtp314936565-30728) [n:127.0.0.1:37631_solr c:testSuggestionsWithPayload.COLL s:shard1 r:core_node4 x:testSuggestionsWithPayload.COLL_shard1_replica_n2 ] o.a.s.c.ShardLeaderElectionContextBase make sure parent is created /collections/testSuggestionsWithPayload.COLL/leaders/shard1
[junit4] 2> 1808351 INFO (qtp905784199-30727) [n:127.0.0.1:37115_solr c:testSuggestionsWithPayload.COLL s:shard1 r:core_node3 x:testSuggestionsWithPayload.COLL_shard1_replica_n1 ] o.a.s.c.ShardLeaderElectionContext Enough replicas found to continue.
[junit4] 2> 1808351 INFO (qtp905784199-30727) [n:127.0.0.1:37115_solr c:testSuggestionsWithPayload.COLL s:shard1 r:core_node3 x:testSuggestionsWithPayload.COLL_shard1_replica_n1 ] o.a.s.c.ShardLeaderElectionContext I may be the new leader - try and sync
[junit4] 2> 1808351 INFO (qtp905784199-30727) [n:127.0.0.1:37115_solr c:testSuggestionsWithPayload.COLL s:shard1 r:core_node3 x:testSuggestionsWithPayload.COLL_shard1_replica_n1 ] o.a.s.c.SyncStrategy Sync replicas to https://127.0.0.1:37115/solr/testSuggestionsWithPayload.COLL_shard1_replica_n1/
[junit4] 2> 1808351 INFO (qtp905784199-30727) [n:127.0.0.1:37115_solr c:testSuggestionsWithPayload.COLL s:shard1 r:core_node3 x:testSuggestionsWithPayload.COLL_shard1_replica_n1 ] o.a.s.u.PeerSync PeerSync: core=testSuggestionsWithPayload.COLL_shard1_replica_n1 url=https://127.0.0.1:37115/solr START replicas=[https://127.0.0.1:37631/solr/testSuggestionsWithPayload.COLL_shard1_replica_n2/] nUpdates=100
[junit4] 2> 1808352 INFO (qtp905784199-30727) [n:127.0.0.1:37115_solr c:testSuggestionsWithPayload.COLL s:shard1 r:core_node3 x:testSuggestionsWithPayload.COLL_shard1_replica_n1 ] o.a.s.u.PeerSync PeerSync: core=testSuggestionsWithPayload.COLL_shard1_replica_n1 url=https://127.0.0.1:37115/solr DONE. We have no versions. sync failed.
[junit4] 2> 1808366 INFO (qtp314936565-30734) [n:127.0.0.1:37631_solr ] o.a.s.s.HttpSolrCall HttpSolrCall.init(https://127.0.0.1:37631/solr/testSuggestionsWithPayload.COLL_shard1_replica_n2/get?null)
[junit4] 2> 1808367 INFO (qtp314936565-30734) [n:127.0.0.1:37631_solr c:testSuggestionsWithPayload.COLL s:shard1 r:core_node4 x:testSuggestionsWithPayload.COLL_shard1_replica_n2 ] o.a.s.c.S.Request [testSuggestionsWithPayload.COLL_shard1_replica_n2] webapp=/solr path=/get params={distrib=false&qt=/get&fingerprint=false&getVersions=100&wt=javabin&version=2} status=0 QTime=0
[junit4] 2> 1808367 INFO (qtp905784199-30727) [n:127.0.0.1:37115_solr c:testSuggestionsWithPayload.COLL s:shard1 r:core_node3 x:testSuggestionsWithPayload.COLL_shard1_replica_n1 ] o.a.s.c.SyncStrategy Leader's attempt to sync with shard failed, moving to the next candidate
[junit4] 2> 1808367 INFO (qtp905784199-30727) [n:127.0.0.1:37115_solr c:testSuggestionsWithPayload.COLL s:shard1 r:core_node3 x:testSuggestionsWithPayload.COLL_shard1_replica_n1 ] o.a.s.c.ShardLeaderElectionContext We failed sync, but we have no versions - we can't sync in that case - we were active before, so become leader anyway
[junit4] 2> 1808367 INFO (qtp905784199-30727) [n:127.0.0.1:37115_solr c:testSuggestionsWithPayload.COLL s:shard1 r:core_node3 x:testSuggestionsWithPayload.COLL_shard1_replica_n1 ] o.a.s.c.ShardLeaderElectionContextBase Creating leader registration node /collections/testSuggestionsWithPayload.COLL/leaders/shard1/leader after winning as /collections/testSuggestionsWithPayload.COLL/leader_elect/shard1/election/72294053910020102-core_node3-n_0000000000
[junit4] 2> 1808369 INFO (qtp905784199-30727) [n:127.0.0.1:37115_solr c:testSuggestionsWithPayload.COLL s:shard1 r:core_node3 x:testSuggestionsWithPayload.COLL_shard1_replica_n1 ] o.a.s.c.ShardLeaderElectionContext I am the new leader: https://127.0.0.1:37115/solr/testSuggestionsWithPayload.COLL_shard1_replica_n1/ shard1
[junit4] 2> 1808470 INFO (zkCallback-19457-thread-1) [ ] o.a.s.c.c.ZkStateReader A cluster state change: [WatchedEvent state:SyncConnected type:NodeDataChanged path:/collections/testSuggestionsWithPayload.COLL/state.json] for collection [testSuggestionsWithPayload.COLL] has occurred - updating... (live nodes size: [2])
[junit4] 2> 1808471 INFO (qtp905784199-30727) [n:127.0.0.1:37115_solr c:testSuggestionsWithPayload.COLL s:shard1 r:core_node3 x:testSuggestionsWithPayload.COLL_shard1_replica_n1 ] o.a.s.c.ZkController I am the leader, no recovery necessary
[junit4] 2> 1808474 INFO (qtp905784199-30727) [n:127.0.0.1:37115_solr ] o.a.s.s.HttpSolrCall [admin] webapp=null path=/admin/cores params={qt=/admin/cores&coreNodeName=core_node3&collection.configName=conf&newCollection=true&name=testSuggestionsWithPayload.COLL_shard1_replica_n1&action=CREATE&numShards=1&collection=testSuggestionsWithPayload.COLL&shard=shard1&wt=javabin&version=2&replicaType=NRT} status=0 QTime=698
[junit4] 2> 1808574 INFO (zkCallback-19457-thread-1) [ ] o.a.s.c.c.ZkStateReader A cluster state change: [WatchedEvent state:SyncConnected type:NodeDataChanged path:/collections/testSuggestionsWithPayload.COLL/state.json] for collection [testSuggestionsWithPayload.COLL] has occurred - updating... (live nodes size: [2])
[junit4] 2> 1808574 INFO (zkCallback-19457-thread-2) [ ] o.a.s.c.c.ZkStateReader A cluster state change: [WatchedEvent state:SyncConnected type:NodeDataChanged path:/collections/testSuggestionsWithPayload.COLL/state.json] for collection [testSuggestionsWithPayload.COLL] has occurred - updating... (live nodes size: [2])
[junit4] 2> 1808886 INFO (qtp314936565-30728) [n:127.0.0.1:37631_solr ] o.a.s.s.HttpSolrCall [admin] webapp=null path=/admin/cores params={qt=/admin/cores&coreNodeName=core_node4&collection.configName=conf&newCollection=true&name=testSuggestionsWithPayload.COLL_shard1_replica_n2&action=CREATE&numShards=1&collection=testSuggestionsWithPayload.COLL&shard=shard1&wt=javabin&version=2&replicaType=NRT} status=0 QTime=1081
[junit4] 2> 1808888 INFO (qtp905784199-30731) [n:127.0.0.1:37115_solr ] o.a.s.h.a.CollectionsHandler Wait for new collection to be active for at most 45 seconds. Check all shard replicas
[junit4] 2> 1808984 INFO (zkCallback-19457-thread-1) [ ] o.a.s.c.c.ZkStateReader A cluster state change: [WatchedEvent state:SyncConnected type:NodeDataChanged path:/collections/testSuggestionsWithPayload.COLL/state.json] for collection [testSuggestionsWithPayload.COLL] has occurred - updating... (live nodes size: [2])
[junit4] 2> 1808984 INFO (zkCallback-19457-thread-2) [ ] o.a.s.c.c.ZkStateReader A cluster state change: [WatchedEvent state:SyncConnected type:NodeDataChanged path:/collections/testSuggestionsWithPayload.COLL/state.json] for collection [testSuggestionsWithPayload.COLL] has occurred - updating... (live nodes size: [2])
[junit4] 2> 1808984 INFO (zkCallback-19479-thread-1) [ ] o.a.s.c.c.ZkStateReader A cluster state change: [WatchedEvent state:SyncConnected type:NodeDataChanged path:/collections/testSuggestionsWithPayload.COLL/state.json] for collection [testSuggestionsWithPayload.COLL] has occurred - updating... (live nodes size: [2])
[junit4] 2> 1808985 INFO (qtp905784199-30731) [n:127.0.0.1:37115_solr ] o.a.s.s.HttpSolrCall [admin] webapp=null path=/admin/collections params={collection.configName=conf&maxShardsPerNode=4&name=testSuggestionsWithPayload.COLL&nrtReplicas=2&action=CREATE&numShards=1&wt=javabin&version=2} status=0 QTime=1543
[junit4] 2> 1809001 INFO (TEST-AutoScalingHandlerTest.testSuggestionsWithPayload-seed#[9D7470B451B8BF5C]) [ ] o.a.s.c.MiniSolrCloudCluster waitForActiveCollection: testSuggestionsWithPayload.COLL
[junit4] 2> 1809002 INFO (qtp905784199-30729) [n:127.0.0.1:37115_solr ] o.a.s.s.HttpSolrCall HttpSolrCall.init(https://127.0.0.1:37115/solr/admin/autoscaling/suggestions?wt=javabin&version=2)
[junit4] 2> 1809008 INFO (qtp905784199-30722) [n:127.0.0.1:37115_solr ] o.a.s.s.HttpSolrCall HttpSolrCall.init(https://127.0.0.1:37115/solr/admin/metrics?null)
[junit4] 2> 1809008 INFO (qtp905784199-30722) [n:127.0.0.1:37115_solr ] o.a.s.s.HttpSolrCall [admin] webapp=null path=/admin/metrics params={wt=javabin&version=2&key=solr.core.testSuggestionsWithPayload.COLL.shard1.replica_n1:INDEX.sizeInBytes} status=0 QTime=0
[junit4] 2> 1809009 INFO (qtp905784199-30725) [n:127.0.0.1:37115_solr ] o.a.s.s.HttpSolrCall HttpSolrCall.init(https://127.0.0.1:37115/solr/admin/metrics?null)
[junit4] 2> 1809009 INFO (qtp905784199-30725) [n:127.0.0.1:37115_solr ] o.a.s.s.HttpSolrCall [admin] webapp=null path=/admin/metrics params={prefix=CONTAINER.fs.usableSpace,CONTAINER.fs.totalSpace,CONTAINER.cores&wt=javabin&version=2&group=solr.node} status=0 QTime=0
[junit4] 2> 1809010 INFO (qtp314936565-30730) [n:127.0.0.1:37631_solr ] o.a.s.s.HttpSolrCall HttpSolrCall.init(https://127.0.0.1:37631/solr/admin/metrics?null)
[junit4] 2> 1809010 INFO (qtp314936565-30730) [n:127.0.0.1:37631_solr ] o.a.s.s.HttpSolrCall [admin] webapp=null path=/admin/metrics params={wt=javabin&version=2&key=solr.core.testSuggestionsWithPayload.COLL.shard1.replica_n2:INDEX.sizeInBytes} status=0 QTime=0
[junit4] 2> 1809010 INFO (qtp314936565-30732) [n:127.0.0.1:37631_solr ] o.a.s.s.HttpSolrCall HttpSolrCall.init(https://127.0.0.1:37631/solr/admin/metrics?null)
[junit4] 2> 1809011 INFO (qtp314936565-30732) [n:127.0.0.1:37631_solr ] o.a.s.s.HttpSolrCall [admin] webapp=null path=/admin/metrics params={prefix=CONTAINER.fs.usableSpace,CONTAINER.fs.totalSpace,CONTAINER.cores&wt=javabin&version=2&group=solr.node} status=0 QTime=0
[junit4] 2> 1809018 INFO (qtp905784199-30729) [n:127.0.0.1:37115_solr ] o.a.s.s.HttpSolrCall [admin] webapp=null path=/admin/autoscaling/suggestions params={wt=javabin&version=2} status=0 QTime=15
[junit4] 2> 1809022 INFO (qtp905784199-30729) [n:127.0.0.1:37115_solr ] o.a.s.s.HttpSolrCall HttpSolrCall.init(https://127.0.0.1:37115/solr/admin/autoscaling/suggestions?type=repair&wt=javabin&version=2)
[junit4] 2> 1809023 INFO (qtp905784199-30727) [n:127.0.0.1:37115_solr ] o.a.s.s.HttpSolrCall HttpSolrCall.init(https://127.0.0.1:37115/solr/admin/metrics?null)
[junit4] 2> 1809023 INFO (qtp905784199-30727) [n:127.0.0.1:37115_solr ] o.a.s.s.HttpSolrCall [admin] webapp=null path=/admin/metrics params={wt=javabin&version=2&key=solr.core.testSuggestionsWithPayload.COLL.shard1.replica_n1:INDEX.sizeInBytes} status=0 QTime=0
[junit4] 2> 1809024 INFO (qtp905784199-30731) [n:127.0.0.1:37115_solr ] o.a.s.s.HttpSolrCall HttpSolrCall.init(https://127.0.0.1:37115/solr/admin/metrics?null)
[junit4] 2> 1809024 INFO (qtp905784199-30731) [n:127.0.0.1:37115_solr ] o.a.s.s.HttpSolrCall [admin] webapp=null path=/admin/metrics params={prefix=CONTAINER.fs.usableSpace,CONTAINER.fs.totalSpace,CONTAINER.cores&wt=javabin&version=2&group=solr.node} status=0 QTime=0
[junit4] 2> 1809025 INFO (qtp314936565-30733) [n:127.0.0.1:37631_solr ] o.a.s.s.HttpSolrCall HttpSolrCall.init(https://127.0.0.1:37631/solr/admin/metrics?null)
[junit4] 2> 1809025 INFO (qtp314936565-30733) [n:127.0.0.1:37631_solr ] o.a.s.s.HttpSolrCall [admin] webapp=null path=/admin/metrics params={wt=javabin&version=2&key=solr.core.testSuggestionsWithPayload.COLL.shard1.replica_n2:INDEX.sizeInBytes} status=0 QTime=0
[junit4] 2> 1809025 INFO (qtp314936565-30734) [n:127.0.0.1:37631_solr ] o.a.s.s.HttpSolrCall HttpSolrCall.init(https://127.0.0.1:37631/solr/admin/metrics?null)
[junit4] 2> 1809026 INFO (qtp314936565-30734) [n:127.0.0.1:37631_solr ] o.a.s.s.HttpSolrCall [admin] webapp=null path=/admin/metrics params={prefix=CONTAINER.fs.usableSpace,CONTAINER.fs.totalSpace,CONTAINER.cores&wt=javabin&version=2&group=solr.node} status=0 QTime=0
[junit4] 2> 1809026 INFO (qtp905784199-30729) [n:127.0.0.1:37115_solr ] o.a.s.s.HttpSolrCall [admin] webapp=null path=/admin/autoscaling/suggestions params={type=repair&wt=javabin&version=2} status=0 QTime=3
[junit4] 2> 1809026 INFO (qtp905784199-30729) [n:127.0.0.1:37115_solr ] o.a.s.s.HttpSolrCall HttpSolrCall.init(https://127.0.0.1:37115/solr/admin/collections?action=DELETE&name=testSuggestionsWithPayload.COLL&wt=javabin&version=2)
[junit4] 2> 1809029 INFO (OverseerCollectionConfigSetProcessor-72294053910020102-127.0.0.1:37115_solr-n_0000000000) [n:127.0.0.1:37115_solr ] o.a.s.c.OverseerTaskQueue Response ZK path: /overseer/collection-queue-work/qnr-0000000000 doesn't exist. Requestor may have disconnected from ZooKeeper
[junit4] 2> 1809029 INFO (OverseerThreadFactory-19465-thread-2-processing-n:127.0.0.1:37115_solr) [n:127.0.0.1:37115_solr ] o.a.s.c.a.c.OverseerCollectionMessageHandler Executing Collection Cmd=action=UNLOAD&deleteInstanceDir=true&deleteDataDir=true&deleteMetricsHistory=true, asyncId=null
[junit4] 2> 1809031 INFO (qtp905784199-30722) [n:127.0.0.1:37115_solr ] o.a.s.s.HttpSolrCall HttpSolrCall.init(https://127.0.0.1:37115/solr/admin/cores?null)
[junit4] 2> 1809031 INFO (qtp314936565-30728) [n:127.0.0.1:37631_solr ] o.a.s.s.HttpSolrCall HttpSolrCall.init(https://127.0.0.1:37631/solr/admin/cores?null)
[junit4] 2> 1809031 INFO (qtp905784199-30722) [n:127.0.0.1:37115_solr x:testSuggestionsWithPayload.COLL_shard1_replica_n1 ] o.a.s.m.SolrMetricManager Closing metric reporters for registry=solr.core.testSuggestionsWithPayload.COLL.shard1.replica_n1 tag=null
[junit4] 2> 1809031 INFO (qtp905784199-30722) [n:127.0.0.1:37115_solr x:testSuggestionsWithPayload.COLL_shard1_replica_n1 ] o.a.s.m.r.SolrJmxReporter Closing reporter [org.apache.solr.metrics.reporters.SolrJmxReporter@276b89a3: rootName = solr_37115, domain = solr.core.testSuggestionsWithPayload.COLL.shard1.replica_n1, service url = null, agent id = null] for registry solr.core.testSuggestionsWithPayload.COLL.shard1.replica_n1/com.codahale.metrics.MetricRegistry@6704ada1
[junit4] 2> 1809031 INFO (qtp314936565-30728) [n:127.0.0.1:37631_solr x:testSuggestionsWithPayload.COLL_shard1_replica_n2 ] o.a.s.m.SolrMetricManager Closing metric reporters for registry=solr.core.testSuggestionsWithPayload.COLL.shard1.replica_n2 tag=null
[junit4] 2> 1809031 INFO (qtp314936565-30728) [n:127.0.0.1:37631_solr x:testSuggestionsWithPayload.COLL_shard1_replica_n2 ] o.a.s.m.r.SolrJmxReporter Closing reporter [org.apache.solr.metrics.reporters.SolrJmxReporter@1dd9fcfb: rootName = solr_37631, domain = solr.core.testSuggestionsWithPayload.COLL.shard1.replica_n2, service url = null, agent id = null] for registry solr.core.testSuggestionsWithPayload.COLL.shard1.replica_n2/com.codahale.metrics.MetricRegistry@2994bd38
[junit4] 2> 1809052 INFO (qtp905784199-30722) [n:127.0.0.1:37115_solr ] o.a.s.c.SolrCore [testSuggestionsWithPayload.COLL_shard1_replica_n1] CLOSING SolrCore org.apache.solr.core.SolrCore@4e1af14b
[junit4] 2> 1809052 INFO (qtp905784199-30722) [n:127.0.0.1:37115_solr ] o.a.s.m.SolrMetricManager Closing metric reporters for registry=solr.core.testSuggestionsWithPayload.COLL.shard1.replica_n1 tag=SolrCore@4e1af14b
[junit4] 2> 1809052 INFO (qtp905784199-30722) [n:127.0.0.1:37115_solr ] o.a.s.m.SolrMetricManager Closing metric reporters for registry=solr.collection.testSuggestionsWithPayload.COLL.shard1.leader tag=SolrCore@4e1af14b
[junit4] 2> 1809053 INFO (qtp905784199-30722) [n:127.0.0.1:37115_solr ] o.a.s.u.DirectUpdateHandler2 Committing on IndexWriter.close() ... SKIPPED (unnecessary).
[junit4] 2> 1809053 INFO (qtp314936565-30728) [n:127.0.0.1:37631_solr ] o.a.s.c.SolrCore [testSuggestionsWithPayload.COLL_shard1_replica_n2] CLOSING SolrCore org.apache.solr.core.SolrCore@74dfaff4
[junit4] 2> 1809053 INFO (qtp314936565-30728) [n:127.0.0.1:37631_solr ] o.a.s.m.SolrMetricManager Closing metric reporters for registry=solr.core.testSuggestionsWithPayload.COLL.shard1.replica_n2 tag=SolrCore@74dfaff4
[junit4] 2> 1809053 INFO (qtp314936565-30728) [n:127.0.0.1:37631_solr ] o.a.s.m.SolrMetricManager Closing metric reporters for registry=solr.collection.testSuggestionsWithPayload.COLL.shard1.leader tag=SolrCore@74dfaff4
[junit4] 2> 1809053 INFO (qtp314936565-30728) [n:127.0.0.1:37631_solr ] o.a.s.u.DirectUpdateHandler2 Committing on IndexWriter.close() ... SKIPPED (unnecessary).
[junit4] 2> 1809054 INFO (qtp314936565-30728) [n:127.0.0.1:37631_solr ] o.a.s.c.ZkShardTerms Failed to save terms, version is not a match, retrying
[junit4] 2> 1809055 INFO (qtp314936565-30728) [n:127.0.0.1:37631_solr ] o.a.s.c.ZkShardTerms Successful update of terms at /collections/testSuggestionsWithPayload.COLL/terms/shard1 to Terms{values={}, version=3}
[junit4] 2> 1809056 INFO (qtp314936565-30728) [n:127.0.0.1:37631_solr ] o.a.s.c.ShardLeaderElectionContextBase No version found for ephemeral leader parent node, won't remove previous leader registration.
[junit4] 2> 1809056 INFO (qtp314936565-30728) [n:127.0.0.1:37631_solr ] o.a.s.s.HttpSolrCall [admin] webapp=null path=/admin/cores params={deleteInstanceDir=true&deleteMetricsHistory=true&core=testSuggestionsWithPayload.COLL_shard1_replica_n2&qt=/admin/cores&deleteDataDir=true&action=UNLOAD&wt=javabin&version=2} status=0 QTime=25
[junit4] 2> 1809056 INFO (qtp905784199-30722) [n:127.0.0.1:37115_solr ] o.a.s.c.ZkShardTerms Successful update of terms at /collections/testSuggestionsWithPayload.COLL/terms/shard1 to Terms{values={core_node4=0}, version=2}
[junit4] 2> 1809057 WARN (zkCallback-19479-thread-1) [ ] o.a.s.c.LeaderElector Our node is no longer in line to be leader
[junit4] 2> 1809058 INFO (qtp905784199-30722) [n:127.0.0.1:37115_solr ] o.a.s.s.HttpSolrCall [admin] webapp=null path=/admin/cores params={deleteInstanceDir=true&deleteMetricsHistory=true&core=testSuggestionsWithPayload.COLL_shard1_replica_n1&qt=/admin/cores&deleteDataDir=true&action=UNLOAD&wt=javabin&version=2} status=0 QTime=27
[junit4] 2> 1809160 INFO (zkCallback-19479-thread-1) [ ] o.a.s.c.c.ZkStateReader A cluster state change: [WatchedEvent state:SyncConnected type:NodeDeleted path:/collections/testSuggestionsWithPayload.COLL/state.json] for collection [testSuggestionsWithPayload.COLL] has occurred - updating... (live nodes size: [2])
[junit4] 2> 1809160 INFO (zkCallback-19457-thread-2) [ ] o.a.s.c.c.ZkStateReader A cluster state change: [WatchedEvent state:SyncConnected type:NodeDeleted path:/collections/testSuggestionsWithPayload.COLL/state.json] for collection [testSuggestionsWithPayload.COLL] has occurred - updating... (live nodes size: [2])
[junit4] 2> 1809160 INFO (zkCallback-19457-thread-1) [ ] o.a.s.c.c.ZkStateReader A cluster state change: [WatchedEvent state:SyncConnected type:NodeDeleted path:/collections/testSuggestionsWithPayload.COLL/state.json] for collection [testSuggestionsWithPayload.COLL] has occurred - updating... (live nodes size: [2])
[junit4] 2> 1809169 INFO (qtp905784199-30729) [n:127.0.0.1:37115_solr ] o.a.s.s.HttpSolrCall [admin] webapp=null path=/admin/collections params={name=testSuggestionsWithPayload.COLL&action=DELETE&wt=javabin&version=2} status=0 QTime=142
[junit4] 2> 1809170 INFO (TEST-AutoScalingHandlerTest.testSuggestionsWithPayload-seed#[9D7470B451B8BF5C]) [ ] o.a.s.SolrTestCaseJ4 ###Ending testSuggestionsWithPayload
[junit4] 2> 1809191 INFO (TEST-AutoScalingHandlerTest.testPolicyAndPreferences-seed#[9D7470B451B8BF5C]) [ ] o.a.s.SolrTestCaseJ4 ###Starting testPolicyAndPreferences
[junit4] 2> 1809208 ERROR (qtp314936565-30733) [n:127.0.0.1:37631_solr ] o.a.s.h.RequestHandlerBase org.apache.solr.api.ApiBag$ExceptionWithErrObject: Error in command payload, errors: [{set-policy={xyz=[{replica=<2, shard=#EACH, node=#ANY}, {nodeRole=!overseer, replica=0}], policy1=[{cores=<2, node=#ANY}, {replica=<2, shard=#EACH, node=#ANY}]}, errorMessages=[cores is only allowed in 'cluster-policy']}],
[junit4] 2> => org.apache.solr.api.ApiBag$ExceptionWithErrObject: Error in command payload, errors: [{set-policy={xyz=[{replica=<2, shard=#EACH, node=#ANY}, {nodeRole=!overseer, replica=0}], policy1=[{cores=<2, node=#ANY}, {replica=<2, shard=#EACH, node=#ANY}]}, errorMessages=[cores is only allowed in 'cluster-policy']}],
[junit4] 2> at org.apache.solr.cloud.autoscaling.AutoScalingHandler.processOps(AutoScalingHandler.java:246)
[junit4] 2> org.apache.solr.api.ApiBag$ExceptionWithErrObject: Error in command payload, errors: [{set-policy={xyz=[{replica=<2, shard=#EACH, node=#ANY}, {nodeRole=!overseer, replica=0}], policy1=[{cores=<2, node=#ANY}, {replica=<2, shard=#EACH, node=#ANY}]}, errorMessages=[cores is only allowed in 'cluster-policy']}],
[junit4] 2> at org.apache.solr.cloud.autoscaling.AutoScalingHandler.processOps(AutoScalingHandler.java:246) ~[java/:?]
[junit4] 2> at org.apache.solr.cloud.autoscaling.AutoScalingHandler.handleRequestBody(AutoScalingHandler.java:181) ~[java/:?]
[junit4] 2> at org.apache.solr.handler.RequestHandlerBase.handleRequest(RequestHandlerBase.java:216) ~[java/:?]
[junit4] 2> at org.apache.solr.api.ApiBag$ReqHandlerToApi.call(ApiBag.java:269) ~[java/:?]
[junit4] 2> at org.apache.solr.api.V2HttpCall.handleAdmin(V2HttpCall.java:341) ~[java/:?]
[junit4] 2> at org.apache.solr.servlet.HttpSolrCall.handleAdminRequest(HttpSolrCall.java:807) ~[java/:?]
[junit4] 2> at org.apache.solr.servlet.HttpSolrCall.call(HttpSolrCall.java:545) ~[java/:?]
[junit4] 2> at org.apache.solr.servlet.SolrDispatchFilter.doFilter(SolrDispatchFilter.java:437) ~[java/:?]
[junit4] 2> at org.apache.solr.servlet.SolrDispatchFilter.doFilter(SolrDispatchFilter.java:367) ~[java/:?]
[junit4] 2> at org.eclipse.jetty.servlet.FilterHolder.doFilter(FilterHolder.java:193) ~[jetty-servlet-9.4.53.v20231009.jar:9.4.53.v20231009]
[junit4] 2> at org.eclipse.jetty.servlet.ServletHandler$Chain.doFilter(ServletHandler.java:1626) ~[jetty-servlet-9.4.53.v20231009.jar:9.4.53.v20231009]
[junit4] 2> at org.apache.solr.client.solrj.embedded.JettySolrRunner$DebugFilter.doFilter(JettySolrRunner.java:166) ~[java/:?]
[junit4] 2> at org.eclipse.jetty.servlet.FilterHolder.doFilter(FilterHolder.java:193) ~[jetty-servlet-9.4.53.v20231009.jar:9.4.53.v20231009]
[junit4] 2> at org.eclipse.jetty.servlet.ServletHandler$Chain.doFilter(ServletHandler.java:1626) ~[jetty-servlet-9.4.53.v20231009.jar:9.4.53.v20231009]
[junit4] 2> at org.eclipse.jetty.servlet.ServletHandler.doHandle(ServletHandler.java:552) ~[jetty-servlet-9.4.53.v20231009.jar:9.4.53.v20231009]
[junit4] 2> at org.eclipse.jetty.server.handler.ScopedHandler.nextHandle(ScopedHandler.java:233) ~[jetty-server-9.4.53.v20231009.jar:9.4.53.v20231009]
[junit4] 2> at org.eclipse.jetty.server.session.SessionHandler.doHandle(SessionHandler.java:1624) ~[jetty-server-9.4.53.v20231009.jar:9.4.53.v20231009]
[junit4] 2> at org.eclipse.jetty.server.handler.ScopedHandler.nextHandle(ScopedHandler.java:233) ~[jetty-server-9.4.53.v20231009.jar:9.4.53.v20231009]
[junit4] 2> at org.eclipse.jetty.server.handler.ContextHandler.doHandle(ContextHandler.java:1440) ~[jetty-server-9.4.53.v20231009.jar:9.4.53.v20231009]
[junit4] 2> at org.eclipse.jetty.server.handler.ScopedHandler.nextScope(ScopedHandler.java:188) ~[jetty-server-9.4.53.v20231009.jar:9.4.53.v20231009]
[junit4] 2> at org.eclipse.jetty.servlet.ServletHandler.doScope(ServletHandler.java:505) ~[jetty-servlet-9.4.53.v20231009.jar:9.4.53.v20231009]
[junit4] 2> at org.eclipse.jetty.server.session.SessionHandler.doScope(SessionHandler.java:1594) ~[jetty-server-9.4.53.v20231009.jar:9.4.53.v20231009]
[junit4] 2> at org.eclipse.jetty.server.handler.ScopedHandler.nextScope(ScopedHandler.java:186) ~[jetty-server-9.4.53.v20231009.jar:9.4.53.v20231009]
[junit4] 2> at org.eclipse.jetty.server.handler.ContextHandler.doScope(ContextHandler.java:1355) ~[jetty-server-9.4.53.v20231009.jar:9.4.53.v20231009]
[junit4] 2> at org.eclipse.jetty.server.handler.ScopedHandler.handle(ScopedHandler.java:141) ~[jetty-server-9.4.53.v20231009.jar:9.4.53.v20231009]
[junit4] 2> at org.eclipse.jetty.server.handler.HandlerWrapper.handle(HandlerWrapper.java:127) ~[jetty-server-9.4.53.v20231009.jar:9.4.53.v20231009]
[junit4] 2> at org.eclipse.jetty.rewrite.handler.RewriteHandler.handle(RewriteHandler.java:322) ~[jetty-rewrite-9.4.53.v20231009.jar:9.4.53.v20231009]
[junit4] 2> at org.eclipse.jetty.server.handler.gzip.GzipHandler.handle(GzipHandler.java:722) ~[jetty-server-9.4.53.v20231009.jar:9.4.53.v20231009]
[junit4] 2> at org.eclipse.jetty.server.handler.HandlerWrapper.handle(HandlerWrapper.java:127) ~[jetty-server-9.4.53.v20231009.jar:9.4.53.v20231009]
[junit4] 2> at org.eclipse.jetty.server.Server.handle(Server.java:516) ~[jetty-server-9.4.53.v20231009.jar:9.4.53.v20231009]
[junit4] 2> at org.eclipse.jetty.server.HttpChannel.lambda$handle$1(HttpChannel.java:487) ~[jetty-server-9.4.53.v20231009.jar:9.4.53.v20231009]
[junit4] 2> at org.eclipse.jetty.server.HttpChannel.dispatch(HttpChannel.java:732) [jetty-server-9.4.53.v20231009.jar:9.4.53.v20231009]
[junit4] 2> at org.eclipse.jetty.server.HttpChannel.handle(HttpChannel.java:479) [jetty-server-9.4.53.v20231009.jar:9.4.53.v20231009]
[junit4] 2> at org.eclipse.jetty.server.HttpConnection.onFillable(HttpConnection.java:277) [jetty-server-9.4.53.v20231009.jar:9.4.53.v20231009]
[junit4] 2> at org.eclipse.jetty.io.AbstractConnection$ReadCallback.succeeded(AbstractConnection.java:311) [jetty-io-9.4.53.v20231009.jar:9.4.53.v20231009]
[junit4] 2> at org.eclipse.jetty.io.FillInterest.fillable(FillInterest.java:105) [jetty-io-9.4.53.v20231009.jar:9.4.53.v20231009]
[junit4] 2> at org.eclipse.jetty.io.ssl.SslConnection$DecryptedEndPoint.onFillable(SslConnection.java:555) [jetty-io-9.4.53.v20231009.jar:9.4.53.v20231009]
[junit4] 2> at org.eclipse.jetty.io.ssl.SslConnection.onFillable(SslConnection.java:410) [jetty-io-9.4.53.v20231009.jar:9.4.53.v20231009]
[junit4] 2> at org.eclipse.jetty.io.ssl.SslConnection$2.succeeded(SslConnection.java:164) [jetty-io-9.4.53.v20231009.jar:9.4.53.v20231009]
[junit4] 2> at org.eclipse.jetty.io.FillInterest.fillable(FillInterest.java:105) [jetty-io-9.4.53.v20231009.jar:9.4.53.v20231009]
[junit4] 2> at org.eclipse.jetty.io.ChannelEndPoint$1.run(ChannelEndPoint.java:104) [jetty-io-9.4.53.v20231009.jar:9.4.53.v20231009]
[junit4] 2> at org.eclipse.jetty.util.thread.QueuedThreadPool.runJob(QueuedThreadPool.java:883) [jetty-util-9.4.53.v20231009.jar:9.4.53.v20231009]
[junit4] 2> at org.eclipse.jetty.util.thread.QueuedThreadPool$Runner.run(QueuedThreadPool.java:1034) [jetty-util-9.4.53.v20231009.jar:9.4.53.v20231009]
[junit4] 2> at java.lang.Thread.run(Thread.java:750) [?:1.8.0_362]
[junit4] 2> 1809209 INFO (qtp314936565-30733) [n:127.0.0.1:37631_solr ] o.a.s.s.HttpSolrCall [admin] webapp=null path=/cluster/autoscaling params={wt=javabin&version=2} status=400 QTime=3
[junit4] 2> 1809211 INFO (qtp905784199-30725) [n:127.0.0.1:37115_solr ] o.a.s.s.HttpSolrCall HttpSolrCall.init(https://127.0.0.1:37115/solr/admin/autoscaling?wt=javabin&version=2)
[junit4] 2> 1809212 INFO (qtp905784199-30727) [n:127.0.0.1:37115_solr ] o.a.s.s.HttpSolrCall HttpSolrCall.init(https://127.0.0.1:37115/solr/admin/metrics?null)
[junit4] 2> 1809213 INFO (qtp905784199-30727) [n:127.0.0.1:37115_solr ] o.a.s.s.HttpSolrCall [admin] webapp=null path=/admin/metrics params={prefix=CONTAINER.fs.usableSpace,CONTAINER.cores&wt=javabin&version=2&group=solr.node} status=0 QTime=0
[junit4] 2> 1809214 INFO (qtp314936565-30734) [n:127.0.0.1:37631_solr ] o.a.s.s.HttpSolrCall HttpSolrCall.init(https://127.0.0.1:37631/solr/admin/metrics?null)
[junit4] 2> 1809214 INFO (qtp314936565-30734) [n:127.0.0.1:37631_solr ] o.a.s.s.HttpSolrCall [admin] webapp=null path=/admin/metrics params={prefix=CONTAINER.fs.usableSpace,CONTAINER.cores&wt=javabin&version=2&group=solr.node} status=0 QTime=0
[junit4] 2> 1809216 INFO (qtp905784199-30725) [n:127.0.0.1:37115_solr ] o.a.s.s.HttpSolrCall [admin] webapp=null path=/admin/autoscaling params={wt=javabin&version=2} status=0 QTime=4
[junit4] 2> 1809216 INFO (qtp905784199-30731) [n:127.0.0.1:37115_solr ] o.a.s.s.HttpSolrCall HttpSolrCall.init(https://127.0.0.1:37115/solr/admin/autoscaling?wt=javabin&version=2)
[junit4] 2> 1809217 INFO (qtp905784199-30722) [n:127.0.0.1:37115_solr ] o.a.s.s.HttpSolrCall HttpSolrCall.init(https://127.0.0.1:37115/solr/admin/metrics?null)
[junit4] 2> 1809218 INFO (qtp905784199-30722) [n:127.0.0.1:37115_solr ] o.a.s.s.HttpSolrCall [admin] webapp=null path=/admin/metrics params={prefix=CONTAINER.fs.usableSpace,CONTAINER.cores&wt=javabin&version=2&group=solr.node} status=0 QTime=0
[junit4] 2> 1809218 INFO (qtp314936565-30728) [n:127.0.0.1:37631_solr ] o.a.s.s.HttpSolrCall HttpSolrCall.init(https://127.0.0.1:37631/solr/admin/metrics?null)
[junit4] 2> 1809219 INFO (qtp314936565-30728) [n:127.0.0.1:37631_solr ] o.a.s.s.HttpSolrCall [admin] webapp=null path=/admin/metrics params={prefix=CONTAINER.fs.usableSpace,CONTAINER.cores&wt=javabin&version=2&group=solr.node} status=0 QTime=0
[junit4] 2> 1809219 INFO (qtp905784199-30731) [n:127.0.0.1:37115_solr ] o.a.s.s.HttpSolrCall [admin] webapp=null path=/admin/autoscaling params={wt=javabin&version=2} status=0 QTime=2
[junit4] 2> 1809220 INFO (qtp905784199-30729) [n:127.0.0.1:37115_solr ] o.a.s.s.HttpSolrCall HttpSolrCall.init(https://127.0.0.1:37115/solr/admin/autoscaling?wt=javabin&version=2)
[junit4] 2> 1809221 INFO (qtp905784199-30727) [n:127.0.0.1:37115_solr ] o.a.s.s.HttpSolrCall HttpSolrCall.init(https://127.0.0.1:37115/solr/admin/metrics?null)
[junit4] 2> 1809222 INFO (qtp905784199-30727) [n:127.0.0.1:37115_solr ] o.a.s.s.HttpSolrCall [admin] webapp=null path=/admin/metrics params={prefix=CONTAINER.fs.usableSpace,CONTAINER.cores&wt=javabin&version=2&group=solr.node} status=0 QTime=0
[junit4] 2> 1809222 INFO (qtp314936565-30730) [n:127.0.0.1:37631_solr ] o.a.s.s.HttpSolrCall HttpSolrCall.init(https://127.0.0.1:37631/solr/admin/metrics?null)
[junit4] 2> 1809223 INFO (qtp314936565-30730) [n:127.0.0.1:37631_solr ] o.a.s.s.HttpSolrCall [admin] webapp=null path=/admin/metrics params={prefix=CONTAINER.fs.usableSpace,CONTAINER.cores&wt=javabin&version=2&group=solr.node} status=0 QTime=0
[junit4] 2> 1809225 INFO (qtp905784199-30729) [n:127.0.0.1:37115_solr ] o.a.s.s.HttpSolrCall [admin] webapp=null path=/admin/autoscaling params={wt=javabin&version=2} status=0 QTime=4
[junit4] 2> 1809226 INFO (qtp905784199-30722) [n:127.0.0.1:37115_solr ] o.a.s.s.HttpSolrCall HttpSolrCall.init(https://127.0.0.1:37115/solr/admin/metrics?null)
[junit4] 2> 1809227 INFO (qtp905784199-30722) [n:127.0.0.1:37115_solr ] o.a.s.s.HttpSolrCall [admin] webapp=null path=/admin/metrics params={prefix=CONTAINER.fs.usableSpace,CONTAINER.cores,os.systemLoadAverage&wt=javabin&version=2&group=solr.jvm,solr.node} status=0 QTime=0
[junit4] 2> 1809227 INFO (qtp314936565-30732) [n:127.0.0.1:37631_solr ] o.a.s.s.HttpSolrCall HttpSolrCall.init(https://127.0.0.1:37631/solr/admin/metrics?null)
[junit4] 2> 1809228 INFO (qtp314936565-30732) [n:127.0.0.1:37631_solr ] o.a.s.s.HttpSolrCall [admin] webapp=null path=/admin/metrics params={prefix=CONTAINER.fs.usableSpace,CONTAINER.cores,os.systemLoadAverage&wt=javabin&version=2&group=solr.jvm,solr.node} status=0 QTime=0
[junit4] 2> 1809229 INFO (qtp905784199-30725) [n:127.0.0.1:37115_solr ] o.a.s.s.HttpSolrCall [admin] webapp=null path=/cluster/autoscaling params={wt=javabin&version=2} status=0 QTime=3
[junit4] 2> 1809243 INFO (qtp905784199-30722) [n:127.0.0.1:37115_solr ] o.a.s.s.HttpSolrCall HttpSolrCall.init(https://127.0.0.1:37115/solr/admin/metrics?null)
[junit4] 2> 1809244 INFO (qtp905784199-30722) [n:127.0.0.1:37115_solr ] o.a.s.s.HttpSolrCall [admin] webapp=null path=/admin/metrics params={prefix=os.systemLoadAverage&wt=javabin&version=2&group=solr.jvm} status=0 QTime=0
[junit4] 2> 1809257 INFO (qtp314936565-30730) [n:127.0.0.1:37631_solr ] o.a.s.s.HttpSolrCall HttpSolrCall.init(https://127.0.0.1:37631/solr/admin/metrics?null)
[junit4] 2> 1809258 INFO (qtp314936565-30730) [n:127.0.0.1:37631_solr ] o.a.s.s.HttpSolrCall [admin] webapp=null path=/admin/metrics params={prefix=os.systemLoadAverage&wt=javabin&version=2&group=solr.jvm} status=0 QTime=0
[junit4] 2> 1809258 INFO (qtp314936565-30733) [n:127.0.0.1:37631_solr ] o.a.s.s.HttpSolrCall [admin] webapp=null path=/cluster/autoscaling params={wt=javabin&version=2} status=0 QTime=28
[junit4] 2> 1809262 INFO (qtp905784199-30725) [n:127.0.0.1:37115_solr ] o.a.s.s.HttpSolrCall HttpSolrCall.init(https://127.0.0.1:37115/solr/admin/metrics?null)
[junit4] 2> 1809262 INFO (qtp905784199-30725) [n:127.0.0.1:37115_solr ] o.a.s.s.HttpSolrCall [admin] webapp=null path=/admin/metrics params={prefix=CONTAINER.cores,os.systemLoadAverage&wt=javabin&version=2&group=solr.jvm,solr.node} status=0 QTime=0
[junit4] 2> 1809264 INFO (qtp314936565-30734) [n:127.0.0.1:37631_solr ] o.a.s.s.HttpSolrCall HttpSolrCall.init(https://127.0.0.1:37631/solr/admin/metrics?null)
[junit4] 2> 1809265 INFO (qtp314936565-30734) [n:127.0.0.1:37631_solr ] o.a.s.s.HttpSolrCall [admin] webapp=null path=/admin/metrics params={prefix=CONTAINER.cores,os.systemLoadAverage&wt=javabin&version=2&group=solr.jvm,solr.node} status=0 QTime=0
[junit4] 2> 1809265 INFO (qtp314936565-30732) [n:127.0.0.1:37631_solr ] o.a.s.s.HttpSolrCall [admin] webapp=null path=/cluster/autoscaling params={wt=javabin&version=2} status=0 QTime=5
[junit4] 2> 1809267 INFO (qtp905784199-30731) [n:127.0.0.1:37115_solr ] o.a.s.s.HttpSolrCall HttpSolrCall.init(https://127.0.0.1:37115/solr/admin/autoscaling?wt=javabin&version=2)
[junit4] 2> 1809281 INFO (qtp905784199-30727) [n:127.0.0.1:37115_solr ] o.a.s.s.HttpSolrCall HttpSolrCall.init(https://127.0.0.1:37115/solr/admin/metrics?null)
[junit4] 2> 1809282 INFO (qtp905784199-30727) [n:127.0.0.1:37115_solr ] o.a.s.s.HttpSolrCall [admin] webapp=null path=/admin/metrics params={prefix=CONTAINER.cores,os.systemLoadAverage&wt=javabin&version=2&group=solr.jvm,solr.node} status=0 QTime=0
[junit4] 2> 1809282 INFO (qtp314936565-30728) [n:127.0.0.1:37631_solr ] o.a.s.s.HttpSolrCall HttpSolrCall.init(https://127.0.0.1:37631/solr/admin/metrics?null)
[junit4] 2> 1809283 INFO (qtp314936565-30728) [n:127.0.0.1:37631_solr ] o.a.s.s.HttpSolrCall [admin] webapp=null path=/admin/metrics params={prefix=CONTAINER.cores,os.systemLoadAverage&wt=javabin&version=2&group=solr.jvm,solr.node} status=0 QTime=0
[junit4] 2> 1809284 INFO (qtp905784199-30731) [n:127.0.0.1:37115_solr ] o.a.s.s.HttpSolrCall [admin] webapp=null path=/admin/autoscaling params={wt=javabin&version=2} status=0 QTime=17
[junit4] 2> 1809285 INFO (TEST-AutoScalingHandlerTest.testPolicyAndPreferences-seed#[9D7470B451B8BF5C]) [ ] o.a.s.SolrTestCaseJ4 ###Ending testPolicyAndPreferences
[junit4] 2> 1809305 INFO (TEST-AutoScalingHandlerTest.testSuspendTrigger-seed#[9D7470B451B8BF5C]) [ ] o.a.s.SolrTestCaseJ4 ###Starting testSuspendTrigger
[junit4] 2> 1809307 INFO (qtp905784199-30729) [n:127.0.0.1:37115_solr ] o.a.s.s.HttpSolrCall [admin] webapp=null path=/cluster/autoscaling params={wt=javabin&version=2} status=0 QTime=0
[junit4] 2> 1809308 INFO (qtp314936565-30730) [n:127.0.0.1:37631_solr ] o.a.s.s.HttpSolrCall [admin] webapp=null path=/cluster/autoscaling params={wt=javabin&version=2} status=0 QTime=0
[junit4] 2> 1809333 INFO (qtp905784199-30722) [n:127.0.0.1:37115_solr ] o.a.s.s.HttpSolrCall HttpSolrCall.init(https://127.0.0.1:37115/solr/admin/metrics?null)
[junit4] 2> 1809334 INFO (qtp905784199-30722) [n:127.0.0.1:37115_solr ] o.a.s.s.HttpSolrCall [admin] webapp=null path=/admin/metrics params={prefix=CONTAINER.fs.usableSpace,CONTAINER.fs.totalSpace,CONTAINER.cores&wt=javabin&version=2&group=solr.node} status=0 QTime=0
[junit4] 2> 1809334 INFO (qtp314936565-30734) [n:127.0.0.1:37631_solr ] o.a.s.s.HttpSolrCall HttpSolrCall.init(https://127.0.0.1:37631/solr/admin/metrics?null)
[junit4] 2> 1809335 INFO (qtp314936565-30734) [n:127.0.0.1:37631_solr ] o.a.s.s.HttpSolrCall [admin] webapp=null path=/admin/metrics params={prefix=CONTAINER.fs.usableSpace,CONTAINER.fs.totalSpace,CONTAINER.cores&wt=javabin&version=2&group=solr.node} status=0 QTime=0
[junit4] 2> 1809336 INFO (qtp314936565-30733) [n:127.0.0.1:37631_solr ] o.a.s.s.HttpSolrCall [admin] webapp=null path=/cluster/autoscaling params={wt=javabin&version=2} status=0 QTime=27
[junit4] 2> 1809343 INFO (qtp905784199-30727) [n:127.0.0.1:37115_solr ] o.a.s.s.HttpSolrCall HttpSolrCall.init(https://127.0.0.1:37115/solr/admin/metrics?null)
[junit4] 2> 1809343 INFO (qtp905784199-30727) [n:127.0.0.1:37115_solr ] o.a.s.s.HttpSolrCall [admin] webapp=null path=/admin/metrics params={prefix=CONTAINER.fs.usableSpace,CONTAINER.fs.totalSpace,CONTAINER.cores&wt=javabin&version=2&group=solr.node} status=0 QTime=0
[junit4] 2> 1809344 INFO (qtp314936565-30732) [n:127.0.0.1:37631_solr ] o.a.s.s.HttpSolrCall HttpSolrCall.init(https://127.0.0.1:37631/solr/admin/metrics?null)
[junit4] 2> 1809344 INFO (qtp314936565-30732) [n:127.0.0.1:37631_solr ] o.a.s.s.HttpSolrCall [admin] webapp=null path=/admin/metrics params={prefix=CONTAINER.fs.usableSpace,CONTAINER.fs.totalSpace,CONTAINER.cores&wt=javabin&version=2&group=solr.node} status=0 QTime=0
[junit4] 2> 1809345 INFO (qtp905784199-30725) [n:127.0.0.1:37115_solr ] o.a.s.s.HttpSolrCall [admin] webapp=null path=/cluster/autoscaling params={wt=javabin&version=2} status=0 QTime=7
[junit4] 2> 1809346 INFO (qtp905784199-30731) [n:127.0.0.1:37115_solr ] o.a.s.s.HttpSolrCall HttpSolrCall.init(https://127.0.0.1:37115/solr/admin/autoscaling?wt=javabin&version=2)
[junit4] 2> 1809347 INFO (qtp905784199-30729) [n:127.0.0.1:37115_solr ] o.a.s.s.HttpSolrCall HttpSolrCall.init(https://127.0.0.1:37115/solr/admin/metrics?null)
[junit4] 2> 1809347 INFO (qtp905784199-30729) [n:127.0.0.1:37115_solr ] o.a.s.s.HttpSolrCall [admin] webapp=null path=/admin/metrics params={prefix=CONTAINER.fs.usableSpace,CONTAINER.fs.totalSpace,CONTAINER.cores&wt=javabin&version=2&group=solr.node} status=0 QTime=0
[junit4] 2> 1809348 INFO (qtp314936565-30728) [n:127.0.0.1:37631_solr ] o.a.s.s.HttpSolrCall HttpSolrCall.init(https://127.0.0.1:37631/solr/admin/metrics?null)
[junit4] 2> 1809349 INFO (qtp314936565-30728) [n:127.0.0.1:37631_solr ] o.a.s.s.HttpSolrCall [admin] webapp=null path=/admin/metrics params={prefix=CONTAINER.fs.usableSpace,CONTAINER.fs.totalSpace,CONTAINER.cores&wt=javabin&version=2&group=solr.node} status=0 QTime=0
[junit4] 2> 1809350 INFO (qtp905784199-30731) [n:127.0.0.1:37115_solr ] o.a.s.s.HttpSolrCall [admin] webapp=null path=/admin/autoscaling params={wt=javabin&version=2} status=0 QTime=3
[junit4] 2> 1809353 INFO (qtp905784199-30727) [n:127.0.0.1:37115_solr ] o.a.s.s.HttpSolrCall HttpSolrCall.init(https://127.0.0.1:37115/solr/admin/metrics?null)
[junit4] 2> 1809353 INFO (qtp905784199-30727) [n:127.0.0.1:37115_solr ] o.a.s.s.HttpSolrCall [admin] webapp=null path=/admin/metrics params={prefix=CONTAINER.fs.usableSpace,CONTAINER.fs.totalSpace,CONTAINER.cores&wt=javabin&version=2&group=solr.node} status=0 QTime=0
[junit4] 2> 1809354 INFO (qtp314936565-30730) [n:127.0.0.1:37631_solr ] o.a.s.s.HttpSolrCall HttpSolrCall.init(https://127.0.0.1:37631/solr/admin/metrics?null)
[junit4] 2> 1809355 INFO (qtp314936565-30730) [n:127.0.0.1:37631_solr ] o.a.s.s.HttpSolrCall [admin] webapp=null path=/admin/metrics params={prefix=CONTAINER.fs.usableSpace,CONTAINER.fs.totalSpace,CONTAINER.cores&wt=javabin&version=2&group=solr.node} status=0 QTime=0
[junit4] 2> 1809355 INFO (qtp905784199-30722) [n:127.0.0.1:37115_solr ] o.a.s.s.HttpSolrCall [admin] webapp=null path=/cluster/autoscaling params={wt=javabin&version=2} status=0 QTime=3
[junit4] 2> 1809356 INFO (qtp905784199-30725) [n:127.0.0.1:37115_solr ] o.a.s.s.HttpSolrCall HttpSolrCall.init(https://127.0.0.1:37115/solr/admin/autoscaling?wt=javabin&version=2)
[junit4] 2> 1809357 INFO (qtp905784199-30729) [n:127.0.0.1:37115_solr ] o.a.s.s.HttpSolrCall HttpSolrCall.init(https://127.0.0.1:37115/solr/admin/metrics?null)
[junit4] 2> 1809357 INFO (qtp905784199-30729) [n:127.0.0.1:37115_solr ] o.a.s.s.HttpSolrCall [admin] webapp=null path=/admin/metrics params={prefix=CONTAINER.fs.usableSpace,CONTAINER.fs.totalSpace,CONTAINER.cores&wt=javabin&version=2&group=solr.node} status=0 QTime=0
[junit4] 2> 1809358 INFO (qtp314936565-30734) [n:127.0.0.1:37631_solr ] o.a.s.s.HttpSolrCall HttpSolrCall.init(https://127.0.0.1:37631/solr/admin/metrics?null)
[junit4] 2> 1809358 INFO (qtp314936565-30734) [n:127.0.0.1:37631_solr ] o.a.s.s.HttpSolrCall [admin] webapp=null path=/admin/metrics params={prefix=CONTAINER.fs.usableSpace,CONTAINER.fs.totalSpace,CONTAINER.cores&wt=javabin&version=2&group=solr.node} status=0 QTime=0
[junit4] 2> 1809359 INFO (qtp905784199-30725) [n:127.0.0.1:37115_solr ] o.a.s.s.HttpSolrCall [admin] webapp=null path=/admin/autoscaling params={wt=javabin&version=2} status=0 QTime=3
[junit4] 2> 1809360 INFO (qtp905784199-30731) [n:127.0.0.1:37115_solr ] o.a.s.s.HttpSolrCall HttpSolrCall.init(https://127.0.0.1:37115/solr/admin/autoscaling?wt=javabin&version=2)
[junit4] 2> 1809361 INFO (qtp905784199-30727) [n:127.0.0.1:37115_solr ] o.a.s.s.HttpSolrCall HttpSolrCall.init(https://127.0.0.1:37115/solr/admin/metrics?null)
[junit4] 2> 1809362 INFO (qtp905784199-30727) [n:127.0.0.1:37115_solr ] o.a.s.s.HttpSolrCall [admin] webapp=null path=/admin/metrics params={prefix=CONTAINER.fs.usableSpace,CONTAINER.fs.totalSpace,CONTAINER.cores&wt=javabin&version=2&group=solr.node} status=0 QTime=0
[junit4] 2> 1809362 INFO (qtp314936565-30733) [n:127.0.0.1:37631_solr ] o.a.s.s.HttpSolrCall HttpSolrCall.init(https://127.0.0.1:37631/solr/admin/metrics?null)
[junit4] 2> 1809362 INFO (qtp314936565-30733) [n:127.0.0.1:37631_solr ] o.a.s.s.HttpSolrCall [admin] webapp=null path=/admin/metrics params={prefix=CONTAINER.fs.usableSpace,CONTAINER.fs.totalSpace,CONTAINER.cores&wt=javabin&version=2&group=solr.node} status=0 QTime=0
[junit4] 2> 1809363 INFO (qtp905784199-30731) [n:127.0.0.1:37115_solr ] o.a.s.s.HttpSolrCall [admin] webapp=null path=/admin/autoscaling params={wt=javabin&version=2} status=0 QTime=2
[junit4] 2> 1809364 INFO (qtp905784199-30722) [n:127.0.0.1:37115_solr ] o.a.s.s.HttpSolrCall HttpSolrCall.init(https://127.0.0.1:37115/solr/admin/autoscaling?wt=javabin&version=2)
[junit4] 2> 1809365 INFO (qtp905784199-30729) [n:127.0.0.1:37115_solr ] o.a.s.s.HttpSolrCall HttpSolrCall.init(https://127.0.0.1:37115/solr/admin/metrics?null)
[junit4] 2> 1809366 INFO (qtp905784199-30729) [n:127.0.0.1:37115_solr ] o.a.s.s.HttpSolrCall [admin] webapp=null path=/admin/metrics params={prefix=CONTAINER.fs.usableSpace,CONTAINER.fs.totalSpace,CONTAINER.cores&wt=javabin&version=2&group=solr.node} status=0 QTime=0
[junit4] 2> 1809368 INFO (qtp314936565-30732) [n:127.0.0.1:37631_solr ] o.a.s.s.HttpSolrCall HttpSolrCall.init(https://127.0.0.1:37631/solr/admin/metrics?null)
[junit4] 2> 1809368 INFO (qtp314936565-30732) [n:127.0.0.1:37631_solr ] o.a.s.s.HttpSolrCall [admin] webapp=null path=/admin/metrics params={prefix=CONTAINER.fs.usableSpace,CONTAINER.fs.totalSpace,CONTAINER.cores&wt=javabin&version=2&group=solr.node} status=0 QTime=0
[junit4] 2> 1809370 INFO (qtp905784199-30722) [n:127.0.0.1:37115_solr ] o.a.s.s.HttpSolrCall [admin] webapp=null path=/admin/autoscaling params={wt=javabin&version=2} status=0 QTime=5
[junit4] 2> 1809370 WARN (zkCallback-19457-thread-2) [ ] o.a.s.c.a.OverseerTriggerThread Error in trigger 'node_lost_trigger' configuration, trigger config ignored: {
[junit4] 2> "event":"nodeLost",
[junit4] 2> "waitFor":600,
[junit4] 2> "enabled":"false",
[junit4] 2> "actions":[
[junit4] 2> {
[junit4] 2> "name":"compute_plan",
[junit4] 2> "class":"solr.ComputePlanAction"},
[junit4] 2> {
[junit4] 2> "name":"execute_plan",
[junit4] 2> "class":"solr.ExecutePlanAction"}],
[junit4] 2> "resumeAt":"3611695517"}
[junit4] 2> => TriggerValidationException{name=node_lost_trigger, details='{resumeAt=unknown property}'}
[junit4] 2> at org.apache.solr.cloud.autoscaling.TriggerBase.configure(TriggerBase.java:136)
[junit4] 2> org.apache.solr.cloud.autoscaling.TriggerValidationException: null
[junit4] 2> at org.apache.solr.cloud.autoscaling.TriggerBase.configure(TriggerBase.java:136) ~[java/:?]
[junit4] 2> at org.apache.solr.cloud.autoscaling.NodeLostTrigger.configure(NodeLostTrigger.java:105) ~[java/:?]
[junit4] 2> at org.apache.solr.cloud.autoscaling.AutoScaling$TriggerFactoryImpl.create(AutoScaling.java:194) ~[java/:?]
[junit4] 2> at org.apache.solr.cloud.autoscaling.OverseerTriggerThread.loadTriggers(OverseerTriggerThread.java:394) ~[java/:?]
[junit4] 2> at org.apache.solr.cloud.autoscaling.OverseerTriggerThread.refreshAutoScalingConf(OverseerTriggerThread.java:331) ~[java/:?]
[junit4] 2> at org.apache.solr.cloud.autoscaling.OverseerTriggerThread.access$000(OverseerTriggerThread.java:58) ~[java/:?]
[junit4] 2> at org.apache.solr.cloud.autoscaling.OverseerTriggerThread$AutoScalingWatcher.process(OverseerTriggerThread.java:301) ~[java/:?]
[junit4] 2> at org.apache.solr.common.cloud.SolrZkClient$ProcessWatchWithExecutor.lambda$process$1(SolrZkClient.java:876) ~[java/:?]
[...truncated too long message...]
NFO (jetty-closer-19590-thread-2) [ ] o.e.j.s.AbstractConnector Stopped ServerConnector@5d3f6ae6{SSL, (ssl, http/1.1)}{127.0.0.1:0}
[junit4] 2> 1818054 INFO (jetty-closer-19590-thread-2) [ ] o.e.j.s.h.ContextHandler Stopped o.e.j.s.ServletContextHandler@3d11cdec{/solr,null,STOPPED}
[junit4] 2> 1818054 INFO (jetty-closer-19590-thread-2) [ ] o.e.j.s.session node0 Stopped scavenging
[junit4] 2> 1818152 INFO (jetty-closer-19590-thread-1) [ ] o.a.s.c.Overseer Overseer (id=72294053910020102-127.0.0.1:37115_solr-n_0000000000) closing
[junit4] 2> 1818153 INFO (jetty-closer-19590-thread-1) [ ] o.e.j.s.AbstractConnector Stopped ServerConnector@7a07d973{SSL, (ssl, http/1.1)}{127.0.0.1:0}
[junit4] 2> 1818153 INFO (jetty-closer-19590-thread-1) [ ] o.e.j.s.h.ContextHandler Stopped o.e.j.s.ServletContextHandler@7ada5a2f{/solr,null,STOPPED}
[junit4] 2> 1818153 INFO (jetty-closer-19590-thread-1) [ ] o.e.j.s.session node0 Stopped scavenging
[junit4] 2> 1818156 INFO (SUITE-AutoScalingHandlerTest-seed#[9D7470B451B8BF5C]-worker) [ ] o.a.s.c.ZkTestServer Shutting down ZkTestServer.
[junit4] 2> 1818362 WARN (ZkTestServer Run Thread) [ ] o.a.s.c.ZkTestServer Watch limit violations:
[junit4] 2> Maximum concurrent create/delete watches above limit:
[junit4] 2>
[junit4] 2> 18 /solr/collections/readApiTestViolations/terms/shard1
[junit4] 2> 9 /solr/collections/testSuggestionsWithPayload.COLL/terms/shard1
[junit4] 2> 8 /solr/collections/testDiagnosticsWithPayload.COLL/terms/shard1
[junit4] 2> 7 /solr/configs/conf
[junit4] 2> 4 /solr/aliases.json
[junit4] 2> 3 /solr/collections/readApiTestViolations/collectionprops.json
[junit4] 2> 3 /solr/packages.json
[junit4] 2> 3 /solr/security.json
[junit4] 2> 3 /solr/collections/testSuggestionsWithPayload.COLL/state.json
[junit4] 2> 3 /solr/collections/COLL1/state.json
[junit4] 2> 3 /solr/collections/testDiagnosticsWithPayload.COLL/state.json
[junit4] 2> 3 /solr/collections/COLL1/terms/shard1
[junit4] 2>
[junit4] 2> Maximum concurrent data watches above limit:
[junit4] 2>
[junit4] 2> 147 /solr/autoscaling.json
[junit4] 2> 31 /solr/collections/readApiTestViolations/state.json
[junit4] 2> 9 /solr/collections/testSuggestionsWithPayload.COLL/state.json
[junit4] 2> 9 /solr/collections/testDiagnosticsWithPayload.COLL/state.json
[junit4] 2> 6 /solr/collections/COLL1/state.json
[junit4] 2> 4 /solr/clusterprops.json
[junit4] 2> 4 /solr/clusterstate.json
[junit4] 2> 2 /solr/collections/readApiTestViolations/leader_elect/shard1/election/72294053910020102-core_node11-n_0000000003
[junit4] 2>
[junit4] 2> Maximum concurrent children watches above limit:
[junit4] 2>
[junit4] 2> 87 /solr/overseer/queue
[junit4] 2> 27 /solr/collections
[junit4] 2> 26 /solr/overseer/collection-queue-work
[junit4] 2> 14 /solr/live_nodes
[junit4] 2> 4 /solr/collections/readApiTestViolations/state.json
[junit4] 2> 3 /solr/collections/testSuggestionsWithPayload.COLL/state.json
[junit4] 2> 3 /solr/collections/COLL1/state.json
[junit4] 2> 3 /solr/collections/testDiagnosticsWithPayload.COLL/state.json
[junit4] 2> 2 /solr/autoscaling/events/node_lost_trigger
[junit4] 2> 2 /solr/autoscaling/events/node_added_trigger
[junit4] 2>
[junit4] 2> 1818367 INFO (SUITE-AutoScalingHandlerTest-seed#[9D7470B451B8BF5C]-worker) [ ] o.a.s.c.ZkTestServer waitForServerDown: 127.0.0.1:40177
[junit4] 2> 1818367 INFO (SUITE-AutoScalingHandlerTest-seed#[9D7470B451B8BF5C]-worker) [ ] o.a.s.c.ZkTestServer parse host and port list: 127.0.0.1:40177
[junit4] 2> 1818367 INFO (SUITE-AutoScalingHandlerTest-seed#[9D7470B451B8BF5C]-worker) [ ] o.a.s.c.ZkTestServer connecting to 127.0.0.1 40177
[junit4] 2> 1818368 INFO (SUITE-AutoScalingHandlerTest-seed#[9D7470B451B8BF5C]-worker) [ ] o.a.s.u.ErrorLogMuter Closing ErrorLogMuter-regex-518 after mutting 0 log messages
[junit4] 2> 1818369 INFO (SUITE-AutoScalingHandlerTest-seed#[9D7470B451B8BF5C]-worker) [ ] o.a.s.u.ErrorLogMuter Creating ErrorLogMuter-regex-519 for ERROR logs matching regex: ignore_exception
[junit4] 2> NOTE: leaving temporary files on disk at: /home/jenkins/jenkins-slave/workspace/Lucene/Lucene-Solr-Tests-8.11/solr/build/solr-core/test/J2/temp/solr.cloud.autoscaling.AutoScalingHandlerTest_9D7470B451B8BF5C-001
[junit4] 2> May 26, 2024 11:04:32 AM com.carrotsearch.randomizedtesting.ThreadLeakControl checkThreadLeaks
[junit4] 2> WARNING: Will linger awaiting termination of 1 leaked thread(s).
[junit4] 2> NOTE: test params are: codec=HighCompressionCompressingStoredFieldsData(storedFieldsFormat=CompressingStoredFieldsFormat(compressionMode=HIGH_COMPRESSION, chunkSize=21, maxDocsPerChunk=9, blockShift=7), termVectorsFormat=CompressingTermVectorsFormat(compressionMode=HIGH_COMPRESSION, chunkSize=21, maxDocsPerChunk=9, blockSize=7)), sim=Asserting(RandomSimilarity(queryNorm=false): {}), locale=sr, timezone=Asia/Seoul
[junit4] 2> NOTE: Linux 4.15.0-213-generic amd64/Temurin 1.8.0_362 (64-bit)/cpus=4,threads=1,free=149253120,total=515375104
[junit4] 2> NOTE: All tests run in this JVM: [ClusterStateUpdateTest, AnalyticsMergeStrategyTest, TestSolrRequestInfo, TestLegacyField, ZkStateWriterTest, ShardTermsTest, SolrLogPostToolTest, TestMultiWordSynonyms, TestManagedSynonymFilterFactory, RestartWhileUpdatingTest, SolrCloudExampleTest, TestTestInjection, MoreLikeThisHandlerTest, TestReplicaProperties, HighlighterMaxOffsetTest, LukeRequestHandlerTest, IndexSchemaTest, AdminHandlersProxyTest, MoreLikeThisComponentTest, TestLogWatcher, DeleteShardTest, ChaosMonkeyNothingIsSafeWithPullReplicasTest, TestSolrCloudWithKerberosAlt, PeerSyncWithLeaderTest, MigrateRouteKeyTest, AddBlockUpdateTest, SolrIndexConfigTest, TestCollapseQParserPlugin, VersionInfoTest, TolerantUpdateProcessorTest, DocValuesTest, DistribJoinFromCollectionTest, TestSchemaVersionResource, TestDocTermOrds, TestCollectionAPI, TestRealTimeGet, HdfsBasicDistributedZkTest, TestHttpServletCarrier, TestGraphMLResponseWriter, ResponseBuilderTest, SolrGraphiteReporterTest, TestCustomStream, SuggesterTSTTest, DirectoryFactoriesTest, TestLazyCores, TestImplicitCoreProperties, TestSmileRequest, TestFieldTypeResource, TestCloudRecovery, FileTypeMagicUtilTest, DateFieldTest, TestPullReplicaWithAuth, TestMultiValuedNumericRangeQuery, HttpSolrCallCloudTest, DistributedTermsComponentTest, TestConfig, ConvertedLegacyTest, TestTextField, TestSafeXMLParsing, TestZkChroot, CategoryRoutedAliasUpdateProcessorTest, TestRestManager, TestBM25SimilarityFactory, TestFuzzyAnalyzedSuggestions, SpellingQueryConverterTest, TestRandomDVFaceting, DeleteInactiveReplicaTest, NodeMutatorTest, EchoParamsTest, SolrLogAuditLoggerPluginTest, TestCollationField, NumberUtilsTest, CustomTermsComponentTest, ResourceLoaderTest, TestAnalyzedSuggestions, TestSimUtils, TestPayloadScoreQParserPlugin, PurgeGraphTest, TestBlobHandler, WrapperMergePolicyFactoryTest, TestSubQueryTransformerCrossCore, PropertiesRequestHandlerTest, PeerSyncTest, PluginInfoTest, TestBinaryField, ZkDynamicConfigTest, HdfsThreadLeakTest, RegexBoostProcessorTest, TestExceedMaxTermLength, MetricTriggerIntegrationTest, JavaBinAtomicUpdateMultivalueTest, TestSQLHandlerNonCloud, TestCryptoKeys, TestShortCircuitedRequests, TestLegacyNumericRangeQueryBuilder, TestExactSharedStatsCache, TestLegacyFieldCache, TestSolrIndexConfig, OpenExchangeRatesOrgProviderTest, SpellCheckComponentTest, TestSolrCloudWithHadoopAuthPlugin, CloneFieldUpdateProcessorFactoryTest, TestJsonFacetsWithNestedObjects, CollectionsAPIAsyncDistributedZkTest, NodeLostTriggerIntegrationTest, ActionThrottleTest, QueryEqualityTest, RemoteQueryErrorTest, TestSchemaDesignerSettingsDAO, TestBinaryResponseWriter, TestHdfsBackupRestoreCore, TestExtendedDismaxParser, OverseerModifyCollectionTest, ThreadDumpHandlerTest, PrimitiveFieldTypeTest, DistributedFacetExistsSmallTest, TestConfigSets, CursorPagingTest, MinimalSchemaTest, OutputWriterTest, SampleTest, SolrInfoBeanTest, SolrTestCaseJ4Test, TestCrossCoreJoin, TestCursorMarkWithoutUniqueKey, TestDistributedMissingSort, TestDistributedSearch, TestDocumentBuilder, TestGroupingSearch, TestSimpleTrackingShardHandler, TestSolrCoreProperties, TestTolerantSearch, TestTrie, PathHierarchyTokenizerFactoryTest, ProtectedTermFilterFactoryTest, TestCharFilters, TestDeprecatedFilters, TestLuceneMatchVersion, TestReversedWildcardFilterFactory, TestWordDelimiterFilterFactory, TokenizerChainTest, TestLuceneIndexBackCompat, TestEmbeddedSolrServerAdminHandler, TestEmbeddedSolrServerConstructors, TestEmbeddedSolrServerSchemaAPI, AliasIntegrationTest, AssignBackwardCompatibilityTest, BasicDistributedZk2Test, ChaosMonkeySafeLeaderTest, CleanupOldIndexTest, CollectionStateFormat2Test, CollectionsAPISolrJTest, HttpPartitionWithTlogReplicasTest, LeaderElectionTest, LeaderFailoverAfterPartitionTest, LeaderVoteWaitTimeoutTest, PackageManagerCLITest, ReplaceNodeNoTargetTest, RouteFieldTest, RoutingToNodesWithPropertiesTest, SSLMigrationTest, SaslZkACLProviderTest, SolrXmlInZkTest, SyncSliceTest, TestClusterProperties, TestConfigSetsAPI, TestDistributedMap, TestExclusionRuleCollectionAccess, TestLeaderElectionWithEmptyReplica, TestRandomFlRTGCloud, TestSolrCloudWithSecureImpersonation, TestStressInPlaceUpdates, TestTolerantUpdateProcessorRandomCloud, TlogReplayBufferedWhileIndexingTest, TriLevelCompositeIdRoutingTest, UnloadDistributedZkTest, VMParamsZkACLAndCredentialsProvidersTest, ZkControllerTest, ZkFailoverTest, ZkNodePropsTest, ZkShardTermsTest, ZkSolrClientTest, TestRequestStatusCollectionAPI, AutoAddReplicasPlanActionTest, AutoScalingHandlerTest]
[junit4] Completed [605/959 (1!)] on J2 in 13.76s, 12 tests, 1 failure <<< FAILURES!
[...truncated 55524 lines...]