You are viewing a plain text version of this content. The canonical link for it is here.
Posted to commits@olingo.apache.org by Apache Jenkins Server <je...@builds.apache.org> on 2015/06/03 11:38:05 UTC
Build failed in Jenkins: olingo-odata4 #1023
See <https://builds.apache.org/job/olingo-odata4/1023/changes>
Changes:
[christian.amend] [OLINGO-663] helper for conditional handling
------------------------------------------
[...truncated 28603 lines...]
updateMediaWithWrongIfMatch(org.apache.olingo.fit.tecsvc.client.ConditionalITCase) Time elapsed: 0.01 sec <<< FAILURE!
java.lang.AssertionError: expected:<412> but was:<428>
at org.junit.Assert.fail(Assert.java:88)
at org.junit.Assert.failNotEquals(Assert.java:743)
at org.junit.Assert.assertEquals(Assert.java:118)
at org.junit.Assert.assertEquals(Assert.java:555)
at org.junit.Assert.assertEquals(Assert.java:542)
at org.apache.olingo.fit.tecsvc.client.ConditionalITCase.updateMediaWithWrongIfMatch(ConditionalITCase.java:112)
deletePropertyWithWrongIfMatch(org.apache.olingo.fit.tecsvc.client.ConditionalITCase) Time elapsed: 0.009 sec <<< FAILURE!
java.lang.AssertionError: expected:<412> but was:<428>
at org.junit.Assert.fail(Assert.java:88)
at org.junit.Assert.failNotEquals(Assert.java:743)
at org.junit.Assert.assertEquals(Assert.java:118)
at org.junit.Assert.assertEquals(Assert.java:555)
at org.junit.Assert.assertEquals(Assert.java:542)
at org.apache.olingo.fit.tecsvc.client.ConditionalITCase.executeAndExpectError(ConditionalITCase.java:189)
at org.apache.olingo.fit.tecsvc.client.ConditionalITCase.deletePropertyWithWrongIfMatch(ConditionalITCase.java:174)
Running org.apache.olingo.fit.tecsvc.client.DeepInsertITCase
Tests run: 7, Failures: 0, Errors: 0, Skipped: 1, Time elapsed: 0.56 sec - in org.apache.olingo.fit.tecsvc.client.DeepInsertITCase
Running org.apache.olingo.fit.tecsvc.client.EdmEnabledClientITCase
Tests run: 1, Failures: 0, Errors: 0, Skipped: 0, Time elapsed: 0.079 sec - in org.apache.olingo.fit.tecsvc.client.EdmEnabledClientITCase
Running org.apache.olingo.fit.tecsvc.client.EntityReferencesITCase
Tests run: 37, Failures: 0, Errors: 0, Skipped: 0, Time elapsed: 2.748 sec - in org.apache.olingo.fit.tecsvc.client.EntityReferencesITCase
Running org.apache.olingo.fit.tecsvc.client.ExpandSelectITCase
Tests run: 3, Failures: 0, Errors: 0, Skipped: 0, Time elapsed: 1.115 sec - in org.apache.olingo.fit.tecsvc.client.ExpandSelectITCase
Running org.apache.olingo.fit.tecsvc.client.ExpandWithSystemQueryOptionsITCase
Tests run: 10, Failures: 0, Errors: 0, Skipped: 1, Time elapsed: 0.613 sec - in org.apache.olingo.fit.tecsvc.client.ExpandWithSystemQueryOptionsITCase
Running org.apache.olingo.fit.tecsvc.client.FilterSystemQueryITCase
Tests run: 69, Failures: 0, Errors: 0, Skipped: 0, Time elapsed: 1.167 sec - in org.apache.olingo.fit.tecsvc.client.FilterSystemQueryITCase
Running org.apache.olingo.fit.tecsvc.client.FunctionImportITCase
Tests run: 10, Failures: 0, Errors: 0, Skipped: 0, Time elapsed: 0.089 sec - in org.apache.olingo.fit.tecsvc.client.FunctionImportITCase
Running org.apache.olingo.fit.tecsvc.client.MediaITCase
Tests run: 4, Failures: 0, Errors: 0, Skipped: 0, Time elapsed: 0.054 sec - in org.apache.olingo.fit.tecsvc.client.MediaITCase
Running org.apache.olingo.fit.tecsvc.client.NavigationITCase
Tests run: 5, Failures: 0, Errors: 0, Skipped: 0, Time elapsed: 0.041 sec - in org.apache.olingo.fit.tecsvc.client.NavigationITCase
Running org.apache.olingo.fit.tecsvc.client.OrderBySystemQueryITCase
Tests run: 6, Failures: 0, Errors: 0, Skipped: 0, Time elapsed: 0.052 sec - in org.apache.olingo.fit.tecsvc.client.OrderBySystemQueryITCase
Running org.apache.olingo.fit.tecsvc.client.PrimitiveComplexITCase
Tests run: 14, Failures: 0, Errors: 0, Skipped: 0, Time elapsed: 1.382 sec - in org.apache.olingo.fit.tecsvc.client.PrimitiveComplexITCase
Running org.apache.olingo.fit.tecsvc.client.SystemQueryOptionITCase
Tests run: 11, Failures: 0, Errors: 0, Skipped: 0, Time elapsed: 0.992 sec - in org.apache.olingo.fit.tecsvc.client.SystemQueryOptionITCase
Running org.apache.olingo.fit.tecsvc.http.BasicBatchITCase
Tests run: 5, Failures: 0, Errors: 0, Skipped: 0, Time elapsed: 0.022 sec - in org.apache.olingo.fit.tecsvc.http.BasicBatchITCase
Running org.apache.olingo.fit.tecsvc.http.BasicHttpITCase
Tests run: 5, Failures: 0, Errors: 0, Skipped: 0, Time elapsed: 0.022 sec - in org.apache.olingo.fit.tecsvc.http.BasicHttpITCase
Running org.apache.olingo.fit.tecsvc.http.EntityReferenceITCase
Tests run: 2, Failures: 0, Errors: 0, Skipped: 0, Time elapsed: 0.007 sec - in org.apache.olingo.fit.tecsvc.http.EntityReferenceITCase
Running org.apache.olingo.fit.tecsvc.http.PingITCase
Tests run: 2, Failures: 0, Errors: 0, Skipped: 0, Time elapsed: 0.011 sec - in org.apache.olingo.fit.tecsvc.http.PingITCase
Running org.apache.olingo.fit.v4.AsyncTestITCase
Tests run: 5, Failures: 0, Errors: 0, Skipped: 0, Time elapsed: 1.095 sec - in org.apache.olingo.fit.v4.AsyncTestITCase
Running org.apache.olingo.fit.v4.AuthBatchTestITCase
Tests run: 3, Failures: 0, Errors: 0, Skipped: 0, Time elapsed: 0.086 sec - in org.apache.olingo.fit.v4.AuthBatchTestITCase
Running org.apache.olingo.fit.v4.BatchTestITCase
Tests run: 9, Failures: 0, Errors: 0, Skipped: 0, Time elapsed: 0.315 sec - in org.apache.olingo.fit.v4.BatchTestITCase
Running org.apache.olingo.fit.v4.BoundOperationInvokeTestITCase
Tests run: 6, Failures: 0, Errors: 0, Skipped: 0, Time elapsed: 1.797 sec - in org.apache.olingo.fit.v4.BoundOperationInvokeTestITCase
Running org.apache.olingo.fit.v4.ConformanceTestITCase
Tests run: 11, Failures: 0, Errors: 0, Skipped: 0, Time elapsed: 0.264 sec - in org.apache.olingo.fit.v4.ConformanceTestITCase
Running org.apache.olingo.fit.v4.DeltaTestITCase
Tests run: 2, Failures: 0, Errors: 0, Skipped: 0, Time elapsed: 0.053 sec - in org.apache.olingo.fit.v4.DeltaTestITCase
Running org.apache.olingo.fit.v4.DerivedTypeTestITCase
Tests run: 4, Failures: 0, Errors: 0, Skipped: 0, Time elapsed: 0.107 sec - in org.apache.olingo.fit.v4.DerivedTypeTestITCase
Running org.apache.olingo.fit.v4.EntityCreateTestITCase
Tests run: 6, Failures: 0, Errors: 0, Skipped: 0, Time elapsed: 0.256 sec - in org.apache.olingo.fit.v4.EntityCreateTestITCase
Running org.apache.olingo.fit.v4.EntityRetrieveTestITCase
Tests run: 21, Failures: 0, Errors: 0, Skipped: 0, Time elapsed: 0.275 sec - in org.apache.olingo.fit.v4.EntityRetrieveTestITCase
Running org.apache.olingo.fit.v4.EntitySetTestITCase
Tests run: 11, Failures: 0, Errors: 0, Skipped: 0, Time elapsed: 0.238 sec - in org.apache.olingo.fit.v4.EntitySetTestITCase
Running org.apache.olingo.fit.v4.EntityUpdateTestITCase
Tests run: 7, Failures: 0, Errors: 0, Skipped: 1, Time elapsed: 0.23 sec - in org.apache.olingo.fit.v4.EntityUpdateTestITCase
Running org.apache.olingo.fit.v4.ErrorResponseTestITCase
Tests run: 1, Failures: 0, Errors: 0, Skipped: 0, Time elapsed: 0.009 sec - in org.apache.olingo.fit.v4.ErrorResponseTestITCase
Running org.apache.olingo.fit.v4.FilterFactoryTestITCase
Tests run: 1, Failures: 0, Errors: 0, Skipped: 0, Time elapsed: 0.008 sec - in org.apache.olingo.fit.v4.FilterFactoryTestITCase
Running org.apache.olingo.fit.v4.JSONFormatConformanceTestITCase
Tests run: 6, Failures: 0, Errors: 0, Skipped: 0, Time elapsed: 0.047 sec - in org.apache.olingo.fit.v4.JSONFormatConformanceTestITCase
Running org.apache.olingo.fit.v4.KeyAsSegmentTestITCase
Tests run: 6, Failures: 0, Errors: 0, Skipped: 0, Time elapsed: 0.11 sec - in org.apache.olingo.fit.v4.KeyAsSegmentTestITCase
Running org.apache.olingo.fit.v4.MediaEntityTestITCase
Tests run: 7, Failures: 0, Errors: 0, Skipped: 0, Time elapsed: 0.163 sec - in org.apache.olingo.fit.v4.MediaEntityTestITCase
Running org.apache.olingo.fit.v4.MetadataTestITCase
Tests run: 3, Failures: 0, Errors: 0, Skipped: 0, Time elapsed: 0.102 sec - in org.apache.olingo.fit.v4.MetadataTestITCase
Running org.apache.olingo.fit.v4.OAuth2TestITCase
Tests run: 4, Failures: 0, Errors: 2, Skipped: 0, Time elapsed: 0.623 sec <<< FAILURE! - in org.apache.olingo.fit.v4.OAuth2TestITCase
createAndDelete(org.apache.olingo.fit.v4.OAuth2TestITCase) Time elapsed: 0.509 sec <<< ERROR!
javax.ws.rs.ProcessingException: java.net.SocketException: SocketException invoking http://localhost:9080/stub/StaticService/oauth2/token: Socket Closed
at java.net.PlainSocketImpl.getOption(PlainSocketImpl.java:286)
at java.net.Socket.getSoTimeout(Socket.java:1032)
at sun.net.www.http.HttpClient.available(HttpClient.java:356)
at sun.net.www.http.HttpClient.New(HttpClient.java:273)
at sun.net.www.http.HttpClient.New(HttpClient.java:310)
at sun.net.www.protocol.http.HttpURLConnection.getNewHttpClient(HttpURLConnection.java:987)
at sun.net.www.protocol.http.HttpURLConnection.plainConnect(HttpURLConnection.java:923)
at sun.net.www.protocol.http.HttpURLConnection.connect(HttpURLConnection.java:841)
at org.apache.cxf.transport.http.URLConnectionHTTPConduit$URLConnectionWrappedOutputStream.setupWrappedStream(URLConnectionHTTPConduit.java:177)
at org.apache.cxf.transport.http.HTTPConduit$WrappedOutputStream.handleHeadersTrustCaching(HTTPConduit.java:1302)
at org.apache.cxf.transport.http.HTTPConduit$WrappedOutputStream.onFirstWrite(HTTPConduit.java:1258)
at org.apache.cxf.transport.http.URLConnectionHTTPConduit$URLConnectionWrappedOutputStream.onFirstWrite(URLConnectionHTTPConduit.java:201)
at org.apache.cxf.io.AbstractWrappedOutputStream.write(AbstractWrappedOutputStream.java:47)
at org.apache.cxf.io.AbstractThresholdOutputStream.write(AbstractThresholdOutputStream.java:69)
at org.apache.cxf.transport.http.HTTPConduit$WrappedOutputStream.close(HTTPConduit.java:1315)
at org.apache.cxf.transport.AbstractConduit.close(AbstractConduit.java:56)
at org.apache.cxf.transport.http.HTTPConduit.close(HTTPConduit.java:638)
at org.apache.cxf.interceptor.MessageSenderInterceptor$MessageSenderEndingInterceptor.handleMessage(MessageSenderInterceptor.java:62)
at org.apache.cxf.phase.PhaseInterceptorChain.doIntercept(PhaseInterceptorChain.java:307)
at org.apache.cxf.jaxrs.client.AbstractClient.doRunInterceptorChain(AbstractClient.java:620)
at org.apache.cxf.jaxrs.client.WebClient.doChainedInvocation(WebClient.java:1087)
at org.apache.cxf.jaxrs.client.WebClient.doInvoke(WebClient.java:882)
at org.apache.cxf.jaxrs.client.WebClient.doInvoke(WebClient.java:853)
at org.apache.cxf.jaxrs.client.WebClient.form(WebClient.java:390)
at org.apache.cxf.rs.security.oauth2.client.OAuthClientUtils.getAccessToken(OAuthClientUtils.java:263)
at org.apache.cxf.rs.security.oauth2.client.OAuthClientUtils.getAccessToken(OAuthClientUtils.java:209)
at org.apache.cxf.rs.security.oauth2.client.OAuthClientUtils.getAccessToken(OAuthClientUtils.java:156)
at org.apache.cxf.rs.security.oauth2.client.OAuthClientUtils.getAccessToken(OAuthClientUtils.java:114)
at org.apache.olingo.fit.CXFOAuth2HttpClientFactory.init(CXFOAuth2HttpClientFactory.java:145)
at org.apache.olingo.client.core.http.AbstractOAuth2HttpClientFactory.create(AbstractOAuth2HttpClientFactory.java:78)
at org.apache.olingo.client.core.communication.request.AbstractODataRequest.getHttpClient(AbstractODataRequest.java:352)
at org.apache.olingo.client.core.communication.request.AbstractODataRequest.<init>(AbstractODataRequest.java:101)
at org.apache.olingo.client.core.communication.request.AbstractODataBasicRequest.<init>(AbstractODataBasicRequest.java:54)
at org.apache.olingo.client.core.communication.request.cud.ODataEntityCreateRequestImpl.<init>(ODataEntityCreateRequestImpl.java:64)
at org.apache.olingo.client.core.communication.request.cud.CUDRequestFactoryImpl.getEntityCreateRequest(CUDRequestFactoryImpl.java:59)
at org.apache.olingo.fit.v4.AbstractTestITCase.createAndDeleteOrder(AbstractTestITCase.java:147)
at org.apache.olingo.fit.v4.OAuth2TestITCase.createAndDelete(OAuth2TestITCase.java:112)
readAsFullJSON(org.apache.olingo.fit.v4.OAuth2TestITCase) Time elapsed: 0.015 sec <<< ERROR!
javax.ws.rs.ProcessingException: java.net.SocketException: SocketException invoking http://localhost:9080/stub/StaticService/oauth2/token: Socket Closed
at java.net.PlainSocketImpl.getOption(PlainSocketImpl.java:286)
at java.net.Socket.getSoTimeout(Socket.java:1032)
at sun.net.www.http.HttpClient.available(HttpClient.java:356)
at sun.net.www.http.HttpClient.New(HttpClient.java:273)
at sun.net.www.http.HttpClient.New(HttpClient.java:310)
at sun.net.www.protocol.http.HttpURLConnection.getNewHttpClient(HttpURLConnection.java:987)
at sun.net.www.protocol.http.HttpURLConnection.plainConnect(HttpURLConnection.java:923)
at sun.net.www.protocol.http.HttpURLConnection.connect(HttpURLConnection.java:841)
at org.apache.cxf.transport.http.URLConnectionHTTPConduit$URLConnectionWrappedOutputStream.setupWrappedStream(URLConnectionHTTPConduit.java:177)
at org.apache.cxf.transport.http.HTTPConduit$WrappedOutputStream.handleHeadersTrustCaching(HTTPConduit.java:1302)
at org.apache.cxf.transport.http.HTTPConduit$WrappedOutputStream.onFirstWrite(HTTPConduit.java:1258)
at org.apache.cxf.transport.http.URLConnectionHTTPConduit$URLConnectionWrappedOutputStream.onFirstWrite(URLConnectionHTTPConduit.java:201)
at org.apache.cxf.io.AbstractWrappedOutputStream.write(AbstractWrappedOutputStream.java:47)
at org.apache.cxf.io.AbstractThresholdOutputStream.write(AbstractThresholdOutputStream.java:69)
at org.apache.cxf.transport.http.HTTPConduit$WrappedOutputStream.close(HTTPConduit.java:1315)
at org.apache.cxf.transport.AbstractConduit.close(AbstractConduit.java:56)
at org.apache.cxf.transport.http.HTTPConduit.close(HTTPConduit.java:638)
at org.apache.cxf.interceptor.MessageSenderInterceptor$MessageSenderEndingInterceptor.handleMessage(MessageSenderInterceptor.java:62)
at org.apache.cxf.phase.PhaseInterceptorChain.doIntercept(PhaseInterceptorChain.java:307)
at org.apache.cxf.jaxrs.client.AbstractClient.doRunInterceptorChain(AbstractClient.java:620)
at org.apache.cxf.jaxrs.client.WebClient.doChainedInvocation(WebClient.java:1087)
at org.apache.cxf.jaxrs.client.WebClient.doInvoke(WebClient.java:882)
at org.apache.cxf.jaxrs.client.WebClient.doInvoke(WebClient.java:853)
at org.apache.cxf.jaxrs.client.WebClient.form(WebClient.java:390)
at org.apache.cxf.rs.security.oauth2.client.OAuthClientUtils.getAccessToken(OAuthClientUtils.java:263)
at org.apache.cxf.rs.security.oauth2.client.OAuthClientUtils.getAccessToken(OAuthClientUtils.java:209)
at org.apache.cxf.rs.security.oauth2.client.OAuthClientUtils.getAccessToken(OAuthClientUtils.java:156)
at org.apache.cxf.rs.security.oauth2.client.OAuthClientUtils.getAccessToken(OAuthClientUtils.java:114)
at org.apache.olingo.fit.CXFOAuth2HttpClientFactory.init(CXFOAuth2HttpClientFactory.java:145)
at org.apache.olingo.client.core.http.AbstractOAuth2HttpClientFactory.create(AbstractOAuth2HttpClientFactory.java:78)
at org.apache.olingo.client.core.communication.request.AbstractODataRequest.getHttpClient(AbstractODataRequest.java:352)
at org.apache.olingo.client.core.communication.request.AbstractODataRequest.<init>(AbstractODataRequest.java:101)
at org.apache.olingo.client.core.communication.request.AbstractODataBasicRequest.<init>(AbstractODataBasicRequest.java:54)
at org.apache.olingo.client.core.communication.request.retrieve.AbstractODataRetrieveRequest.<init>(AbstractODataRetrieveRequest.java:47)
at org.apache.olingo.client.core.communication.request.retrieve.ODataEntityRequestImpl.<init>(ODataEntityRequestImpl.java:47)
at org.apache.olingo.client.core.communication.request.retrieve.RetrieveRequestFactoryImpl.getEntityRequest(RetrieveRequestFactoryImpl.java:112)
at org.apache.olingo.fit.v4.OAuth2TestITCase.read(OAuth2TestITCase.java:76)
at org.apache.olingo.fit.v4.OAuth2TestITCase.readAsFullJSON(OAuth2TestITCase.java:102)
Running org.apache.olingo.fit.v4.OpenTypeTestITCase
Tests run: 5, Failures: 0, Errors: 0, Skipped: 0, Time elapsed: 0.125 sec - in org.apache.olingo.fit.v4.OpenTypeTestITCase
Running org.apache.olingo.fit.v4.OperationImportInvokeTestITCase
Tests run: 8, Failures: 0, Errors: 0, Skipped: 0, Time elapsed: 0.254 sec - in org.apache.olingo.fit.v4.OperationImportInvokeTestITCase
Running org.apache.olingo.fit.v4.PropertyTestITCase
Tests run: 11, Failures: 0, Errors: 0, Skipped: 0, Time elapsed: 0.142 sec - in org.apache.olingo.fit.v4.PropertyTestITCase
Running org.apache.olingo.fit.v4.PropertyValueTestITCase
Tests run: 10, Failures: 0, Errors: 0, Skipped: 0, Time elapsed: 0.079 sec - in org.apache.olingo.fit.v4.PropertyValueTestITCase
Running org.apache.olingo.fit.v4.QueryOptionsTestITCase
Tests run: 8, Failures: 0, Errors: 0, Skipped: 0, Time elapsed: 0.101 sec - in org.apache.olingo.fit.v4.QueryOptionsTestITCase
Running org.apache.olingo.fit.v4.ServiceDocumentTestITCase
Tests run: 2, Failures: 0, Errors: 0, Skipped: 0, Time elapsed: 0.02 sec - in org.apache.olingo.fit.v4.ServiceDocumentTestITCase
Running org.apache.olingo.fit.v4.SingletonTestITCase
Tests run: 8, Failures: 0, Errors: 0, Skipped: 0, Time elapsed: 0.131 sec - in org.apache.olingo.fit.v4.SingletonTestITCase
Results :
Failed tests:
ConditionalITCase.deletePropertyValueWithWrongIfMatch:181->executeAndExpectError:189 expected:<412> but was:<428>
ConditionalITCase.deleteMediaWithWrongIfMatch:128->executeAndExpectError:189 expected:<412> but was:<428>
ConditionalITCase.indirectEntityChange:143->executeAndExpectError:189 expected:<412> but was:<428>
ConditionalITCase.updatePropertyWithWrongIfMatch:167->executeAndExpectError:189 expected:<412> but was:<428>
ConditionalITCase.deleteWithWrongIfMatch:121->executeAndExpectError:189 expected:<412> but was:<428>
ConditionalITCase.readWithWrongIfMatch:72->executeAndExpectError:189 expected:<412> but was:<428>
ConditionalITCase.updateWithWrongIfMatch:98->executeAndExpectError:189 expected:<412> but was:<428>
ConditionalITCase.updateMediaWithWrongIfMatch:112 expected:<412> but was:<428>
ConditionalITCase.deletePropertyWithWrongIfMatch:174->executeAndExpectError:189 expected:<412> but was:<428>
Tests in error:
OAuth2TestITCase.createAndDelete:112->AbstractTestITCase.createAndDeleteOrder:147 » Processing
OAuth2TestITCase.readAsFullJSON:102->read:76 » Processing java.net.SocketExcep...
Tests run: 555, Failures: 9, Errors: 2, Skipped: 3
[INFO] ------------------------------------------------------------------------
[INFO] Reactor Summary:
[INFO]
[INFO] Olingo-OData ...................................... SUCCESS [11.449s]
[INFO] odata-lib ......................................... SUCCESS [6.673s]
[INFO] odata-commons-api ................................. SUCCESS [34.657s]
[INFO] odata-commons-core ................................ SUCCESS [32.173s]
[INFO] odata-client-api .................................. SUCCESS [24.111s]
[INFO] odata-client-core ................................. SUCCESS [39.857s]
[INFO] odata-server-api .................................. SUCCESS [33.078s]
[INFO] odata-server-core ................................. SUCCESS [1:43.667s]
[INFO] odata-server-core-ext ............................. SUCCESS [30.079s]
[INFO] odata-server-tecsvc ............................... SUCCESS [7.800s]
[INFO] odata-server-test ................................. SUCCESS [8.085s]
[INFO] odata-ext ......................................... SUCCESS [9.657s]
[INFO] odata-client-proxy ................................ SUCCESS [21.080s]
[INFO] pojogen-maven-plugin .............................. SUCCESS [44.347s]
[INFO] odata-client-android .............................. SUCCESS [23.179s]
[INFO] odata-fit ......................................... FAILURE [51.327s]
[INFO] odata-dist ........................................ SKIPPED
[INFO] Olingo-OData-Client-for-Android ................... SKIPPED
[INFO] Olingo-OData-Client-for-Java ...................... SKIPPED
[INFO] Olingo-OData-Server-for-Java ...................... SKIPPED
[INFO] Olingo-OData-JavaDoc .............................. SKIPPED
[INFO] odata-samples ..................................... SKIPPED
[INFO] odata-server-sample ............................... SKIPPED
[INFO] ------------------------------------------------------------------------
[INFO] BUILD FAILURE
[INFO] ------------------------------------------------------------------------
[INFO] Total time: 8:03.636s
[INFO] Finished at: Wed Jun 03 09:38:04 UTC 2015
[INFO] Final Memory: 70M/472M
[INFO] ------------------------------------------------------------------------
[ERROR] Failed to execute goal org.apache.maven.plugins:maven-surefire-plugin:2.17:test (default-test) on project odata-fit: There are test failures.
[ERROR]
[ERROR] Please refer to <https://builds.apache.org/job/olingo-odata4/ws/fit/target/surefire-reports> for the individual test results.
[ERROR] -> [Help 1]
[ERROR]
[ERROR] To see the full stack trace of the errors, re-run Maven with the -e switch.
[ERROR] Re-run Maven using the -X switch to enable full debug logging.
[ERROR]
[ERROR] For more information about the errors and possible solutions, please read the following articles:
[ERROR] [Help 1] http://cwiki.apache.org/confluence/display/MAVEN/MojoFailureException
[ERROR]
[ERROR] After correcting the problems, you can resume the build with the command
[ERROR] mvn <goals> -rf :odata-fit
Build step 'Invoke top-level Maven targets' marked build as failure
Jenkins build is back to normal : olingo-odata4 #1028
Posted by Apache Jenkins Server <je...@builds.apache.org>.
See <https://builds.apache.org/job/olingo-odata4/1028/changes>
Build failed in Jenkins: olingo-odata4 #1027
Posted by Apache Jenkins Server <je...@builds.apache.org>.
See <https://builds.apache.org/job/olingo-odata4/1027/changes>
Changes:
[christian.amend] [OLINGO-663] Fix batch processor exception signature
[christian.amend] [OLINGO-684] Try a local client for the OAuth test
------------------------------------------
[...truncated 10759 lines...]
Running org.apache.olingo.fit.proxy.v4.NonTransactionalAuthEntityCreateTestITCase
Tests run: 7, Failures: 0, Errors: 0, Skipped: 0, Time elapsed: 0.866 sec - in org.apache.olingo.fit.proxy.v4.NonTransactionalAuthEntityCreateTestITCase
Running org.apache.olingo.fit.proxy.v4.NonTransactionalEntityCreateTestITCase
Tests run: 7, Failures: 0, Errors: 0, Skipped: 0, Time elapsed: 0.602 sec - in org.apache.olingo.fit.proxy.v4.NonTransactionalEntityCreateTestITCase
Running org.apache.olingo.fit.proxy.v4.NonTransactionalEntityUpdateTestITCase
Tests run: 5, Failures: 0, Errors: 0, Skipped: 0, Time elapsed: 0.254 sec - in org.apache.olingo.fit.proxy.v4.NonTransactionalEntityUpdateTestITCase
Running org.apache.olingo.fit.proxy.v4.NonTransactionalMediaEntityTestITCase
Tests run: 3, Failures: 0, Errors: 0, Skipped: 0, Time elapsed: 0.091 sec - in org.apache.olingo.fit.proxy.v4.NonTransactionalMediaEntityTestITCase
Running org.apache.olingo.fit.proxy.v4.OpenTypeTestITCase
Tests run: 3, Failures: 0, Errors: 0, Skipped: 0, Time elapsed: 0.143 sec - in org.apache.olingo.fit.proxy.v4.OpenTypeTestITCase
Running org.apache.olingo.fit.proxy.v4.OperationImportInvokeTestITCase
Tests run: 8, Failures: 0, Errors: 0, Skipped: 0, Time elapsed: 0.062 sec - in org.apache.olingo.fit.proxy.v4.OperationImportInvokeTestITCase
Running org.apache.olingo.fit.proxy.v4.PropertyTestITCase
Tests run: 2, Failures: 0, Errors: 0, Skipped: 0, Time elapsed: 0.042 sec - in org.apache.olingo.fit.proxy.v4.PropertyTestITCase
Running org.apache.olingo.fit.proxy.v4.SingletonTestITCase
Tests run: 3, Failures: 0, Errors: 0, Skipped: 0, Time elapsed: 0.06 sec - in org.apache.olingo.fit.proxy.v4.SingletonTestITCase
Running org.apache.olingo.fit.proxy.v4.UnauthorizedEntityCreateTestITCase
Tests run: 1, Failures: 0, Errors: 0, Skipped: 0, Time elapsed: 0.008 sec - in org.apache.olingo.fit.proxy.v4.UnauthorizedEntityCreateTestITCase
Running org.apache.olingo.fit.tecsvc.client.ActionImportITCase
Tests run: 14, Failures: 0, Errors: 0, Skipped: 0, Time elapsed: 0.382 sec - in org.apache.olingo.fit.tecsvc.client.ActionImportITCase
Running org.apache.olingo.fit.tecsvc.client.BasicHttpExceptionHandlingITCase
Tests run: 1, Failures: 0, Errors: 0, Skipped: 0, Time elapsed: 0.006 sec - in org.apache.olingo.fit.tecsvc.client.BasicHttpExceptionHandlingITCase
Running org.apache.olingo.fit.tecsvc.client.BasicITCase
Tests run: 21, Failures: 0, Errors: 0, Skipped: 0, Time elapsed: 0.828 sec - in org.apache.olingo.fit.tecsvc.client.BasicITCase
Running org.apache.olingo.fit.tecsvc.client.BatchClientITCase
Tests run: 11, Failures: 0, Errors: 0, Skipped: 0, Time elapsed: 0.15 sec - in org.apache.olingo.fit.tecsvc.client.BatchClientITCase
Running org.apache.olingo.fit.tecsvc.client.BindingITCase
Tests run: 6, Failures: 0, Errors: 0, Skipped: 0, Time elapsed: 0.206 sec - in org.apache.olingo.fit.tecsvc.client.BindingITCase
Running org.apache.olingo.fit.tecsvc.client.ConditionalITCase
Tests run: 13, Failures: 0, Errors: 0, Skipped: 0, Time elapsed: 0.552 sec - in org.apache.olingo.fit.tecsvc.client.ConditionalITCase
Running org.apache.olingo.fit.tecsvc.client.DeepInsertITCase
Tests run: 7, Failures: 0, Errors: 0, Skipped: 1, Time elapsed: 0.505 sec - in org.apache.olingo.fit.tecsvc.client.DeepInsertITCase
Running org.apache.olingo.fit.tecsvc.client.EdmEnabledClientITCase
Tests run: 1, Failures: 0, Errors: 0, Skipped: 0, Time elapsed: 0.075 sec - in org.apache.olingo.fit.tecsvc.client.EdmEnabledClientITCase
Running org.apache.olingo.fit.tecsvc.client.EntityReferencesITCase
Tests run: 37, Failures: 0, Errors: 0, Skipped: 0, Time elapsed: 1.714 sec - in org.apache.olingo.fit.tecsvc.client.EntityReferencesITCase
Running org.apache.olingo.fit.tecsvc.client.ExpandSelectITCase
Tests run: 3, Failures: 0, Errors: 0, Skipped: 0, Time elapsed: 0.129 sec - in org.apache.olingo.fit.tecsvc.client.ExpandSelectITCase
Running org.apache.olingo.fit.tecsvc.client.ExpandWithSystemQueryOptionsITCase
Tests run: 10, Failures: 0, Errors: 0, Skipped: 1, Time elapsed: 1.279 sec - in org.apache.olingo.fit.tecsvc.client.ExpandWithSystemQueryOptionsITCase
Running org.apache.olingo.fit.tecsvc.client.FilterSystemQueryITCase
Tests run: 69, Failures: 0, Errors: 0, Skipped: 0, Time elapsed: 0.835 sec - in org.apache.olingo.fit.tecsvc.client.FilterSystemQueryITCase
Running org.apache.olingo.fit.tecsvc.client.FunctionImportITCase
Tests run: 10, Failures: 0, Errors: 0, Skipped: 0, Time elapsed: 0.053 sec - in org.apache.olingo.fit.tecsvc.client.FunctionImportITCase
Running org.apache.olingo.fit.tecsvc.client.MediaITCase
Tests run: 4, Failures: 0, Errors: 0, Skipped: 0, Time elapsed: 0.029 sec - in org.apache.olingo.fit.tecsvc.client.MediaITCase
Running org.apache.olingo.fit.tecsvc.client.NavigationITCase
Tests run: 5, Failures: 0, Errors: 0, Skipped: 0, Time elapsed: 0.025 sec - in org.apache.olingo.fit.tecsvc.client.NavigationITCase
Running org.apache.olingo.fit.tecsvc.client.OrderBySystemQueryITCase
Tests run: 6, Failures: 0, Errors: 0, Skipped: 0, Time elapsed: 0.034 sec - in org.apache.olingo.fit.tecsvc.client.OrderBySystemQueryITCase
Running org.apache.olingo.fit.tecsvc.client.PrimitiveComplexITCase
Tests run: 14, Failures: 0, Errors: 0, Skipped: 0, Time elapsed: 0.071 sec - in org.apache.olingo.fit.tecsvc.client.PrimitiveComplexITCase
Running org.apache.olingo.fit.tecsvc.client.SystemQueryOptionITCase
Tests run: 11, Failures: 0, Errors: 0, Skipped: 0, Time elapsed: 2.204 sec - in org.apache.olingo.fit.tecsvc.client.SystemQueryOptionITCase
Running org.apache.olingo.fit.tecsvc.http.BasicBatchITCase
Tests run: 5, Failures: 0, Errors: 0, Skipped: 0, Time elapsed: 0.016 sec - in org.apache.olingo.fit.tecsvc.http.BasicBatchITCase
Running org.apache.olingo.fit.tecsvc.http.BasicHttpITCase
Tests run: 5, Failures: 0, Errors: 0, Skipped: 0, Time elapsed: 0.013 sec - in org.apache.olingo.fit.tecsvc.http.BasicHttpITCase
Running org.apache.olingo.fit.tecsvc.http.EntityReferenceITCase
Tests run: 2, Failures: 0, Errors: 0, Skipped: 0, Time elapsed: 0.004 sec - in org.apache.olingo.fit.tecsvc.http.EntityReferenceITCase
Running org.apache.olingo.fit.tecsvc.http.PingITCase
Tests run: 2, Failures: 0, Errors: 0, Skipped: 0, Time elapsed: 0.007 sec - in org.apache.olingo.fit.tecsvc.http.PingITCase
Running org.apache.olingo.fit.v4.AsyncTestITCase
Tests run: 5, Failures: 0, Errors: 0, Skipped: 0, Time elapsed: 1.063 sec - in org.apache.olingo.fit.v4.AsyncTestITCase
Running org.apache.olingo.fit.v4.AuthBatchTestITCase
Tests run: 3, Failures: 0, Errors: 0, Skipped: 0, Time elapsed: 0.075 sec - in org.apache.olingo.fit.v4.AuthBatchTestITCase
Running org.apache.olingo.fit.v4.BatchTestITCase
Tests run: 9, Failures: 0, Errors: 0, Skipped: 0, Time elapsed: 1.576 sec - in org.apache.olingo.fit.v4.BatchTestITCase
Running org.apache.olingo.fit.v4.BoundOperationInvokeTestITCase
Tests run: 6, Failures: 0, Errors: 0, Skipped: 0, Time elapsed: 0.323 sec - in org.apache.olingo.fit.v4.BoundOperationInvokeTestITCase
Running org.apache.olingo.fit.v4.ConformanceTestITCase
Tests run: 11, Failures: 0, Errors: 0, Skipped: 0, Time elapsed: 0.196 sec - in org.apache.olingo.fit.v4.ConformanceTestITCase
Running org.apache.olingo.fit.v4.DeltaTestITCase
Tests run: 2, Failures: 0, Errors: 0, Skipped: 0, Time elapsed: 0.042 sec - in org.apache.olingo.fit.v4.DeltaTestITCase
Running org.apache.olingo.fit.v4.DerivedTypeTestITCase
Tests run: 4, Failures: 0, Errors: 0, Skipped: 0, Time elapsed: 0.072 sec - in org.apache.olingo.fit.v4.DerivedTypeTestITCase
Running org.apache.olingo.fit.v4.EntityCreateTestITCase
Tests run: 6, Failures: 0, Errors: 0, Skipped: 0, Time elapsed: 0.174 sec - in org.apache.olingo.fit.v4.EntityCreateTestITCase
Running org.apache.olingo.fit.v4.EntityRetrieveTestITCase
Tests run: 21, Failures: 0, Errors: 0, Skipped: 0, Time elapsed: 0.177 sec - in org.apache.olingo.fit.v4.EntityRetrieveTestITCase
Running org.apache.olingo.fit.v4.EntitySetTestITCase
Tests run: 11, Failures: 0, Errors: 0, Skipped: 0, Time elapsed: 0.173 sec - in org.apache.olingo.fit.v4.EntitySetTestITCase
Running org.apache.olingo.fit.v4.EntityUpdateTestITCase
Tests run: 7, Failures: 0, Errors: 0, Skipped: 1, Time elapsed: 0.154 sec - in org.apache.olingo.fit.v4.EntityUpdateTestITCase
Running org.apache.olingo.fit.v4.ErrorResponseTestITCase
Tests run: 1, Failures: 0, Errors: 0, Skipped: 0, Time elapsed: 0.004 sec - in org.apache.olingo.fit.v4.ErrorResponseTestITCase
Running org.apache.olingo.fit.v4.FilterFactoryTestITCase
Tests run: 1, Failures: 0, Errors: 0, Skipped: 0, Time elapsed: 0.005 sec - in org.apache.olingo.fit.v4.FilterFactoryTestITCase
Running org.apache.olingo.fit.v4.JSONFormatConformanceTestITCase
Tests run: 6, Failures: 0, Errors: 0, Skipped: 0, Time elapsed: 0.055 sec - in org.apache.olingo.fit.v4.JSONFormatConformanceTestITCase
Running org.apache.olingo.fit.v4.KeyAsSegmentTestITCase
Tests run: 6, Failures: 0, Errors: 0, Skipped: 0, Time elapsed: 0.091 sec - in org.apache.olingo.fit.v4.KeyAsSegmentTestITCase
Running org.apache.olingo.fit.v4.MediaEntityTestITCase
Tests run: 7, Failures: 0, Errors: 0, Skipped: 0, Time elapsed: 0.144 sec - in org.apache.olingo.fit.v4.MediaEntityTestITCase
Running org.apache.olingo.fit.v4.MetadataTestITCase
Tests run: 3, Failures: 0, Errors: 0, Skipped: 0, Time elapsed: 0.067 sec - in org.apache.olingo.fit.v4.MetadataTestITCase
Running org.apache.olingo.fit.v4.OAuth2TestITCase
Tests run: 4, Failures: 0, Errors: 2, Skipped: 0, Time elapsed: 0.463 sec <<< FAILURE! - in org.apache.olingo.fit.v4.OAuth2TestITCase
createAndDelete(org.apache.olingo.fit.v4.OAuth2TestITCase) Time elapsed: 0.37 sec <<< ERROR!
javax.ws.rs.ProcessingException: java.net.SocketException: SocketException invoking http://localhost:9080/stub/StaticService/oauth2/token: Socket Closed
at java.net.PlainSocketImpl.getOption(PlainSocketImpl.java:286)
at java.net.Socket.getSoTimeout(Socket.java:1032)
at sun.net.www.http.HttpClient.available(HttpClient.java:356)
at sun.net.www.http.HttpClient.New(HttpClient.java:273)
at sun.net.www.http.HttpClient.New(HttpClient.java:310)
at sun.net.www.protocol.http.HttpURLConnection.getNewHttpClient(HttpURLConnection.java:987)
at sun.net.www.protocol.http.HttpURLConnection.plainConnect(HttpURLConnection.java:923)
at sun.net.www.protocol.http.HttpURLConnection.connect(HttpURLConnection.java:841)
at org.apache.cxf.transport.http.URLConnectionHTTPConduit$URLConnectionWrappedOutputStream.setupWrappedStream(URLConnectionHTTPConduit.java:177)
at org.apache.cxf.transport.http.HTTPConduit$WrappedOutputStream.handleHeadersTrustCaching(HTTPConduit.java:1302)
at org.apache.cxf.transport.http.HTTPConduit$WrappedOutputStream.onFirstWrite(HTTPConduit.java:1258)
at org.apache.cxf.transport.http.URLConnectionHTTPConduit$URLConnectionWrappedOutputStream.onFirstWrite(URLConnectionHTTPConduit.java:201)
at org.apache.cxf.io.AbstractWrappedOutputStream.write(AbstractWrappedOutputStream.java:47)
at org.apache.cxf.io.AbstractThresholdOutputStream.write(AbstractThresholdOutputStream.java:69)
at org.apache.cxf.transport.http.HTTPConduit$WrappedOutputStream.close(HTTPConduit.java:1315)
at org.apache.cxf.transport.AbstractConduit.close(AbstractConduit.java:56)
at org.apache.cxf.transport.http.HTTPConduit.close(HTTPConduit.java:638)
at org.apache.cxf.interceptor.MessageSenderInterceptor$MessageSenderEndingInterceptor.handleMessage(MessageSenderInterceptor.java:62)
at org.apache.cxf.phase.PhaseInterceptorChain.doIntercept(PhaseInterceptorChain.java:307)
at org.apache.cxf.jaxrs.client.AbstractClient.doRunInterceptorChain(AbstractClient.java:620)
at org.apache.cxf.jaxrs.client.WebClient.doChainedInvocation(WebClient.java:1087)
at org.apache.cxf.jaxrs.client.WebClient.doInvoke(WebClient.java:882)
at org.apache.cxf.jaxrs.client.WebClient.doInvoke(WebClient.java:853)
at org.apache.cxf.jaxrs.client.WebClient.form(WebClient.java:390)
at org.apache.cxf.rs.security.oauth2.client.OAuthClientUtils.getAccessToken(OAuthClientUtils.java:263)
at org.apache.cxf.rs.security.oauth2.client.OAuthClientUtils.getAccessToken(OAuthClientUtils.java:209)
at org.apache.cxf.rs.security.oauth2.client.OAuthClientUtils.getAccessToken(OAuthClientUtils.java:156)
at org.apache.cxf.rs.security.oauth2.client.OAuthClientUtils.getAccessToken(OAuthClientUtils.java:114)
at org.apache.olingo.fit.CXFOAuth2HttpClientFactory.init(CXFOAuth2HttpClientFactory.java:145)
at org.apache.olingo.client.core.http.AbstractOAuth2HttpClientFactory.create(AbstractOAuth2HttpClientFactory.java:78)
at org.apache.olingo.client.core.communication.request.AbstractODataRequest.getHttpClient(AbstractODataRequest.java:352)
at org.apache.olingo.client.core.communication.request.AbstractODataRequest.<init>(AbstractODataRequest.java:101)
at org.apache.olingo.client.core.communication.request.AbstractODataBasicRequest.<init>(AbstractODataBasicRequest.java:54)
at org.apache.olingo.client.core.communication.request.cud.ODataEntityCreateRequestImpl.<init>(ODataEntityCreateRequestImpl.java:64)
at org.apache.olingo.client.core.communication.request.cud.CUDRequestFactoryImpl.getEntityCreateRequest(CUDRequestFactoryImpl.java:59)
at org.apache.olingo.fit.v4.AbstractTestITCase.createAndDeleteOrder(AbstractTestITCase.java:147)
at org.apache.olingo.fit.v4.OAuth2TestITCase.createAndDelete(OAuth2TestITCase.java:119)
readAsFullJSON(org.apache.olingo.fit.v4.OAuth2TestITCase) Time elapsed: 0.015 sec <<< ERROR!
javax.ws.rs.ProcessingException: java.net.SocketException: SocketException invoking http://localhost:9080/stub/StaticService/oauth2/token: Socket Closed
at java.net.PlainSocketImpl.getOption(PlainSocketImpl.java:286)
at java.net.Socket.getSoTimeout(Socket.java:1032)
at sun.net.www.http.HttpClient.available(HttpClient.java:356)
at sun.net.www.http.HttpClient.New(HttpClient.java:273)
at sun.net.www.http.HttpClient.New(HttpClient.java:310)
at sun.net.www.protocol.http.HttpURLConnection.getNewHttpClient(HttpURLConnection.java:987)
at sun.net.www.protocol.http.HttpURLConnection.plainConnect(HttpURLConnection.java:923)
at sun.net.www.protocol.http.HttpURLConnection.connect(HttpURLConnection.java:841)
at org.apache.cxf.transport.http.URLConnectionHTTPConduit$URLConnectionWrappedOutputStream.setupWrappedStream(URLConnectionHTTPConduit.java:177)
at org.apache.cxf.transport.http.HTTPConduit$WrappedOutputStream.handleHeadersTrustCaching(HTTPConduit.java:1302)
at org.apache.cxf.transport.http.HTTPConduit$WrappedOutputStream.onFirstWrite(HTTPConduit.java:1258)
at org.apache.cxf.transport.http.URLConnectionHTTPConduit$URLConnectionWrappedOutputStream.onFirstWrite(URLConnectionHTTPConduit.java:201)
at org.apache.cxf.io.AbstractWrappedOutputStream.write(AbstractWrappedOutputStream.java:47)
at org.apache.cxf.io.AbstractThresholdOutputStream.write(AbstractThresholdOutputStream.java:69)
at org.apache.cxf.transport.http.HTTPConduit$WrappedOutputStream.close(HTTPConduit.java:1315)
at org.apache.cxf.transport.AbstractConduit.close(AbstractConduit.java:56)
at org.apache.cxf.transport.http.HTTPConduit.close(HTTPConduit.java:638)
at org.apache.cxf.interceptor.MessageSenderInterceptor$MessageSenderEndingInterceptor.handleMessage(MessageSenderInterceptor.java:62)
at org.apache.cxf.phase.PhaseInterceptorChain.doIntercept(PhaseInterceptorChain.java:307)
at org.apache.cxf.jaxrs.client.AbstractClient.doRunInterceptorChain(AbstractClient.java:620)
at org.apache.cxf.jaxrs.client.WebClient.doChainedInvocation(WebClient.java:1087)
at org.apache.cxf.jaxrs.client.WebClient.doInvoke(WebClient.java:882)
at org.apache.cxf.jaxrs.client.WebClient.doInvoke(WebClient.java:853)
at org.apache.cxf.jaxrs.client.WebClient.form(WebClient.java:390)
at org.apache.cxf.rs.security.oauth2.client.OAuthClientUtils.getAccessToken(OAuthClientUtils.java:263)
at org.apache.cxf.rs.security.oauth2.client.OAuthClientUtils.getAccessToken(OAuthClientUtils.java:209)
at org.apache.cxf.rs.security.oauth2.client.OAuthClientUtils.getAccessToken(OAuthClientUtils.java:156)
at org.apache.cxf.rs.security.oauth2.client.OAuthClientUtils.getAccessToken(OAuthClientUtils.java:114)
at org.apache.olingo.fit.CXFOAuth2HttpClientFactory.init(CXFOAuth2HttpClientFactory.java:145)
at org.apache.olingo.client.core.http.AbstractOAuth2HttpClientFactory.create(AbstractOAuth2HttpClientFactory.java:78)
at org.apache.olingo.client.core.communication.request.AbstractODataRequest.getHttpClient(AbstractODataRequest.java:352)
at org.apache.olingo.client.core.communication.request.AbstractODataRequest.<init>(AbstractODataRequest.java:101)
at org.apache.olingo.client.core.communication.request.AbstractODataBasicRequest.<init>(AbstractODataBasicRequest.java:54)
at org.apache.olingo.client.core.communication.request.retrieve.AbstractODataRetrieveRequest.<init>(AbstractODataRetrieveRequest.java:47)
at org.apache.olingo.client.core.communication.request.retrieve.ODataEntityRequestImpl.<init>(ODataEntityRequestImpl.java:47)
at org.apache.olingo.client.core.communication.request.retrieve.RetrieveRequestFactoryImpl.getEntityRequest(RetrieveRequestFactoryImpl.java:112)
at org.apache.olingo.fit.v4.OAuth2TestITCase.read(OAuth2TestITCase.java:83)
at org.apache.olingo.fit.v4.OAuth2TestITCase.readAsFullJSON(OAuth2TestITCase.java:109)
Running org.apache.olingo.fit.v4.OpenTypeTestITCase
Tests run: 5, Failures: 0, Errors: 0, Skipped: 0, Time elapsed: 0.087 sec - in org.apache.olingo.fit.v4.OpenTypeTestITCase
Running org.apache.olingo.fit.v4.OperationImportInvokeTestITCase
Tests run: 8, Failures: 0, Errors: 0, Skipped: 0, Time elapsed: 0.18 sec - in org.apache.olingo.fit.v4.OperationImportInvokeTestITCase
Running org.apache.olingo.fit.v4.PropertyTestITCase
Tests run: 11, Failures: 0, Errors: 0, Skipped: 0, Time elapsed: 0.093 sec - in org.apache.olingo.fit.v4.PropertyTestITCase
Running org.apache.olingo.fit.v4.PropertyValueTestITCase
Tests run: 10, Failures: 0, Errors: 0, Skipped: 0, Time elapsed: 0.053 sec - in org.apache.olingo.fit.v4.PropertyValueTestITCase
Running org.apache.olingo.fit.v4.QueryOptionsTestITCase
Tests run: 8, Failures: 0, Errors: 0, Skipped: 0, Time elapsed: 0.067 sec - in org.apache.olingo.fit.v4.QueryOptionsTestITCase
Running org.apache.olingo.fit.v4.ServiceDocumentTestITCase
Tests run: 2, Failures: 0, Errors: 0, Skipped: 0, Time elapsed: 0.011 sec - in org.apache.olingo.fit.v4.ServiceDocumentTestITCase
Running org.apache.olingo.fit.v4.SingletonTestITCase
Tests run: 8, Failures: 0, Errors: 0, Skipped: 0, Time elapsed: 0.083 sec - in org.apache.olingo.fit.v4.SingletonTestITCase
Results :
Tests in error:
OAuth2TestITCase.createAndDelete:119->AbstractTestITCase.createAndDeleteOrder:147 » Processing
OAuth2TestITCase.readAsFullJSON:109->read:83 » Processing java.net.SocketExcep...
Tests run: 555, Failures: 0, Errors: 2, Skipped: 3
[INFO] ------------------------------------------------------------------------
[INFO] Reactor Summary:
[INFO]
[INFO] Olingo-OData ...................................... SUCCESS [5.378s]
[INFO] odata-lib ......................................... SUCCESS [1.604s]
[INFO] odata-commons-api ................................. SUCCESS [20.609s]
[INFO] odata-commons-core ................................ SUCCESS [13.634s]
[INFO] odata-client-api .................................. SUCCESS [10.229s]
[INFO] odata-client-core ................................. SUCCESS [16.646s]
[INFO] odata-server-api .................................. SUCCESS [9.101s]
[INFO] odata-server-core ................................. SUCCESS [44.949s]
[INFO] odata-server-core-ext ............................. SUCCESS [10.496s]
[INFO] odata-server-tecsvc ............................... SUCCESS [6.655s]
[INFO] odata-server-test ................................. SUCCESS [7.731s]
[INFO] odata-ext ......................................... SUCCESS [8.464s]
[INFO] odata-client-proxy ................................ SUCCESS [9.855s]
[INFO] pojogen-maven-plugin .............................. SUCCESS [53.907s]
[INFO] odata-client-android .............................. SUCCESS [6.655s]
[INFO] odata-fit ......................................... FAILURE [43.466s]
[INFO] odata-dist ........................................ SKIPPED
[INFO] Olingo-OData-Client-for-Android ................... SKIPPED
[INFO] Olingo-OData-Client-for-Java ...................... SKIPPED
[INFO] Olingo-OData-Server-for-Java ...................... SKIPPED
[INFO] Olingo-OData-JavaDoc .............................. SKIPPED
[INFO] odata-samples ..................................... SKIPPED
[INFO] odata-server-sample ............................... SKIPPED
[INFO] ------------------------------------------------------------------------
[INFO] BUILD FAILURE
[INFO] ------------------------------------------------------------------------
[INFO] Total time: 4:31.265s
[INFO] Finished at: Wed Jun 03 13:47:20 UTC 2015
[INFO] Final Memory: 49M/928M
[INFO] ------------------------------------------------------------------------
[ERROR] Failed to execute goal org.apache.maven.plugins:maven-surefire-plugin:2.17:test (default-test) on project odata-fit: There are test failures.
[ERROR]
[ERROR] Please refer to <https://builds.apache.org/job/olingo-odata4/ws/fit/target/surefire-reports> for the individual test results.
[ERROR] -> [Help 1]
[ERROR]
[ERROR] To see the full stack trace of the errors, re-run Maven with the -e switch.
[ERROR] Re-run Maven using the -X switch to enable full debug logging.
[ERROR]
[ERROR] For more information about the errors and possible solutions, please read the following articles:
[ERROR] [Help 1] http://cwiki.apache.org/confluence/display/MAVEN/MojoFailureException
[ERROR]
[ERROR] After correcting the problems, you can resume the build with the command
[ERROR] mvn <goals> -rf :odata-fit
Build step 'Invoke top-level Maven targets' marked build as failure
Build failed in Jenkins: olingo-odata4 #1026
Posted by Apache Jenkins Server <je...@builds.apache.org>.
See <https://builds.apache.org/job/olingo-odata4/1026/>
------------------------------------------
[...truncated 10762 lines...]
Running org.apache.olingo.fit.proxy.v4.NonTransactionalAuthEntityCreateTestITCase
Tests run: 7, Failures: 0, Errors: 0, Skipped: 0, Time elapsed: 1.083 sec - in org.apache.olingo.fit.proxy.v4.NonTransactionalAuthEntityCreateTestITCase
Running org.apache.olingo.fit.proxy.v4.NonTransactionalEntityCreateTestITCase
Tests run: 7, Failures: 0, Errors: 0, Skipped: 0, Time elapsed: 0.694 sec - in org.apache.olingo.fit.proxy.v4.NonTransactionalEntityCreateTestITCase
Running org.apache.olingo.fit.proxy.v4.NonTransactionalEntityUpdateTestITCase
Tests run: 5, Failures: 0, Errors: 0, Skipped: 0, Time elapsed: 0.303 sec - in org.apache.olingo.fit.proxy.v4.NonTransactionalEntityUpdateTestITCase
Running org.apache.olingo.fit.proxy.v4.NonTransactionalMediaEntityTestITCase
Tests run: 3, Failures: 0, Errors: 0, Skipped: 0, Time elapsed: 0.116 sec - in org.apache.olingo.fit.proxy.v4.NonTransactionalMediaEntityTestITCase
Running org.apache.olingo.fit.proxy.v4.OpenTypeTestITCase
Tests run: 3, Failures: 0, Errors: 0, Skipped: 0, Time elapsed: 0.17 sec - in org.apache.olingo.fit.proxy.v4.OpenTypeTestITCase
Running org.apache.olingo.fit.proxy.v4.OperationImportInvokeTestITCase
Tests run: 8, Failures: 0, Errors: 0, Skipped: 0, Time elapsed: 0.093 sec - in org.apache.olingo.fit.proxy.v4.OperationImportInvokeTestITCase
Running org.apache.olingo.fit.proxy.v4.PropertyTestITCase
Tests run: 2, Failures: 0, Errors: 0, Skipped: 0, Time elapsed: 0.054 sec - in org.apache.olingo.fit.proxy.v4.PropertyTestITCase
Running org.apache.olingo.fit.proxy.v4.SingletonTestITCase
Tests run: 3, Failures: 0, Errors: 0, Skipped: 0, Time elapsed: 0.093 sec - in org.apache.olingo.fit.proxy.v4.SingletonTestITCase
Running org.apache.olingo.fit.proxy.v4.UnauthorizedEntityCreateTestITCase
Tests run: 1, Failures: 0, Errors: 0, Skipped: 0, Time elapsed: 0.011 sec - in org.apache.olingo.fit.proxy.v4.UnauthorizedEntityCreateTestITCase
Running org.apache.olingo.fit.tecsvc.client.ActionImportITCase
Tests run: 14, Failures: 0, Errors: 0, Skipped: 0, Time elapsed: 0.473 sec - in org.apache.olingo.fit.tecsvc.client.ActionImportITCase
Running org.apache.olingo.fit.tecsvc.client.BasicHttpExceptionHandlingITCase
Tests run: 1, Failures: 0, Errors: 0, Skipped: 0, Time elapsed: 0.011 sec - in org.apache.olingo.fit.tecsvc.client.BasicHttpExceptionHandlingITCase
Running org.apache.olingo.fit.tecsvc.client.BasicITCase
Tests run: 21, Failures: 0, Errors: 0, Skipped: 0, Time elapsed: 1.001 sec - in org.apache.olingo.fit.tecsvc.client.BasicITCase
Running org.apache.olingo.fit.tecsvc.client.BatchClientITCase
Tests run: 11, Failures: 0, Errors: 0, Skipped: 0, Time elapsed: 0.625 sec - in org.apache.olingo.fit.tecsvc.client.BatchClientITCase
Running org.apache.olingo.fit.tecsvc.client.BindingITCase
Tests run: 6, Failures: 0, Errors: 0, Skipped: 0, Time elapsed: 0.222 sec - in org.apache.olingo.fit.tecsvc.client.BindingITCase
Running org.apache.olingo.fit.tecsvc.client.ConditionalITCase
Tests run: 13, Failures: 0, Errors: 0, Skipped: 0, Time elapsed: 0.129 sec - in org.apache.olingo.fit.tecsvc.client.ConditionalITCase
Running org.apache.olingo.fit.tecsvc.client.DeepInsertITCase
Tests run: 7, Failures: 0, Errors: 0, Skipped: 1, Time elapsed: 0.561 sec - in org.apache.olingo.fit.tecsvc.client.DeepInsertITCase
Running org.apache.olingo.fit.tecsvc.client.EdmEnabledClientITCase
Tests run: 1, Failures: 0, Errors: 0, Skipped: 0, Time elapsed: 0.078 sec - in org.apache.olingo.fit.tecsvc.client.EdmEnabledClientITCase
Running org.apache.olingo.fit.tecsvc.client.EntityReferencesITCase
Tests run: 37, Failures: 0, Errors: 0, Skipped: 0, Time elapsed: 2.777 sec - in org.apache.olingo.fit.tecsvc.client.EntityReferencesITCase
Running org.apache.olingo.fit.tecsvc.client.ExpandSelectITCase
Tests run: 3, Failures: 0, Errors: 0, Skipped: 0, Time elapsed: 1.117 sec - in org.apache.olingo.fit.tecsvc.client.ExpandSelectITCase
Running org.apache.olingo.fit.tecsvc.client.ExpandWithSystemQueryOptionsITCase
Tests run: 10, Failures: 0, Errors: 0, Skipped: 1, Time elapsed: 0.607 sec - in org.apache.olingo.fit.tecsvc.client.ExpandWithSystemQueryOptionsITCase
Running org.apache.olingo.fit.tecsvc.client.FilterSystemQueryITCase
Tests run: 69, Failures: 0, Errors: 0, Skipped: 0, Time elapsed: 1.204 sec - in org.apache.olingo.fit.tecsvc.client.FilterSystemQueryITCase
Running org.apache.olingo.fit.tecsvc.client.FunctionImportITCase
Tests run: 10, Failures: 0, Errors: 0, Skipped: 0, Time elapsed: 0.088 sec - in org.apache.olingo.fit.tecsvc.client.FunctionImportITCase
Running org.apache.olingo.fit.tecsvc.client.MediaITCase
Tests run: 4, Failures: 0, Errors: 0, Skipped: 0, Time elapsed: 0.058 sec - in org.apache.olingo.fit.tecsvc.client.MediaITCase
Running org.apache.olingo.fit.tecsvc.client.NavigationITCase
Tests run: 5, Failures: 0, Errors: 0, Skipped: 0, Time elapsed: 0.042 sec - in org.apache.olingo.fit.tecsvc.client.NavigationITCase
Running org.apache.olingo.fit.tecsvc.client.OrderBySystemQueryITCase
Tests run: 6, Failures: 0, Errors: 0, Skipped: 0, Time elapsed: 0.06 sec - in org.apache.olingo.fit.tecsvc.client.OrderBySystemQueryITCase
Running org.apache.olingo.fit.tecsvc.client.PrimitiveComplexITCase
Tests run: 14, Failures: 0, Errors: 0, Skipped: 0, Time elapsed: 1.364 sec - in org.apache.olingo.fit.tecsvc.client.PrimitiveComplexITCase
Running org.apache.olingo.fit.tecsvc.client.SystemQueryOptionITCase
Tests run: 11, Failures: 0, Errors: 0, Skipped: 0, Time elapsed: 1.017 sec - in org.apache.olingo.fit.tecsvc.client.SystemQueryOptionITCase
Running org.apache.olingo.fit.tecsvc.http.BasicBatchITCase
Tests run: 5, Failures: 0, Errors: 0, Skipped: 0, Time elapsed: 0.019 sec - in org.apache.olingo.fit.tecsvc.http.BasicBatchITCase
Running org.apache.olingo.fit.tecsvc.http.BasicHttpITCase
Tests run: 5, Failures: 0, Errors: 0, Skipped: 0, Time elapsed: 0.02 sec - in org.apache.olingo.fit.tecsvc.http.BasicHttpITCase
Running org.apache.olingo.fit.tecsvc.http.EntityReferenceITCase
Tests run: 2, Failures: 0, Errors: 0, Skipped: 0, Time elapsed: 0.005 sec - in org.apache.olingo.fit.tecsvc.http.EntityReferenceITCase
Running org.apache.olingo.fit.tecsvc.http.PingITCase
Tests run: 2, Failures: 0, Errors: 0, Skipped: 0, Time elapsed: 0.009 sec - in org.apache.olingo.fit.tecsvc.http.PingITCase
Running org.apache.olingo.fit.v4.AsyncTestITCase
Tests run: 5, Failures: 0, Errors: 0, Skipped: 0, Time elapsed: 1.086 sec - in org.apache.olingo.fit.v4.AsyncTestITCase
Running org.apache.olingo.fit.v4.AuthBatchTestITCase
Tests run: 3, Failures: 0, Errors: 0, Skipped: 0, Time elapsed: 0.085 sec - in org.apache.olingo.fit.v4.AuthBatchTestITCase
Running org.apache.olingo.fit.v4.BatchTestITCase
Tests run: 9, Failures: 0, Errors: 0, Skipped: 0, Time elapsed: 0.309 sec - in org.apache.olingo.fit.v4.BatchTestITCase
Running org.apache.olingo.fit.v4.BoundOperationInvokeTestITCase
Tests run: 6, Failures: 0, Errors: 0, Skipped: 0, Time elapsed: 1.812 sec - in org.apache.olingo.fit.v4.BoundOperationInvokeTestITCase
Running org.apache.olingo.fit.v4.ConformanceTestITCase
Tests run: 11, Failures: 0, Errors: 0, Skipped: 0, Time elapsed: 0.269 sec - in org.apache.olingo.fit.v4.ConformanceTestITCase
Running org.apache.olingo.fit.v4.DeltaTestITCase
Tests run: 2, Failures: 0, Errors: 0, Skipped: 0, Time elapsed: 0.054 sec - in org.apache.olingo.fit.v4.DeltaTestITCase
Running org.apache.olingo.fit.v4.DerivedTypeTestITCase
Tests run: 4, Failures: 0, Errors: 0, Skipped: 0, Time elapsed: 0.102 sec - in org.apache.olingo.fit.v4.DerivedTypeTestITCase
Running org.apache.olingo.fit.v4.EntityCreateTestITCase
Tests run: 6, Failures: 0, Errors: 0, Skipped: 0, Time elapsed: 0.253 sec - in org.apache.olingo.fit.v4.EntityCreateTestITCase
Running org.apache.olingo.fit.v4.EntityRetrieveTestITCase
Tests run: 21, Failures: 0, Errors: 0, Skipped: 0, Time elapsed: 0.267 sec - in org.apache.olingo.fit.v4.EntityRetrieveTestITCase
Running org.apache.olingo.fit.v4.EntitySetTestITCase
Tests run: 11, Failures: 0, Errors: 0, Skipped: 0, Time elapsed: 0.225 sec - in org.apache.olingo.fit.v4.EntitySetTestITCase
Running org.apache.olingo.fit.v4.EntityUpdateTestITCase
Tests run: 7, Failures: 0, Errors: 0, Skipped: 1, Time elapsed: 0.248 sec - in org.apache.olingo.fit.v4.EntityUpdateTestITCase
Running org.apache.olingo.fit.v4.ErrorResponseTestITCase
Tests run: 1, Failures: 0, Errors: 0, Skipped: 0, Time elapsed: 0.009 sec - in org.apache.olingo.fit.v4.ErrorResponseTestITCase
Running org.apache.olingo.fit.v4.FilterFactoryTestITCase
Tests run: 1, Failures: 0, Errors: 0, Skipped: 0, Time elapsed: 0.008 sec - in org.apache.olingo.fit.v4.FilterFactoryTestITCase
Running org.apache.olingo.fit.v4.JSONFormatConformanceTestITCase
Tests run: 6, Failures: 0, Errors: 0, Skipped: 0, Time elapsed: 0.059 sec - in org.apache.olingo.fit.v4.JSONFormatConformanceTestITCase
Running org.apache.olingo.fit.v4.KeyAsSegmentTestITCase
Tests run: 6, Failures: 0, Errors: 0, Skipped: 0, Time elapsed: 0.11 sec - in org.apache.olingo.fit.v4.KeyAsSegmentTestITCase
Running org.apache.olingo.fit.v4.MediaEntityTestITCase
Tests run: 7, Failures: 0, Errors: 0, Skipped: 0, Time elapsed: 0.165 sec - in org.apache.olingo.fit.v4.MediaEntityTestITCase
Running org.apache.olingo.fit.v4.MetadataTestITCase
Tests run: 3, Failures: 0, Errors: 0, Skipped: 0, Time elapsed: 0.102 sec - in org.apache.olingo.fit.v4.MetadataTestITCase
Running org.apache.olingo.fit.v4.OAuth2TestITCase
Tests run: 4, Failures: 0, Errors: 2, Skipped: 0, Time elapsed: 0.534 sec <<< FAILURE! - in org.apache.olingo.fit.v4.OAuth2TestITCase
createAndDelete(org.apache.olingo.fit.v4.OAuth2TestITCase) Time elapsed: 0.421 sec <<< ERROR!
javax.ws.rs.ProcessingException: java.net.SocketException: SocketException invoking http://localhost:9080/stub/StaticService/oauth2/token: Socket Closed
at java.net.PlainSocketImpl.getOption(PlainSocketImpl.java:286)
at java.net.Socket.getSoTimeout(Socket.java:1032)
at sun.net.www.http.HttpClient.available(HttpClient.java:356)
at sun.net.www.http.HttpClient.New(HttpClient.java:273)
at sun.net.www.http.HttpClient.New(HttpClient.java:310)
at sun.net.www.protocol.http.HttpURLConnection.getNewHttpClient(HttpURLConnection.java:987)
at sun.net.www.protocol.http.HttpURLConnection.plainConnect(HttpURLConnection.java:923)
at sun.net.www.protocol.http.HttpURLConnection.connect(HttpURLConnection.java:841)
at org.apache.cxf.transport.http.URLConnectionHTTPConduit$URLConnectionWrappedOutputStream.setupWrappedStream(URLConnectionHTTPConduit.java:177)
at org.apache.cxf.transport.http.HTTPConduit$WrappedOutputStream.handleHeadersTrustCaching(HTTPConduit.java:1302)
at org.apache.cxf.transport.http.HTTPConduit$WrappedOutputStream.onFirstWrite(HTTPConduit.java:1258)
at org.apache.cxf.transport.http.URLConnectionHTTPConduit$URLConnectionWrappedOutputStream.onFirstWrite(URLConnectionHTTPConduit.java:201)
at org.apache.cxf.io.AbstractWrappedOutputStream.write(AbstractWrappedOutputStream.java:47)
at org.apache.cxf.io.AbstractThresholdOutputStream.write(AbstractThresholdOutputStream.java:69)
at org.apache.cxf.transport.http.HTTPConduit$WrappedOutputStream.close(HTTPConduit.java:1315)
at org.apache.cxf.transport.AbstractConduit.close(AbstractConduit.java:56)
at org.apache.cxf.transport.http.HTTPConduit.close(HTTPConduit.java:638)
at org.apache.cxf.interceptor.MessageSenderInterceptor$MessageSenderEndingInterceptor.handleMessage(MessageSenderInterceptor.java:62)
at org.apache.cxf.phase.PhaseInterceptorChain.doIntercept(PhaseInterceptorChain.java:307)
at org.apache.cxf.jaxrs.client.AbstractClient.doRunInterceptorChain(AbstractClient.java:620)
at org.apache.cxf.jaxrs.client.WebClient.doChainedInvocation(WebClient.java:1087)
at org.apache.cxf.jaxrs.client.WebClient.doInvoke(WebClient.java:882)
at org.apache.cxf.jaxrs.client.WebClient.doInvoke(WebClient.java:853)
at org.apache.cxf.jaxrs.client.WebClient.form(WebClient.java:390)
at org.apache.cxf.rs.security.oauth2.client.OAuthClientUtils.getAccessToken(OAuthClientUtils.java:263)
at org.apache.cxf.rs.security.oauth2.client.OAuthClientUtils.getAccessToken(OAuthClientUtils.java:209)
at org.apache.cxf.rs.security.oauth2.client.OAuthClientUtils.getAccessToken(OAuthClientUtils.java:156)
at org.apache.cxf.rs.security.oauth2.client.OAuthClientUtils.getAccessToken(OAuthClientUtils.java:114)
at org.apache.olingo.fit.CXFOAuth2HttpClientFactory.init(CXFOAuth2HttpClientFactory.java:145)
at org.apache.olingo.client.core.http.AbstractOAuth2HttpClientFactory.create(AbstractOAuth2HttpClientFactory.java:78)
at org.apache.olingo.client.core.communication.request.AbstractODataRequest.getHttpClient(AbstractODataRequest.java:352)
at org.apache.olingo.client.core.communication.request.AbstractODataRequest.<init>(AbstractODataRequest.java:101)
at org.apache.olingo.client.core.communication.request.AbstractODataBasicRequest.<init>(AbstractODataBasicRequest.java:54)
at org.apache.olingo.client.core.communication.request.cud.ODataEntityCreateRequestImpl.<init>(ODataEntityCreateRequestImpl.java:64)
at org.apache.olingo.client.core.communication.request.cud.CUDRequestFactoryImpl.getEntityCreateRequest(CUDRequestFactoryImpl.java:59)
at org.apache.olingo.fit.v4.AbstractTestITCase.createAndDeleteOrder(AbstractTestITCase.java:147)
at org.apache.olingo.fit.v4.OAuth2TestITCase.createAndDelete(OAuth2TestITCase.java:112)
readAsFullJSON(org.apache.olingo.fit.v4.OAuth2TestITCase) Time elapsed: 0.015 sec <<< ERROR!
javax.ws.rs.ProcessingException: java.net.SocketException: SocketException invoking http://localhost:9080/stub/StaticService/oauth2/token: Socket Closed
at java.net.PlainSocketImpl.getOption(PlainSocketImpl.java:286)
at java.net.Socket.getSoTimeout(Socket.java:1032)
at sun.net.www.http.HttpClient.available(HttpClient.java:356)
at sun.net.www.http.HttpClient.New(HttpClient.java:273)
at sun.net.www.http.HttpClient.New(HttpClient.java:310)
at sun.net.www.protocol.http.HttpURLConnection.getNewHttpClient(HttpURLConnection.java:987)
at sun.net.www.protocol.http.HttpURLConnection.plainConnect(HttpURLConnection.java:923)
at sun.net.www.protocol.http.HttpURLConnection.connect(HttpURLConnection.java:841)
at org.apache.cxf.transport.http.URLConnectionHTTPConduit$URLConnectionWrappedOutputStream.setupWrappedStream(URLConnectionHTTPConduit.java:177)
at org.apache.cxf.transport.http.HTTPConduit$WrappedOutputStream.handleHeadersTrustCaching(HTTPConduit.java:1302)
at org.apache.cxf.transport.http.HTTPConduit$WrappedOutputStream.onFirstWrite(HTTPConduit.java:1258)
at org.apache.cxf.transport.http.URLConnectionHTTPConduit$URLConnectionWrappedOutputStream.onFirstWrite(URLConnectionHTTPConduit.java:201)
at org.apache.cxf.io.AbstractWrappedOutputStream.write(AbstractWrappedOutputStream.java:47)
at org.apache.cxf.io.AbstractThresholdOutputStream.write(AbstractThresholdOutputStream.java:69)
at org.apache.cxf.transport.http.HTTPConduit$WrappedOutputStream.close(HTTPConduit.java:1315)
at org.apache.cxf.transport.AbstractConduit.close(AbstractConduit.java:56)
at org.apache.cxf.transport.http.HTTPConduit.close(HTTPConduit.java:638)
at org.apache.cxf.interceptor.MessageSenderInterceptor$MessageSenderEndingInterceptor.handleMessage(MessageSenderInterceptor.java:62)
at org.apache.cxf.phase.PhaseInterceptorChain.doIntercept(PhaseInterceptorChain.java:307)
at org.apache.cxf.jaxrs.client.AbstractClient.doRunInterceptorChain(AbstractClient.java:620)
at org.apache.cxf.jaxrs.client.WebClient.doChainedInvocation(WebClient.java:1087)
at org.apache.cxf.jaxrs.client.WebClient.doInvoke(WebClient.java:882)
at org.apache.cxf.jaxrs.client.WebClient.doInvoke(WebClient.java:853)
at org.apache.cxf.jaxrs.client.WebClient.form(WebClient.java:390)
at org.apache.cxf.rs.security.oauth2.client.OAuthClientUtils.getAccessToken(OAuthClientUtils.java:263)
at org.apache.cxf.rs.security.oauth2.client.OAuthClientUtils.getAccessToken(OAuthClientUtils.java:209)
at org.apache.cxf.rs.security.oauth2.client.OAuthClientUtils.getAccessToken(OAuthClientUtils.java:156)
at org.apache.cxf.rs.security.oauth2.client.OAuthClientUtils.getAccessToken(OAuthClientUtils.java:114)
at org.apache.olingo.fit.CXFOAuth2HttpClientFactory.init(CXFOAuth2HttpClientFactory.java:145)
at org.apache.olingo.client.core.http.AbstractOAuth2HttpClientFactory.create(AbstractOAuth2HttpClientFactory.java:78)
at org.apache.olingo.client.core.communication.request.AbstractODataRequest.getHttpClient(AbstractODataRequest.java:352)
at org.apache.olingo.client.core.communication.request.AbstractODataRequest.<init>(AbstractODataRequest.java:101)
at org.apache.olingo.client.core.communication.request.AbstractODataBasicRequest.<init>(AbstractODataBasicRequest.java:54)
at org.apache.olingo.client.core.communication.request.retrieve.AbstractODataRetrieveRequest.<init>(AbstractODataRetrieveRequest.java:47)
at org.apache.olingo.client.core.communication.request.retrieve.ODataEntityRequestImpl.<init>(ODataEntityRequestImpl.java:47)
at org.apache.olingo.client.core.communication.request.retrieve.RetrieveRequestFactoryImpl.getEntityRequest(RetrieveRequestFactoryImpl.java:112)
at org.apache.olingo.fit.v4.OAuth2TestITCase.read(OAuth2TestITCase.java:76)
at org.apache.olingo.fit.v4.OAuth2TestITCase.readAsFullJSON(OAuth2TestITCase.java:102)
Running org.apache.olingo.fit.v4.OpenTypeTestITCase
Tests run: 5, Failures: 0, Errors: 0, Skipped: 0, Time elapsed: 0.125 sec - in org.apache.olingo.fit.v4.OpenTypeTestITCase
Running org.apache.olingo.fit.v4.OperationImportInvokeTestITCase
Tests run: 8, Failures: 0, Errors: 0, Skipped: 0, Time elapsed: 0.263 sec - in org.apache.olingo.fit.v4.OperationImportInvokeTestITCase
Running org.apache.olingo.fit.v4.PropertyTestITCase
Tests run: 11, Failures: 0, Errors: 0, Skipped: 0, Time elapsed: 0.14 sec - in org.apache.olingo.fit.v4.PropertyTestITCase
Running org.apache.olingo.fit.v4.PropertyValueTestITCase
Tests run: 10, Failures: 0, Errors: 0, Skipped: 0, Time elapsed: 0.081 sec - in org.apache.olingo.fit.v4.PropertyValueTestITCase
Running org.apache.olingo.fit.v4.QueryOptionsTestITCase
Tests run: 8, Failures: 0, Errors: 0, Skipped: 0, Time elapsed: 0.099 sec - in org.apache.olingo.fit.v4.QueryOptionsTestITCase
Running org.apache.olingo.fit.v4.ServiceDocumentTestITCase
Tests run: 2, Failures: 0, Errors: 0, Skipped: 0, Time elapsed: 0.018 sec - in org.apache.olingo.fit.v4.ServiceDocumentTestITCase
Running org.apache.olingo.fit.v4.SingletonTestITCase
Tests run: 8, Failures: 0, Errors: 0, Skipped: 0, Time elapsed: 0.127 sec - in org.apache.olingo.fit.v4.SingletonTestITCase
Results :
Tests in error:
OAuth2TestITCase.createAndDelete:112->AbstractTestITCase.createAndDeleteOrder:147 » Processing
OAuth2TestITCase.readAsFullJSON:102->read:76 » Processing java.net.SocketExcep...
Tests run: 555, Failures: 0, Errors: 2, Skipped: 3
[INFO] ------------------------------------------------------------------------
[INFO] Reactor Summary:
[INFO]
[INFO] Olingo-OData ...................................... SUCCESS [6.985s]
[INFO] odata-lib ......................................... SUCCESS [3.210s]
[INFO] odata-commons-api ................................. SUCCESS [29.865s]
[INFO] odata-commons-core ................................ SUCCESS [27.397s]
[INFO] odata-client-api .................................. SUCCESS [18.503s]
[INFO] odata-client-core ................................. SUCCESS [31.682s]
[INFO] odata-server-api .................................. SUCCESS [19.325s]
[INFO] odata-server-core ................................. SUCCESS [1:10.452s]
[INFO] odata-server-core-ext ............................. SUCCESS [14.696s]
[INFO] odata-server-tecsvc ............................... SUCCESS [6.645s]
[INFO] odata-server-test ................................. SUCCESS [7.897s]
[INFO] odata-ext ......................................... SUCCESS [2.847s]
[INFO] odata-client-proxy ................................ SUCCESS [8.182s]
[INFO] pojogen-maven-plugin .............................. SUCCESS [35.463s]
[INFO] odata-client-android .............................. SUCCESS [10.208s]
[INFO] odata-fit ......................................... FAILURE [49.216s]
[INFO] odata-dist ........................................ SKIPPED
[INFO] Olingo-OData-Client-for-Android ................... SKIPPED
[INFO] Olingo-OData-Client-for-Java ...................... SKIPPED
[INFO] Olingo-OData-Server-for-Java ...................... SKIPPED
[INFO] Olingo-OData-JavaDoc .............................. SKIPPED
[INFO] odata-samples ..................................... SKIPPED
[INFO] odata-server-sample ............................... SKIPPED
[INFO] ------------------------------------------------------------------------
[INFO] BUILD FAILURE
[INFO] ------------------------------------------------------------------------
[INFO] Total time: 5:43.999s
[INFO] Finished at: Wed Jun 03 13:10:52 UTC 2015
[INFO] Final Memory: 55M/941M
[INFO] ------------------------------------------------------------------------
[ERROR] Failed to execute goal org.apache.maven.plugins:maven-surefire-plugin:2.17:test (default-test) on project odata-fit: There are test failures.
[ERROR]
[ERROR] Please refer to <https://builds.apache.org/job/olingo-odata4/ws/fit/target/surefire-reports> for the individual test results.
[ERROR] -> [Help 1]
[ERROR]
[ERROR] To see the full stack trace of the errors, re-run Maven with the -e switch.
[ERROR] Re-run Maven using the -X switch to enable full debug logging.
[ERROR]
[ERROR] For more information about the errors and possible solutions, please read the following articles:
[ERROR] [Help 1] http://cwiki.apache.org/confluence/display/MAVEN/MojoFailureException
[ERROR]
[ERROR] After correcting the problems, you can resume the build with the command
[ERROR] mvn <goals> -rf :odata-fit
Build step 'Invoke top-level Maven targets' marked build as failure
Build failed in Jenkins: olingo-odata4 #1025
Posted by Apache Jenkins Server <je...@builds.apache.org>.
See <https://builds.apache.org/job/olingo-odata4/1025/>
------------------------------------------
[...truncated 10761 lines...]
Running org.apache.olingo.fit.proxy.v4.NonTransactionalAuthEntityCreateTestITCase
Tests run: 7, Failures: 0, Errors: 0, Skipped: 0, Time elapsed: 1.101 sec - in org.apache.olingo.fit.proxy.v4.NonTransactionalAuthEntityCreateTestITCase
Running org.apache.olingo.fit.proxy.v4.NonTransactionalEntityCreateTestITCase
Tests run: 7, Failures: 0, Errors: 0, Skipped: 0, Time elapsed: 0.702 sec - in org.apache.olingo.fit.proxy.v4.NonTransactionalEntityCreateTestITCase
Running org.apache.olingo.fit.proxy.v4.NonTransactionalEntityUpdateTestITCase
Tests run: 5, Failures: 0, Errors: 0, Skipped: 0, Time elapsed: 0.312 sec - in org.apache.olingo.fit.proxy.v4.NonTransactionalEntityUpdateTestITCase
Running org.apache.olingo.fit.proxy.v4.NonTransactionalMediaEntityTestITCase
Tests run: 3, Failures: 0, Errors: 0, Skipped: 0, Time elapsed: 0.116 sec - in org.apache.olingo.fit.proxy.v4.NonTransactionalMediaEntityTestITCase
Running org.apache.olingo.fit.proxy.v4.OpenTypeTestITCase
Tests run: 3, Failures: 0, Errors: 0, Skipped: 0, Time elapsed: 0.171 sec - in org.apache.olingo.fit.proxy.v4.OpenTypeTestITCase
Running org.apache.olingo.fit.proxy.v4.OperationImportInvokeTestITCase
Tests run: 8, Failures: 0, Errors: 0, Skipped: 0, Time elapsed: 0.091 sec - in org.apache.olingo.fit.proxy.v4.OperationImportInvokeTestITCase
Running org.apache.olingo.fit.proxy.v4.PropertyTestITCase
Tests run: 2, Failures: 0, Errors: 0, Skipped: 0, Time elapsed: 0.055 sec - in org.apache.olingo.fit.proxy.v4.PropertyTestITCase
Running org.apache.olingo.fit.proxy.v4.SingletonTestITCase
Tests run: 3, Failures: 0, Errors: 0, Skipped: 0, Time elapsed: 0.085 sec - in org.apache.olingo.fit.proxy.v4.SingletonTestITCase
Running org.apache.olingo.fit.proxy.v4.UnauthorizedEntityCreateTestITCase
Tests run: 1, Failures: 0, Errors: 0, Skipped: 0, Time elapsed: 0.011 sec - in org.apache.olingo.fit.proxy.v4.UnauthorizedEntityCreateTestITCase
Running org.apache.olingo.fit.tecsvc.client.ActionImportITCase
Tests run: 14, Failures: 0, Errors: 0, Skipped: 0, Time elapsed: 0.469 sec - in org.apache.olingo.fit.tecsvc.client.ActionImportITCase
Running org.apache.olingo.fit.tecsvc.client.BasicHttpExceptionHandlingITCase
Tests run: 1, Failures: 0, Errors: 0, Skipped: 0, Time elapsed: 0.008 sec - in org.apache.olingo.fit.tecsvc.client.BasicHttpExceptionHandlingITCase
Running org.apache.olingo.fit.tecsvc.client.BasicITCase
Tests run: 21, Failures: 0, Errors: 0, Skipped: 0, Time elapsed: 0.981 sec - in org.apache.olingo.fit.tecsvc.client.BasicITCase
Running org.apache.olingo.fit.tecsvc.client.BatchClientITCase
Tests run: 11, Failures: 0, Errors: 0, Skipped: 0, Time elapsed: 0.623 sec - in org.apache.olingo.fit.tecsvc.client.BatchClientITCase
Running org.apache.olingo.fit.tecsvc.client.BindingITCase
Tests run: 6, Failures: 0, Errors: 0, Skipped: 0, Time elapsed: 0.224 sec - in org.apache.olingo.fit.tecsvc.client.BindingITCase
Running org.apache.olingo.fit.tecsvc.client.ConditionalITCase
Tests run: 13, Failures: 0, Errors: 0, Skipped: 0, Time elapsed: 0.124 sec - in org.apache.olingo.fit.tecsvc.client.ConditionalITCase
Running org.apache.olingo.fit.tecsvc.client.DeepInsertITCase
Tests run: 7, Failures: 0, Errors: 0, Skipped: 1, Time elapsed: 0.563 sec - in org.apache.olingo.fit.tecsvc.client.DeepInsertITCase
Running org.apache.olingo.fit.tecsvc.client.EdmEnabledClientITCase
Tests run: 1, Failures: 0, Errors: 0, Skipped: 0, Time elapsed: 0.074 sec - in org.apache.olingo.fit.tecsvc.client.EdmEnabledClientITCase
Running org.apache.olingo.fit.tecsvc.client.EntityReferencesITCase
Tests run: 37, Failures: 0, Errors: 0, Skipped: 0, Time elapsed: 2.757 sec - in org.apache.olingo.fit.tecsvc.client.EntityReferencesITCase
Running org.apache.olingo.fit.tecsvc.client.ExpandSelectITCase
Tests run: 3, Failures: 0, Errors: 0, Skipped: 0, Time elapsed: 1.113 sec - in org.apache.olingo.fit.tecsvc.client.ExpandSelectITCase
Running org.apache.olingo.fit.tecsvc.client.ExpandWithSystemQueryOptionsITCase
Tests run: 10, Failures: 0, Errors: 0, Skipped: 1, Time elapsed: 0.608 sec - in org.apache.olingo.fit.tecsvc.client.ExpandWithSystemQueryOptionsITCase
Running org.apache.olingo.fit.tecsvc.client.FilterSystemQueryITCase
Tests run: 69, Failures: 0, Errors: 0, Skipped: 0, Time elapsed: 1.185 sec - in org.apache.olingo.fit.tecsvc.client.FilterSystemQueryITCase
Running org.apache.olingo.fit.tecsvc.client.FunctionImportITCase
Tests run: 10, Failures: 0, Errors: 0, Skipped: 0, Time elapsed: 0.087 sec - in org.apache.olingo.fit.tecsvc.client.FunctionImportITCase
Running org.apache.olingo.fit.tecsvc.client.MediaITCase
Tests run: 4, Failures: 0, Errors: 0, Skipped: 0, Time elapsed: 0.055 sec - in org.apache.olingo.fit.tecsvc.client.MediaITCase
Running org.apache.olingo.fit.tecsvc.client.NavigationITCase
Tests run: 5, Failures: 0, Errors: 0, Skipped: 0, Time elapsed: 0.042 sec - in org.apache.olingo.fit.tecsvc.client.NavigationITCase
Running org.apache.olingo.fit.tecsvc.client.OrderBySystemQueryITCase
Tests run: 6, Failures: 0, Errors: 0, Skipped: 0, Time elapsed: 0.054 sec - in org.apache.olingo.fit.tecsvc.client.OrderBySystemQueryITCase
Running org.apache.olingo.fit.tecsvc.client.PrimitiveComplexITCase
Tests run: 14, Failures: 0, Errors: 0, Skipped: 0, Time elapsed: 1.396 sec - in org.apache.olingo.fit.tecsvc.client.PrimitiveComplexITCase
Running org.apache.olingo.fit.tecsvc.client.SystemQueryOptionITCase
Tests run: 11, Failures: 0, Errors: 0, Skipped: 0, Time elapsed: 0.983 sec - in org.apache.olingo.fit.tecsvc.client.SystemQueryOptionITCase
Running org.apache.olingo.fit.tecsvc.http.BasicBatchITCase
Tests run: 5, Failures: 0, Errors: 0, Skipped: 0, Time elapsed: 0.018 sec - in org.apache.olingo.fit.tecsvc.http.BasicBatchITCase
Running org.apache.olingo.fit.tecsvc.http.BasicHttpITCase
Tests run: 5, Failures: 0, Errors: 0, Skipped: 0, Time elapsed: 0.019 sec - in org.apache.olingo.fit.tecsvc.http.BasicHttpITCase
Running org.apache.olingo.fit.tecsvc.http.EntityReferenceITCase
Tests run: 2, Failures: 0, Errors: 0, Skipped: 0, Time elapsed: 0.005 sec - in org.apache.olingo.fit.tecsvc.http.EntityReferenceITCase
Running org.apache.olingo.fit.tecsvc.http.PingITCase
Tests run: 2, Failures: 0, Errors: 0, Skipped: 0, Time elapsed: 0.008 sec - in org.apache.olingo.fit.tecsvc.http.PingITCase
Running org.apache.olingo.fit.v4.AsyncTestITCase
Tests run: 5, Failures: 0, Errors: 0, Skipped: 0, Time elapsed: 1.086 sec - in org.apache.olingo.fit.v4.AsyncTestITCase
Running org.apache.olingo.fit.v4.AuthBatchTestITCase
Tests run: 3, Failures: 0, Errors: 0, Skipped: 0, Time elapsed: 0.089 sec - in org.apache.olingo.fit.v4.AuthBatchTestITCase
Running org.apache.olingo.fit.v4.BatchTestITCase
Tests run: 9, Failures: 0, Errors: 0, Skipped: 0, Time elapsed: 0.305 sec - in org.apache.olingo.fit.v4.BatchTestITCase
Running org.apache.olingo.fit.v4.BoundOperationInvokeTestITCase
Tests run: 6, Failures: 0, Errors: 0, Skipped: 0, Time elapsed: 1.802 sec - in org.apache.olingo.fit.v4.BoundOperationInvokeTestITCase
Running org.apache.olingo.fit.v4.ConformanceTestITCase
Tests run: 11, Failures: 0, Errors: 0, Skipped: 0, Time elapsed: 0.266 sec - in org.apache.olingo.fit.v4.ConformanceTestITCase
Running org.apache.olingo.fit.v4.DeltaTestITCase
Tests run: 2, Failures: 0, Errors: 0, Skipped: 0, Time elapsed: 0.054 sec - in org.apache.olingo.fit.v4.DeltaTestITCase
Running org.apache.olingo.fit.v4.DerivedTypeTestITCase
Tests run: 4, Failures: 0, Errors: 0, Skipped: 0, Time elapsed: 0.108 sec - in org.apache.olingo.fit.v4.DerivedTypeTestITCase
Running org.apache.olingo.fit.v4.EntityCreateTestITCase
Tests run: 6, Failures: 0, Errors: 0, Skipped: 0, Time elapsed: 0.26 sec - in org.apache.olingo.fit.v4.EntityCreateTestITCase
Running org.apache.olingo.fit.v4.EntityRetrieveTestITCase
Tests run: 21, Failures: 0, Errors: 0, Skipped: 0, Time elapsed: 0.268 sec - in org.apache.olingo.fit.v4.EntityRetrieveTestITCase
Running org.apache.olingo.fit.v4.EntitySetTestITCase
Tests run: 11, Failures: 0, Errors: 0, Skipped: 0, Time elapsed: 0.237 sec - in org.apache.olingo.fit.v4.EntitySetTestITCase
Running org.apache.olingo.fit.v4.EntityUpdateTestITCase
Tests run: 7, Failures: 0, Errors: 0, Skipped: 1, Time elapsed: 0.232 sec - in org.apache.olingo.fit.v4.EntityUpdateTestITCase
Running org.apache.olingo.fit.v4.ErrorResponseTestITCase
Tests run: 1, Failures: 0, Errors: 0, Skipped: 0, Time elapsed: 0.008 sec - in org.apache.olingo.fit.v4.ErrorResponseTestITCase
Running org.apache.olingo.fit.v4.FilterFactoryTestITCase
Tests run: 1, Failures: 0, Errors: 0, Skipped: 0, Time elapsed: 0.008 sec - in org.apache.olingo.fit.v4.FilterFactoryTestITCase
Running org.apache.olingo.fit.v4.JSONFormatConformanceTestITCase
Tests run: 6, Failures: 0, Errors: 0, Skipped: 0, Time elapsed: 0.056 sec - in org.apache.olingo.fit.v4.JSONFormatConformanceTestITCase
Running org.apache.olingo.fit.v4.KeyAsSegmentTestITCase
Tests run: 6, Failures: 0, Errors: 0, Skipped: 0, Time elapsed: 0.113 sec - in org.apache.olingo.fit.v4.KeyAsSegmentTestITCase
Running org.apache.olingo.fit.v4.MediaEntityTestITCase
Tests run: 7, Failures: 0, Errors: 0, Skipped: 0, Time elapsed: 0.168 sec - in org.apache.olingo.fit.v4.MediaEntityTestITCase
Running org.apache.olingo.fit.v4.MetadataTestITCase
Tests run: 3, Failures: 0, Errors: 0, Skipped: 0, Time elapsed: 0.103 sec - in org.apache.olingo.fit.v4.MetadataTestITCase
Running org.apache.olingo.fit.v4.OAuth2TestITCase
Tests run: 4, Failures: 0, Errors: 2, Skipped: 0, Time elapsed: 0.52 sec <<< FAILURE! - in org.apache.olingo.fit.v4.OAuth2TestITCase
createAndDelete(org.apache.olingo.fit.v4.OAuth2TestITCase) Time elapsed: 0.408 sec <<< ERROR!
javax.ws.rs.ProcessingException: java.net.SocketException: SocketException invoking http://localhost:9080/stub/StaticService/oauth2/token: Socket Closed
at java.net.PlainSocketImpl.getOption(PlainSocketImpl.java:286)
at java.net.Socket.getSoTimeout(Socket.java:1032)
at sun.net.www.http.HttpClient.available(HttpClient.java:356)
at sun.net.www.http.HttpClient.New(HttpClient.java:273)
at sun.net.www.http.HttpClient.New(HttpClient.java:310)
at sun.net.www.protocol.http.HttpURLConnection.getNewHttpClient(HttpURLConnection.java:987)
at sun.net.www.protocol.http.HttpURLConnection.plainConnect(HttpURLConnection.java:923)
at sun.net.www.protocol.http.HttpURLConnection.connect(HttpURLConnection.java:841)
at org.apache.cxf.transport.http.URLConnectionHTTPConduit$URLConnectionWrappedOutputStream.setupWrappedStream(URLConnectionHTTPConduit.java:177)
at org.apache.cxf.transport.http.HTTPConduit$WrappedOutputStream.handleHeadersTrustCaching(HTTPConduit.java:1302)
at org.apache.cxf.transport.http.HTTPConduit$WrappedOutputStream.onFirstWrite(HTTPConduit.java:1258)
at org.apache.cxf.transport.http.URLConnectionHTTPConduit$URLConnectionWrappedOutputStream.onFirstWrite(URLConnectionHTTPConduit.java:201)
at org.apache.cxf.io.AbstractWrappedOutputStream.write(AbstractWrappedOutputStream.java:47)
at org.apache.cxf.io.AbstractThresholdOutputStream.write(AbstractThresholdOutputStream.java:69)
at org.apache.cxf.transport.http.HTTPConduit$WrappedOutputStream.close(HTTPConduit.java:1315)
at org.apache.cxf.transport.AbstractConduit.close(AbstractConduit.java:56)
at org.apache.cxf.transport.http.HTTPConduit.close(HTTPConduit.java:638)
at org.apache.cxf.interceptor.MessageSenderInterceptor$MessageSenderEndingInterceptor.handleMessage(MessageSenderInterceptor.java:62)
at org.apache.cxf.phase.PhaseInterceptorChain.doIntercept(PhaseInterceptorChain.java:307)
at org.apache.cxf.jaxrs.client.AbstractClient.doRunInterceptorChain(AbstractClient.java:620)
at org.apache.cxf.jaxrs.client.WebClient.doChainedInvocation(WebClient.java:1087)
at org.apache.cxf.jaxrs.client.WebClient.doInvoke(WebClient.java:882)
at org.apache.cxf.jaxrs.client.WebClient.doInvoke(WebClient.java:853)
at org.apache.cxf.jaxrs.client.WebClient.form(WebClient.java:390)
at org.apache.cxf.rs.security.oauth2.client.OAuthClientUtils.getAccessToken(OAuthClientUtils.java:263)
at org.apache.cxf.rs.security.oauth2.client.OAuthClientUtils.getAccessToken(OAuthClientUtils.java:209)
at org.apache.cxf.rs.security.oauth2.client.OAuthClientUtils.getAccessToken(OAuthClientUtils.java:156)
at org.apache.cxf.rs.security.oauth2.client.OAuthClientUtils.getAccessToken(OAuthClientUtils.java:114)
at org.apache.olingo.fit.CXFOAuth2HttpClientFactory.init(CXFOAuth2HttpClientFactory.java:145)
at org.apache.olingo.client.core.http.AbstractOAuth2HttpClientFactory.create(AbstractOAuth2HttpClientFactory.java:78)
at org.apache.olingo.client.core.communication.request.AbstractODataRequest.getHttpClient(AbstractODataRequest.java:352)
at org.apache.olingo.client.core.communication.request.AbstractODataRequest.<init>(AbstractODataRequest.java:101)
at org.apache.olingo.client.core.communication.request.AbstractODataBasicRequest.<init>(AbstractODataBasicRequest.java:54)
at org.apache.olingo.client.core.communication.request.cud.ODataEntityCreateRequestImpl.<init>(ODataEntityCreateRequestImpl.java:64)
at org.apache.olingo.client.core.communication.request.cud.CUDRequestFactoryImpl.getEntityCreateRequest(CUDRequestFactoryImpl.java:59)
at org.apache.olingo.fit.v4.AbstractTestITCase.createAndDeleteOrder(AbstractTestITCase.java:147)
at org.apache.olingo.fit.v4.OAuth2TestITCase.createAndDelete(OAuth2TestITCase.java:112)
readAsFullJSON(org.apache.olingo.fit.v4.OAuth2TestITCase) Time elapsed: 0.014 sec <<< ERROR!
javax.ws.rs.ProcessingException: java.net.SocketException: SocketException invoking http://localhost:9080/stub/StaticService/oauth2/token: Socket Closed
at java.net.PlainSocketImpl.getOption(PlainSocketImpl.java:286)
at java.net.Socket.getSoTimeout(Socket.java:1032)
at sun.net.www.http.HttpClient.available(HttpClient.java:356)
at sun.net.www.http.HttpClient.New(HttpClient.java:273)
at sun.net.www.http.HttpClient.New(HttpClient.java:310)
at sun.net.www.protocol.http.HttpURLConnection.getNewHttpClient(HttpURLConnection.java:987)
at sun.net.www.protocol.http.HttpURLConnection.plainConnect(HttpURLConnection.java:923)
at sun.net.www.protocol.http.HttpURLConnection.connect(HttpURLConnection.java:841)
at org.apache.cxf.transport.http.URLConnectionHTTPConduit$URLConnectionWrappedOutputStream.setupWrappedStream(URLConnectionHTTPConduit.java:177)
at org.apache.cxf.transport.http.HTTPConduit$WrappedOutputStream.handleHeadersTrustCaching(HTTPConduit.java:1302)
at org.apache.cxf.transport.http.HTTPConduit$WrappedOutputStream.onFirstWrite(HTTPConduit.java:1258)
at org.apache.cxf.transport.http.URLConnectionHTTPConduit$URLConnectionWrappedOutputStream.onFirstWrite(URLConnectionHTTPConduit.java:201)
at org.apache.cxf.io.AbstractWrappedOutputStream.write(AbstractWrappedOutputStream.java:47)
at org.apache.cxf.io.AbstractThresholdOutputStream.write(AbstractThresholdOutputStream.java:69)
at org.apache.cxf.transport.http.HTTPConduit$WrappedOutputStream.close(HTTPConduit.java:1315)
at org.apache.cxf.transport.AbstractConduit.close(AbstractConduit.java:56)
at org.apache.cxf.transport.http.HTTPConduit.close(HTTPConduit.java:638)
at org.apache.cxf.interceptor.MessageSenderInterceptor$MessageSenderEndingInterceptor.handleMessage(MessageSenderInterceptor.java:62)
at org.apache.cxf.phase.PhaseInterceptorChain.doIntercept(PhaseInterceptorChain.java:307)
at org.apache.cxf.jaxrs.client.AbstractClient.doRunInterceptorChain(AbstractClient.java:620)
at org.apache.cxf.jaxrs.client.WebClient.doChainedInvocation(WebClient.java:1087)
at org.apache.cxf.jaxrs.client.WebClient.doInvoke(WebClient.java:882)
at org.apache.cxf.jaxrs.client.WebClient.doInvoke(WebClient.java:853)
at org.apache.cxf.jaxrs.client.WebClient.form(WebClient.java:390)
at org.apache.cxf.rs.security.oauth2.client.OAuthClientUtils.getAccessToken(OAuthClientUtils.java:263)
at org.apache.cxf.rs.security.oauth2.client.OAuthClientUtils.getAccessToken(OAuthClientUtils.java:209)
at org.apache.cxf.rs.security.oauth2.client.OAuthClientUtils.getAccessToken(OAuthClientUtils.java:156)
at org.apache.cxf.rs.security.oauth2.client.OAuthClientUtils.getAccessToken(OAuthClientUtils.java:114)
at org.apache.olingo.fit.CXFOAuth2HttpClientFactory.init(CXFOAuth2HttpClientFactory.java:145)
at org.apache.olingo.client.core.http.AbstractOAuth2HttpClientFactory.create(AbstractOAuth2HttpClientFactory.java:78)
at org.apache.olingo.client.core.communication.request.AbstractODataRequest.getHttpClient(AbstractODataRequest.java:352)
at org.apache.olingo.client.core.communication.request.AbstractODataRequest.<init>(AbstractODataRequest.java:101)
at org.apache.olingo.client.core.communication.request.AbstractODataBasicRequest.<init>(AbstractODataBasicRequest.java:54)
at org.apache.olingo.client.core.communication.request.retrieve.AbstractODataRetrieveRequest.<init>(AbstractODataRetrieveRequest.java:47)
at org.apache.olingo.client.core.communication.request.retrieve.ODataEntityRequestImpl.<init>(ODataEntityRequestImpl.java:47)
at org.apache.olingo.client.core.communication.request.retrieve.RetrieveRequestFactoryImpl.getEntityRequest(RetrieveRequestFactoryImpl.java:112)
at org.apache.olingo.fit.v4.OAuth2TestITCase.read(OAuth2TestITCase.java:76)
at org.apache.olingo.fit.v4.OAuth2TestITCase.readAsFullJSON(OAuth2TestITCase.java:102)
Running org.apache.olingo.fit.v4.OpenTypeTestITCase
Tests run: 5, Failures: 0, Errors: 0, Skipped: 0, Time elapsed: 0.123 sec - in org.apache.olingo.fit.v4.OpenTypeTestITCase
Running org.apache.olingo.fit.v4.OperationImportInvokeTestITCase
Tests run: 8, Failures: 0, Errors: 0, Skipped: 0, Time elapsed: 0.263 sec - in org.apache.olingo.fit.v4.OperationImportInvokeTestITCase
Running org.apache.olingo.fit.v4.PropertyTestITCase
Tests run: 11, Failures: 0, Errors: 0, Skipped: 0, Time elapsed: 0.14 sec - in org.apache.olingo.fit.v4.PropertyTestITCase
Running org.apache.olingo.fit.v4.PropertyValueTestITCase
Tests run: 10, Failures: 0, Errors: 0, Skipped: 0, Time elapsed: 0.082 sec - in org.apache.olingo.fit.v4.PropertyValueTestITCase
Running org.apache.olingo.fit.v4.QueryOptionsTestITCase
Tests run: 8, Failures: 0, Errors: 0, Skipped: 0, Time elapsed: 0.105 sec - in org.apache.olingo.fit.v4.QueryOptionsTestITCase
Running org.apache.olingo.fit.v4.ServiceDocumentTestITCase
Tests run: 2, Failures: 0, Errors: 0, Skipped: 0, Time elapsed: 0.019 sec - in org.apache.olingo.fit.v4.ServiceDocumentTestITCase
Running org.apache.olingo.fit.v4.SingletonTestITCase
Tests run: 8, Failures: 0, Errors: 0, Skipped: 0, Time elapsed: 0.13 sec - in org.apache.olingo.fit.v4.SingletonTestITCase
Results :
Tests in error:
OAuth2TestITCase.createAndDelete:112->AbstractTestITCase.createAndDeleteOrder:147 » Processing
OAuth2TestITCase.readAsFullJSON:102->read:76 » Processing java.net.SocketExcep...
Tests run: 555, Failures: 0, Errors: 2, Skipped: 3
[INFO] ------------------------------------------------------------------------
[INFO] Reactor Summary:
[INFO]
[INFO] Olingo-OData ...................................... SUCCESS [8.852s]
[INFO] odata-lib ......................................... SUCCESS [4.313s]
[INFO] odata-commons-api ................................. SUCCESS [29.704s]
[INFO] odata-commons-core ................................ SUCCESS [28.860s]
[INFO] odata-client-api .................................. SUCCESS [21.896s]
[INFO] odata-client-core ................................. SUCCESS [35.253s]
[INFO] odata-server-api .................................. SUCCESS [22.031s]
[INFO] odata-server-core ................................. SUCCESS [1:05.316s]
[INFO] odata-server-core-ext ............................. SUCCESS [17.920s]
[INFO] odata-server-tecsvc ............................... SUCCESS [7.546s]
[INFO] odata-server-test ................................. SUCCESS [8.048s]
[INFO] odata-ext ......................................... SUCCESS [3.184s]
[INFO] odata-client-proxy ................................ SUCCESS [11.692s]
[INFO] pojogen-maven-plugin .............................. SUCCESS [39.492s]
[INFO] odata-client-android .............................. SUCCESS [10.976s]
[INFO] odata-fit ......................................... FAILURE [49.474s]
[INFO] odata-dist ........................................ SKIPPED
[INFO] Olingo-OData-Client-for-Android ................... SKIPPED
[INFO] Olingo-OData-Client-for-Java ...................... SKIPPED
[INFO] Olingo-OData-Server-for-Java ...................... SKIPPED
[INFO] Olingo-OData-JavaDoc .............................. SKIPPED
[INFO] odata-samples ..................................... SKIPPED
[INFO] odata-server-sample ............................... SKIPPED
[INFO] ------------------------------------------------------------------------
[INFO] BUILD FAILURE
[INFO] ------------------------------------------------------------------------
[INFO] Total time: 6:06.138s
[INFO] Finished at: Wed Jun 03 13:04:29 UTC 2015
[INFO] Final Memory: 68M/467M
[INFO] ------------------------------------------------------------------------
[ERROR] Failed to execute goal org.apache.maven.plugins:maven-surefire-plugin:2.17:test (default-test) on project odata-fit: There are test failures.
[ERROR]
[ERROR] Please refer to <https://builds.apache.org/job/olingo-odata4/ws/fit/target/surefire-reports> for the individual test results.
[ERROR] -> [Help 1]
[ERROR]
[ERROR] To see the full stack trace of the errors, re-run Maven with the -e switch.
[ERROR] Re-run Maven using the -X switch to enable full debug logging.
[ERROR]
[ERROR] For more information about the errors and possible solutions, please read the following articles:
[ERROR] [Help 1] http://cwiki.apache.org/confluence/display/MAVEN/MojoFailureException
[ERROR]
[ERROR] After correcting the problems, you can resume the build with the command
[ERROR] mvn <goals> -rf :odata-fit
Build step 'Invoke top-level Maven targets' marked build as failure
Build failed in Jenkins: olingo-odata4 #1024
Posted by Apache Jenkins Server <je...@builds.apache.org>.
See <https://builds.apache.org/job/olingo-odata4/1024/changes>
Changes:
[christian.amend] [OLINGO-663] Custom etag handling in default processor
------------------------------------------
[...truncated 10687 lines...]
[INFO] Deleting <https://builds.apache.org/job/olingo-odata4/ws/fit/target>
[INFO]
[INFO] --- maven-remote-resources-plugin:1.5:process (default) @ odata-fit ---
[INFO]
[INFO] --- maven-resources-plugin:2.6:resources (default-resources) @ odata-fit ---
[INFO] Using 'UTF-8' encoding to copy filtered resources.
[INFO] Copying 118 resources
[INFO] Copying 3 resources
[INFO] Copying 3 resources
[INFO]
[INFO] --- maven-compiler-plugin:2.3.2:compile (default-compile) @ odata-fit ---
[INFO] Compiling 46 source files to <https://builds.apache.org/job/olingo-odata4/ws/fit/target/classes>
[INFO]
[INFO] --- maven-dependency-plugin:2.8:unpack-dependencies (unpack-dependencies) @ odata-fit ---
[INFO] Unpacking <https://builds.apache.org/job/olingo-odata4/ws/lib/server-core/target/odata-server-core-4.0.0-SNAPSHOT.jar> to <https://builds.apache.org/job/olingo-odata4/ws/fit/target/classes> with includes "" and excludes ""
[INFO] Unpacking <https://builds.apache.org/job/olingo-odata4/ws/ext/client-proxy/target/odata-client-proxy-4.0.0-SNAPSHOT.jar> to <https://builds.apache.org/job/olingo-odata4/ws/fit/target/classes> with includes "" and excludes ""
[INFO] Unpacking <https://builds.apache.org/job/olingo-odata4/ws/lib/commons-api/target/odata-commons-api-4.0.0-SNAPSHOT.jar> to <https://builds.apache.org/job/olingo-odata4/ws/fit/target/classes> with includes "" and excludes ""
[INFO] Unpacking <https://builds.apache.org/job/olingo-odata4/ws/lib/client-core/target/odata-client-core-4.0.0-SNAPSHOT.jar> to <https://builds.apache.org/job/olingo-odata4/ws/fit/target/classes> with includes "" and excludes ""
[INFO] Unpacking <https://builds.apache.org/job/olingo-odata4/ws/lib/client-api/target/odata-client-api-4.0.0-SNAPSHOT.jar> to <https://builds.apache.org/job/olingo-odata4/ws/fit/target/classes> with includes "" and excludes ""
[INFO] Unpacking <https://builds.apache.org/job/olingo-odata4/ws/lib/server-api/target/odata-server-api-4.0.0-SNAPSHOT.jar> to <https://builds.apache.org/job/olingo-odata4/ws/fit/target/classes> with includes "" and excludes ""
[INFO] Unpacking <https://builds.apache.org/job/olingo-odata4/ws/lib/commons-core/target/odata-commons-core-4.0.0-SNAPSHOT.jar> to <https://builds.apache.org/job/olingo-odata4/ws/fit/target/classes> with includes "" and excludes ""
[INFO] Unpacking /home/jenkins/.m2/repository/org/apache/olingo/odata-server-tecsvc/4.0.0-SNAPSHOT/odata-server-tecsvc-4.0.0-SNAPSHOT.jar to <https://builds.apache.org/job/olingo-odata4/ws/fit/target/classes> with includes "" and excludes ""
[INFO]
[INFO] --- maven-war-plugin:2.4:exploded (compile) @ odata-fit ---
[INFO] Exploding webapp
[INFO] Assembling webapp [odata-fit] in [<https://builds.apache.org/job/olingo-odata4/ws/fit/target/odata-fit-4.0.0-SNAPSHOT]>
[INFO] Processing war project
[INFO] Copying webapp webResources [<https://builds.apache.org/job/olingo-odata4/ws/fit/target/classes]> to [<https://builds.apache.org/job/olingo-odata4/ws/fit/target/odata-fit-4.0.0-SNAPSHOT]>
[INFO] Copying webapp resources [<https://builds.apache.org/job/olingo-odata4/ws/fit/src/main/webapp]>
[INFO] Webapp assembled in [754 msecs]
[INFO]
[INFO] --- maven-resources-plugin:2.6:testResources (default-testResources) @ odata-fit ---
[INFO] Using 'UTF-8' encoding to copy filtered resources.
[INFO] Copying 2 resources
[INFO] Copying 3 resources
[INFO]
[INFO] --- maven-compiler-plugin:2.3.2:testCompile (default-testCompile) @ odata-fit ---
[INFO] Compiling 284 source files to <https://builds.apache.org/job/olingo-odata4/ws/fit/target/test-classes>
[INFO]
[INFO] --- maven-surefire-plugin:2.17:test (default-test) @ odata-fit ---
[INFO] Surefire report directory: <https://builds.apache.org/job/olingo-odata4/ws/fit/target/surefire-reports>
-------------------------------------------------------
T E S T S
-------------------------------------------------------
Running org.apache.olingo.fit.proxy.v4.APIBasicDesignTestITCase
Tests run: 25, Failures: 0, Errors: 0, Skipped: 0, Time elapsed: 9.393 sec - in org.apache.olingo.fit.proxy.v4.APIBasicDesignTestITCase
Running org.apache.olingo.fit.proxy.v4.AsyncTestITCase
Tests run: 3, Failures: 0, Errors: 0, Skipped: 0, Time elapsed: 4.025 sec - in org.apache.olingo.fit.proxy.v4.AsyncTestITCase
Running org.apache.olingo.fit.proxy.v4.AuthEntityCreateTestITCase
Tests run: 7, Failures: 0, Errors: 0, Skipped: 0, Time elapsed: 1.384 sec - in org.apache.olingo.fit.proxy.v4.AuthEntityCreateTestITCase
Running org.apache.olingo.fit.proxy.v4.AuthEntityRetrieveTestITCase
Tests run: 10, Failures: 0, Errors: 0, Skipped: 0, Time elapsed: 0.268 sec - in org.apache.olingo.fit.proxy.v4.AuthEntityRetrieveTestITCase
Running org.apache.olingo.fit.proxy.v4.BoundOperationInvokeTestITCase
Tests run: 10, Failures: 0, Errors: 0, Skipped: 0, Time elapsed: 0.107 sec - in org.apache.olingo.fit.proxy.v4.BoundOperationInvokeTestITCase
Running org.apache.olingo.fit.proxy.v4.ContextTestITCase
Tests run: 2, Failures: 0, Errors: 0, Skipped: 0, Time elapsed: 0.084 sec - in org.apache.olingo.fit.proxy.v4.ContextTestITCase
Running org.apache.olingo.fit.proxy.v4.DerivedTypeTestITCase
Tests run: 2, Failures: 0, Errors: 0, Skipped: 0, Time elapsed: 0.077 sec - in org.apache.olingo.fit.proxy.v4.DerivedTypeTestITCase
Running org.apache.olingo.fit.proxy.v4.EntityCreateTestITCase
Tests run: 7, Failures: 0, Errors: 0, Skipped: 0, Time elapsed: 0.668 sec - in org.apache.olingo.fit.proxy.v4.EntityCreateTestITCase
Running org.apache.olingo.fit.proxy.v4.EntityRetrieveTestITCase
Tests run: 10, Failures: 0, Errors: 0, Skipped: 0, Time elapsed: 0.171 sec - in org.apache.olingo.fit.proxy.v4.EntityRetrieveTestITCase
Running org.apache.olingo.fit.proxy.v4.EntitySetTestITCase
Tests run: 4, Failures: 0, Errors: 0, Skipped: 0, Time elapsed: 0.09 sec - in org.apache.olingo.fit.proxy.v4.EntitySetTestITCase
Running org.apache.olingo.fit.proxy.v4.EntityUpdateTestITCase
Tests run: 5, Failures: 0, Errors: 0, Skipped: 0, Time elapsed: 0.287 sec - in org.apache.olingo.fit.proxy.v4.EntityUpdateTestITCase
Running org.apache.olingo.fit.proxy.v4.FilterTestITCase
Tests run: 3, Failures: 0, Errors: 0, Skipped: 0, Time elapsed: 0.074 sec - in org.apache.olingo.fit.proxy.v4.FilterTestITCase
Running org.apache.olingo.fit.proxy.v4.KeyAsSegmentTestITCase
Tests run: 3, Failures: 0, Errors: 0, Skipped: 0, Time elapsed: 0.161 sec - in org.apache.olingo.fit.proxy.v4.KeyAsSegmentTestITCase
Running org.apache.olingo.fit.proxy.v4.MediaEntityTestITCase
Tests run: 3, Failures: 0, Errors: 0, Skipped: 0, Time elapsed: 0.132 sec - in org.apache.olingo.fit.proxy.v4.MediaEntityTestITCase
Running org.apache.olingo.fit.proxy.v4.NonTransactionalAuthEntityCreateTestITCase
Tests run: 7, Failures: 0, Errors: 0, Skipped: 0, Time elapsed: 0.891 sec - in org.apache.olingo.fit.proxy.v4.NonTransactionalAuthEntityCreateTestITCase
Running org.apache.olingo.fit.proxy.v4.NonTransactionalEntityCreateTestITCase
Tests run: 7, Failures: 0, Errors: 0, Skipped: 0, Time elapsed: 0.575 sec - in org.apache.olingo.fit.proxy.v4.NonTransactionalEntityCreateTestITCase
Running org.apache.olingo.fit.proxy.v4.NonTransactionalEntityUpdateTestITCase
Tests run: 5, Failures: 0, Errors: 0, Skipped: 0, Time elapsed: 0.257 sec - in org.apache.olingo.fit.proxy.v4.NonTransactionalEntityUpdateTestITCase
Running org.apache.olingo.fit.proxy.v4.NonTransactionalMediaEntityTestITCase
Tests run: 3, Failures: 0, Errors: 0, Skipped: 0, Time elapsed: 0.093 sec - in org.apache.olingo.fit.proxy.v4.NonTransactionalMediaEntityTestITCase
Running org.apache.olingo.fit.proxy.v4.OpenTypeTestITCase
Tests run: 3, Failures: 0, Errors: 0, Skipped: 0, Time elapsed: 0.158 sec - in org.apache.olingo.fit.proxy.v4.OpenTypeTestITCase
Running org.apache.olingo.fit.proxy.v4.OperationImportInvokeTestITCase
Tests run: 8, Failures: 0, Errors: 0, Skipped: 0, Time elapsed: 0.082 sec - in org.apache.olingo.fit.proxy.v4.OperationImportInvokeTestITCase
Running org.apache.olingo.fit.proxy.v4.PropertyTestITCase
Tests run: 2, Failures: 0, Errors: 0, Skipped: 0, Time elapsed: 0.043 sec - in org.apache.olingo.fit.proxy.v4.PropertyTestITCase
Running org.apache.olingo.fit.proxy.v4.SingletonTestITCase
Tests run: 3, Failures: 0, Errors: 0, Skipped: 0, Time elapsed: 0.059 sec - in org.apache.olingo.fit.proxy.v4.SingletonTestITCase
Running org.apache.olingo.fit.proxy.v4.UnauthorizedEntityCreateTestITCase
Tests run: 1, Failures: 0, Errors: 0, Skipped: 0, Time elapsed: 0.007 sec - in org.apache.olingo.fit.proxy.v4.UnauthorizedEntityCreateTestITCase
Running org.apache.olingo.fit.tecsvc.client.ActionImportITCase
Tests run: 14, Failures: 0, Errors: 0, Skipped: 0, Time elapsed: 0.391 sec - in org.apache.olingo.fit.tecsvc.client.ActionImportITCase
Running org.apache.olingo.fit.tecsvc.client.BasicHttpExceptionHandlingITCase
Tests run: 1, Failures: 0, Errors: 0, Skipped: 0, Time elapsed: 0.007 sec - in org.apache.olingo.fit.tecsvc.client.BasicHttpExceptionHandlingITCase
Running org.apache.olingo.fit.tecsvc.client.BasicITCase
Tests run: 21, Failures: 0, Errors: 0, Skipped: 0, Time elapsed: 0.774 sec - in org.apache.olingo.fit.tecsvc.client.BasicITCase
Running org.apache.olingo.fit.tecsvc.client.BatchClientITCase
Tests run: 11, Failures: 0, Errors: 0, Skipped: 0, Time elapsed: 0.161 sec - in org.apache.olingo.fit.tecsvc.client.BatchClientITCase
Running org.apache.olingo.fit.tecsvc.client.BindingITCase
Tests run: 6, Failures: 0, Errors: 0, Skipped: 0, Time elapsed: 0.616 sec - in org.apache.olingo.fit.tecsvc.client.BindingITCase
Running org.apache.olingo.fit.tecsvc.client.ConditionalITCase
Tests run: 13, Failures: 0, Errors: 0, Skipped: 0, Time elapsed: 0.1 sec - in org.apache.olingo.fit.tecsvc.client.ConditionalITCase
Running org.apache.olingo.fit.tecsvc.client.DeepInsertITCase
Tests run: 7, Failures: 0, Errors: 0, Skipped: 1, Time elapsed: 0.432 sec - in org.apache.olingo.fit.tecsvc.client.DeepInsertITCase
Running org.apache.olingo.fit.tecsvc.client.EdmEnabledClientITCase
Tests run: 1, Failures: 0, Errors: 0, Skipped: 0, Time elapsed: 0.066 sec - in org.apache.olingo.fit.tecsvc.client.EdmEnabledClientITCase
Running org.apache.olingo.fit.tecsvc.client.EntityReferencesITCase
Tests run: 37, Failures: 0, Errors: 0, Skipped: 0, Time elapsed: 2.225 sec - in org.apache.olingo.fit.tecsvc.client.EntityReferencesITCase
Running org.apache.olingo.fit.tecsvc.client.ExpandSelectITCase
Tests run: 3, Failures: 0, Errors: 0, Skipped: 0, Time elapsed: 0.124 sec - in org.apache.olingo.fit.tecsvc.client.ExpandSelectITCase
Running org.apache.olingo.fit.tecsvc.client.ExpandWithSystemQueryOptionsITCase
Tests run: 10, Failures: 0, Errors: 0, Skipped: 1, Time elapsed: 0.481 sec - in org.apache.olingo.fit.tecsvc.client.ExpandWithSystemQueryOptionsITCase
Running org.apache.olingo.fit.tecsvc.client.FilterSystemQueryITCase
Tests run: 69, Failures: 0, Errors: 0, Skipped: 0, Time elapsed: 1.856 sec - in org.apache.olingo.fit.tecsvc.client.FilterSystemQueryITCase
Running org.apache.olingo.fit.tecsvc.client.FunctionImportITCase
Tests run: 10, Failures: 0, Errors: 0, Skipped: 0, Time elapsed: 0.068 sec - in org.apache.olingo.fit.tecsvc.client.FunctionImportITCase
Running org.apache.olingo.fit.tecsvc.client.MediaITCase
Tests run: 4, Failures: 0, Errors: 0, Skipped: 0, Time elapsed: 0.034 sec - in org.apache.olingo.fit.tecsvc.client.MediaITCase
Running org.apache.olingo.fit.tecsvc.client.NavigationITCase
Tests run: 5, Failures: 0, Errors: 0, Skipped: 0, Time elapsed: 0.026 sec - in org.apache.olingo.fit.tecsvc.client.NavigationITCase
Running org.apache.olingo.fit.tecsvc.client.OrderBySystemQueryITCase
Tests run: 6, Failures: 0, Errors: 0, Skipped: 0, Time elapsed: 0.032 sec - in org.apache.olingo.fit.tecsvc.client.OrderBySystemQueryITCase
Running org.apache.olingo.fit.tecsvc.client.PrimitiveComplexITCase
Tests run: 14, Failures: 0, Errors: 0, Skipped: 0, Time elapsed: 0.184 sec - in org.apache.olingo.fit.tecsvc.client.PrimitiveComplexITCase
Running org.apache.olingo.fit.tecsvc.client.SystemQueryOptionITCase
Tests run: 11, Failures: 0, Errors: 0, Skipped: 0, Time elapsed: 0.664 sec - in org.apache.olingo.fit.tecsvc.client.SystemQueryOptionITCase
Running org.apache.olingo.fit.tecsvc.http.BasicBatchITCase
Tests run: 5, Failures: 0, Errors: 0, Skipped: 0, Time elapsed: 0.016 sec - in org.apache.olingo.fit.tecsvc.http.BasicBatchITCase
Running org.apache.olingo.fit.tecsvc.http.BasicHttpITCase
Tests run: 5, Failures: 0, Errors: 0, Skipped: 0, Time elapsed: 0.017 sec - in org.apache.olingo.fit.tecsvc.http.BasicHttpITCase
Running org.apache.olingo.fit.tecsvc.http.EntityReferenceITCase
Tests run: 2, Failures: 0, Errors: 0, Skipped: 0, Time elapsed: 0.006 sec - in org.apache.olingo.fit.tecsvc.http.EntityReferenceITCase
Running org.apache.olingo.fit.tecsvc.http.PingITCase
Tests run: 2, Failures: 0, Errors: 0, Skipped: 0, Time elapsed: 0.008 sec - in org.apache.olingo.fit.tecsvc.http.PingITCase
Running org.apache.olingo.fit.v4.AsyncTestITCase
Tests run: 5, Failures: 0, Errors: 0, Skipped: 0, Time elapsed: 1.071 sec - in org.apache.olingo.fit.v4.AsyncTestITCase
Running org.apache.olingo.fit.v4.AuthBatchTestITCase
Tests run: 3, Failures: 0, Errors: 0, Skipped: 0, Time elapsed: 0.089 sec - in org.apache.olingo.fit.v4.AuthBatchTestITCase
Running org.apache.olingo.fit.v4.BatchTestITCase
Tests run: 9, Failures: 1, Errors: 0, Skipped: 0, Time elapsed: 1.564 sec <<< FAILURE! - in org.apache.olingo.fit.v4.BatchTestITCase
changesetWithReference(org.apache.olingo.fit.v4.BatchTestITCase) Time elapsed: 0.031 sec <<< FAILURE!
java.lang.AssertionError: expected:<201> but was:<400>
at org.junit.Assert.fail(Assert.java:88)
at org.junit.Assert.failNotEquals(Assert.java:743)
at org.junit.Assert.assertEquals(Assert.java:118)
at org.junit.Assert.assertEquals(Assert.java:555)
at org.junit.Assert.assertEquals(Assert.java:542)
at org.apache.olingo.fit.v4.BatchTestITCase.changesetWithReference(BatchTestITCase.java:295)
Running org.apache.olingo.fit.v4.BoundOperationInvokeTestITCase
Tests run: 6, Failures: 0, Errors: 0, Skipped: 0, Time elapsed: 0.346 sec - in org.apache.olingo.fit.v4.BoundOperationInvokeTestITCase
Running org.apache.olingo.fit.v4.ConformanceTestITCase
Tests run: 11, Failures: 0, Errors: 0, Skipped: 0, Time elapsed: 0.226 sec - in org.apache.olingo.fit.v4.ConformanceTestITCase
Running org.apache.olingo.fit.v4.DeltaTestITCase
Tests run: 2, Failures: 0, Errors: 0, Skipped: 0, Time elapsed: 0.105 sec - in org.apache.olingo.fit.v4.DeltaTestITCase
Running org.apache.olingo.fit.v4.DerivedTypeTestITCase
Tests run: 4, Failures: 0, Errors: 0, Skipped: 0, Time elapsed: 0.086 sec - in org.apache.olingo.fit.v4.DerivedTypeTestITCase
Running org.apache.olingo.fit.v4.EntityCreateTestITCase
Tests run: 6, Failures: 0, Errors: 0, Skipped: 0, Time elapsed: 0.211 sec - in org.apache.olingo.fit.v4.EntityCreateTestITCase
Running org.apache.olingo.fit.v4.EntityRetrieveTestITCase
Tests run: 21, Failures: 0, Errors: 0, Skipped: 0, Time elapsed: 0.206 sec - in org.apache.olingo.fit.v4.EntityRetrieveTestITCase
Running org.apache.olingo.fit.v4.EntitySetTestITCase
Tests run: 11, Failures: 0, Errors: 0, Skipped: 0, Time elapsed: 0.205 sec - in org.apache.olingo.fit.v4.EntitySetTestITCase
Running org.apache.olingo.fit.v4.EntityUpdateTestITCase
Tests run: 7, Failures: 0, Errors: 0, Skipped: 1, Time elapsed: 0.177 sec - in org.apache.olingo.fit.v4.EntityUpdateTestITCase
Running org.apache.olingo.fit.v4.ErrorResponseTestITCase
Tests run: 1, Failures: 0, Errors: 0, Skipped: 0, Time elapsed: 0.006 sec - in org.apache.olingo.fit.v4.ErrorResponseTestITCase
Running org.apache.olingo.fit.v4.FilterFactoryTestITCase
Tests run: 1, Failures: 0, Errors: 0, Skipped: 0, Time elapsed: 0.006 sec - in org.apache.olingo.fit.v4.FilterFactoryTestITCase
Running org.apache.olingo.fit.v4.JSONFormatConformanceTestITCase
Tests run: 6, Failures: 0, Errors: 0, Skipped: 0, Time elapsed: 0.043 sec - in org.apache.olingo.fit.v4.JSONFormatConformanceTestITCase
Running org.apache.olingo.fit.v4.KeyAsSegmentTestITCase
Tests run: 6, Failures: 0, Errors: 0, Skipped: 0, Time elapsed: 0.092 sec - in org.apache.olingo.fit.v4.KeyAsSegmentTestITCase
Running org.apache.olingo.fit.v4.MediaEntityTestITCase
Tests run: 7, Failures: 0, Errors: 0, Skipped: 0, Time elapsed: 0.167 sec - in org.apache.olingo.fit.v4.MediaEntityTestITCase
Running org.apache.olingo.fit.v4.MetadataTestITCase
Tests run: 3, Failures: 0, Errors: 0, Skipped: 0, Time elapsed: 0.079 sec - in org.apache.olingo.fit.v4.MetadataTestITCase
Running org.apache.olingo.fit.v4.OAuth2TestITCase
Tests run: 4, Failures: 0, Errors: 0, Skipped: 0, Time elapsed: 0.63 sec - in org.apache.olingo.fit.v4.OAuth2TestITCase
Running org.apache.olingo.fit.v4.OpenTypeTestITCase
Tests run: 5, Failures: 0, Errors: 0, Skipped: 0, Time elapsed: 0.097 sec - in org.apache.olingo.fit.v4.OpenTypeTestITCase
Running org.apache.olingo.fit.v4.OperationImportInvokeTestITCase
Tests run: 8, Failures: 0, Errors: 0, Skipped: 0, Time elapsed: 0.19 sec - in org.apache.olingo.fit.v4.OperationImportInvokeTestITCase
Running org.apache.olingo.fit.v4.PropertyTestITCase
Tests run: 11, Failures: 0, Errors: 0, Skipped: 0, Time elapsed: 0.103 sec - in org.apache.olingo.fit.v4.PropertyTestITCase
Running org.apache.olingo.fit.v4.PropertyValueTestITCase
Tests run: 10, Failures: 0, Errors: 0, Skipped: 0, Time elapsed: 0.06 sec - in org.apache.olingo.fit.v4.PropertyValueTestITCase
Running org.apache.olingo.fit.v4.QueryOptionsTestITCase
Tests run: 8, Failures: 0, Errors: 0, Skipped: 0, Time elapsed: 0.072 sec - in org.apache.olingo.fit.v4.QueryOptionsTestITCase
Running org.apache.olingo.fit.v4.ServiceDocumentTestITCase
Tests run: 2, Failures: 0, Errors: 0, Skipped: 0, Time elapsed: 0.011 sec - in org.apache.olingo.fit.v4.ServiceDocumentTestITCase
Running org.apache.olingo.fit.v4.SingletonTestITCase
Tests run: 8, Failures: 0, Errors: 0, Skipped: 0, Time elapsed: 0.081 sec - in org.apache.olingo.fit.v4.SingletonTestITCase
Results :
Failed tests:
BatchTestITCase.changesetWithReference:295 expected:<201> but was:<400>
Tests run: 555, Failures: 1, Errors: 0, Skipped: 3
[INFO] ------------------------------------------------------------------------
[INFO] Reactor Summary:
[INFO]
[INFO] Olingo-OData ...................................... SUCCESS [13.885s]
[INFO] odata-lib ......................................... SUCCESS [4.436s]
[INFO] odata-commons-api ................................. SUCCESS [21.240s]
[INFO] odata-commons-core ................................ SUCCESS [18.910s]
[INFO] odata-client-api .................................. SUCCESS [13.287s]
[INFO] odata-client-core ................................. SUCCESS [21.072s]
[INFO] odata-server-api .................................. SUCCESS [30.306s]
[INFO] odata-server-core ................................. SUCCESS [58.770s]
[INFO] odata-server-core-ext ............................. SUCCESS [17.788s]
[INFO] odata-server-tecsvc ............................... SUCCESS [7.087s]
[INFO] odata-server-test ................................. SUCCESS [8.082s]
[INFO] odata-ext ......................................... SUCCESS [1.023s]
[INFO] odata-client-proxy ................................ SUCCESS [6.287s]
[INFO] pojogen-maven-plugin .............................. SUCCESS [31.786s]
[INFO] odata-client-android .............................. SUCCESS [12.256s]
[INFO] odata-fit ......................................... FAILURE [44.967s]
[INFO] odata-dist ........................................ SKIPPED
[INFO] Olingo-OData-Client-for-Android ................... SKIPPED
[INFO] Olingo-OData-Client-for-Java ...................... SKIPPED
[INFO] Olingo-OData-Server-for-Java ...................... SKIPPED
[INFO] Olingo-OData-JavaDoc .............................. SKIPPED
[INFO] odata-samples ..................................... SKIPPED
[INFO] odata-server-sample ............................... SKIPPED
[INFO] ------------------------------------------------------------------------
[INFO] BUILD FAILURE
[INFO] ------------------------------------------------------------------------
[INFO] Total time: 5:13.633s
[INFO] Finished at: Wed Jun 03 11:14:04 UTC 2015
[INFO] Final Memory: 49M/926M
[INFO] ------------------------------------------------------------------------
[ERROR] Failed to execute goal org.apache.maven.plugins:maven-surefire-plugin:2.17:test (default-test) on project odata-fit: There are test failures.
[ERROR]
[ERROR] Please refer to <https://builds.apache.org/job/olingo-odata4/ws/fit/target/surefire-reports> for the individual test results.
[ERROR] -> [Help 1]
[ERROR]
[ERROR] To see the full stack trace of the errors, re-run Maven with the -e switch.
[ERROR] Re-run Maven using the -X switch to enable full debug logging.
[ERROR]
[ERROR] For more information about the errors and possible solutions, please read the following articles:
[ERROR] [Help 1] http://cwiki.apache.org/confluence/display/MAVEN/MojoFailureException
[ERROR]
[ERROR] After correcting the problems, you can resume the build with the command
[ERROR] mvn <goals> -rf :odata-fit
Build step 'Invoke top-level Maven targets' marked build as failure