You are viewing a plain text version of this content. The canonical link for it is here.
Posted to commits@beam.apache.org by Apache Jenkins Server <je...@builds.apache.org> on 2018/06/04 11:22:32 UTC

Build failed in Jenkins: beam_PerformanceTests_MongoDBIO_IT #259

See <https://builds.apache.org/job/beam_PerformanceTests_MongoDBIO_IT/259/display/redirect>

------------------------------------------
[...truncated 96.69 KB...]
:beam-runners-direct-java:shadowJar (Thread[Task worker for ':' Thread 13,5,main]) started.

> Task :beam-sdks-java-core:compileTestJava UP-TO-DATE
Build cache key for task ':beam-sdks-java-core:compileTestJava' is df359061e09f2f4c6c11577c8ad07b75
Skipping task ':beam-sdks-java-core:compileTestJava' as it is up-to-date.
:beam-sdks-java-core:compileTestJava (Thread[Task worker for ':' Thread 6,5,main]) completed. Took 0.342 secs.
:beam-sdks-java-core:processTestResources (Thread[Task worker for ':' Thread 6,5,main]) started.

> Task :beam-sdks-java-core:processTestResources NO-SOURCE
file or directory '<https://builds.apache.org/job/beam_PerformanceTests_MongoDBIO_IT/ws/src/sdks/java/core/src/test/resources',> not found
Skipping task ':beam-sdks-java-core:processTestResources' as it has no source files and no previous output files.
:beam-sdks-java-core:processTestResources (Thread[Task worker for ':' Thread 6,5,main]) completed. Took 0.001 secs.
:beam-sdks-java-core:testClasses (Thread[Task worker for ':' Thread 6,5,main]) started.

> Task :beam-sdks-java-core:testClasses UP-TO-DATE
Skipping task ':beam-sdks-java-core:testClasses' as it has no actions.
:beam-sdks-java-core:testClasses (Thread[Task worker for ':' Thread 6,5,main]) completed. Took 0.0 secs.
:beam-sdks-java-core:shadowTestJar (Thread[Task worker for ':' Thread 6,5,main]) started.

> Task :beam-runners-direct-java:shadowJar UP-TO-DATE
Build cache key for task ':beam-runners-direct-java:shadowJar' is 9097f6baab82b162ea2bf539874a2192
Caching disabled for task ':beam-runners-direct-java:shadowJar': Caching has not been enabled for the task
Skipping task ':beam-runners-direct-java:shadowJar' as it is up-to-date.
:beam-runners-direct-java:shadowJar (Thread[Task worker for ':' Thread 13,5,main]) completed. Took 0.017 secs.

> Task :beam-sdks-java-core:shadowTestJar UP-TO-DATE
Build cache key for task ':beam-sdks-java-core:shadowTestJar' is 1250a228dbe5059d25a4d042e3c675e5
Caching disabled for task ':beam-sdks-java-core:shadowTestJar': Caching has not been enabled for the task
Skipping task ':beam-sdks-java-core:shadowTestJar' as it is up-to-date.
:beam-sdks-java-core:shadowTestJar (Thread[Task worker for ':' Thread 6,5,main]) completed. Took 0.033 secs.
:beam-sdks-java-extensions-google-cloud-platform-core:compileTestJava (Thread[Task worker for ':' Thread 6,5,main]) started.

> Task :beam-sdks-java-extensions-google-cloud-platform-core:compileTestJava UP-TO-DATE
Build cache key for task ':beam-sdks-java-extensions-google-cloud-platform-core:compileTestJava' is 9252f2e64549da0dfce1c2331f6d620c
Skipping task ':beam-sdks-java-extensions-google-cloud-platform-core:compileTestJava' as it is up-to-date.
:beam-sdks-java-extensions-google-cloud-platform-core:compileTestJava (Thread[Task worker for ':' Thread 6,5,main]) completed. Took 0.043 secs.
:beam-sdks-java-extensions-google-cloud-platform-core:testClasses (Thread[Task worker for ':' Thread 6,5,main]) started.

> Task :beam-sdks-java-extensions-google-cloud-platform-core:testClasses UP-TO-DATE
Skipping task ':beam-sdks-java-extensions-google-cloud-platform-core:testClasses' as it has no actions.
:beam-sdks-java-extensions-google-cloud-platform-core:testClasses (Thread[Task worker for ':' Thread 6,5,main]) completed. Took 0.0 secs.
:beam-sdks-java-extensions-google-cloud-platform-core:shadowTestJar (Thread[Task worker for ':' Thread 6,5,main]) started.

> Task :beam-sdks-java-extensions-google-cloud-platform-core:shadowTestJar UP-TO-DATE
Build cache key for task ':beam-sdks-java-extensions-google-cloud-platform-core:shadowTestJar' is b5e738c8df5159e1020ceda606ace7dc
Caching disabled for task ':beam-sdks-java-extensions-google-cloud-platform-core:shadowTestJar': Caching has not been enabled for the task
Skipping task ':beam-sdks-java-extensions-google-cloud-platform-core:shadowTestJar' as it is up-to-date.
:beam-sdks-java-extensions-google-cloud-platform-core:shadowTestJar (Thread[Task worker for ':' Thread 6,5,main]) completed. Took 0.023 secs.
:beam-sdks-java-io-google-cloud-platform:compileTestJava (Thread[Task worker for ':' Thread 6,5,main]) started.

> Task :beam-sdks-java-io-google-cloud-platform:compileTestJava UP-TO-DATE
Build cache key for task ':beam-sdks-java-io-google-cloud-platform:compileTestJava' is 4e514787fbbf7dc49ce0542daddce520
Skipping task ':beam-sdks-java-io-google-cloud-platform:compileTestJava' as it is up-to-date.
:beam-sdks-java-io-google-cloud-platform:compileTestJava (Thread[Task worker for ':' Thread 6,5,main]) completed. Took 0.065 secs.
:beam-sdks-java-io-google-cloud-platform:testClasses (Thread[Task worker for ':' Thread 6,5,main]) started.

> Task :beam-sdks-java-io-google-cloud-platform:testClasses UP-TO-DATE
Skipping task ':beam-sdks-java-io-google-cloud-platform:testClasses' as it has no actions.
:beam-sdks-java-io-google-cloud-platform:testClasses (Thread[Task worker for ':' Thread 6,5,main]) completed. Took 0.0 secs.
:beam-sdks-java-io-google-cloud-platform:shadowTestJar (Thread[Task worker for ':' Thread 8,5,main]) started.

> Task :beam-sdks-java-io-google-cloud-platform:shadowTestJar UP-TO-DATE
Build cache key for task ':beam-sdks-java-io-google-cloud-platform:shadowTestJar' is fa2c482c7989eb3089cb0a20614f1f60
Caching disabled for task ':beam-sdks-java-io-google-cloud-platform:shadowTestJar': Caching has not been enabled for the task
Skipping task ':beam-sdks-java-io-google-cloud-platform:shadowTestJar' as it is up-to-date.
:beam-sdks-java-io-google-cloud-platform:shadowTestJar (Thread[Task worker for ':' Thread 8,5,main]) completed. Took 0.037 secs.
:beam-runners-google-cloud-dataflow-java:compileTestJava (Thread[Task worker for ':' Thread 8,5,main]) started.

> Task :beam-runners-google-cloud-dataflow-java:compileTestJava UP-TO-DATE
Build cache key for task ':beam-runners-google-cloud-dataflow-java:compileTestJava' is 0b57784fb594309176463ccdafa1a6a4
Skipping task ':beam-runners-google-cloud-dataflow-java:compileTestJava' as it is up-to-date.
:beam-runners-google-cloud-dataflow-java:compileTestJava (Thread[Task worker for ':' Thread 8,5,main]) completed. Took 0.049 secs.
:beam-runners-google-cloud-dataflow-java:testClasses (Thread[Task worker for ':' Thread 8,5,main]) started.

> Task :beam-runners-google-cloud-dataflow-java:testClasses UP-TO-DATE
Skipping task ':beam-runners-google-cloud-dataflow-java:testClasses' as it has no actions.
:beam-runners-google-cloud-dataflow-java:testClasses (Thread[Task worker for ':' Thread 8,5,main]) completed. Took 0.0 secs.
:beam-runners-google-cloud-dataflow-java:shadowTestJar (Thread[Task worker for ':' Thread 8,5,main]) started.

> Task :beam-runners-google-cloud-dataflow-java:shadowTestJar UP-TO-DATE
Build cache key for task ':beam-runners-google-cloud-dataflow-java:shadowTestJar' is 1d841a4c86440483f8e4406b1abfe913
Caching disabled for task ':beam-runners-google-cloud-dataflow-java:shadowTestJar': Caching has not been enabled for the task
Skipping task ':beam-runners-google-cloud-dataflow-java:shadowTestJar' as it is up-to-date.
:beam-runners-google-cloud-dataflow-java:shadowTestJar (Thread[Task worker for ':' Thread 8,5,main]) completed. Took 0.034 secs.
:beam-sdks-java-io-mongodb:compileTestJava (Thread[Task worker for ':' Thread 8,5,main]) started.

> Task :beam-sdks-java-io-mongodb:compileTestJava UP-TO-DATE
Build cache key for task ':beam-sdks-java-io-mongodb:compileTestJava' is 4149237b59481fb7f2978af412252ed3
Skipping task ':beam-sdks-java-io-mongodb:compileTestJava' as it is up-to-date.
:beam-sdks-java-io-mongodb:compileTestJava (Thread[Task worker for ':' Thread 8,5,main]) completed. Took 0.053 secs.
:beam-sdks-java-io-mongodb:testClasses (Thread[Task worker for ':' Thread 8,5,main]) started.

> Task :beam-sdks-java-io-mongodb:testClasses UP-TO-DATE
Skipping task ':beam-sdks-java-io-mongodb:testClasses' as it has no actions.
:beam-sdks-java-io-mongodb:testClasses (Thread[Task worker for ':' Thread 8,5,main]) completed. Took 0.0 secs.
:beam-sdks-java-io-mongodb:integrationTest (Thread[Task worker for ':' Thread 8,5,main]) started.
Gradle Test Executor 1 started executing tests.

> Task :beam-sdks-java-io-mongodb:integrationTest
Build cache key for task ':beam-sdks-java-io-mongodb:integrationTest' is 41c26aaea773215021530877d14c439e
Task ':beam-sdks-java-io-mongodb:integrationTest' is not up-to-date because:
  Task.upToDateWhen is false.
Not loading task ':beam-sdks-java-io-mongodb:integrationTest' from cache because pulling from cache is disabled for this task
Starting process 'Gradle Test Executor 1'. Working directory: <https://builds.apache.org/job/beam_PerformanceTests_MongoDBIO_IT/ws/src/sdks/java/io/mongodb> Command: /usr/local/asfpackages/java/jdk1.8.0_152/bin/java -DbeamTestPipelineOptions=["--tempRoot=gs://temp-storage-for-perf-tests","--project=apache-beam-testing","--numberOfRecords=10000000","--mongoDBHostName=35.202.20.216","--mongoDBDatabaseName=beam","--mongoDBPort=27017","--runner=TestDataflowRunner"] -Djava.security.manager=worker.org.gradle.process.internal.worker.child.BootstrapSecurityManager -Dorg.gradle.native=false -Dfile.encoding=UTF-8 -Duser.country=US -Duser.language=en -Duser.variant -ea -cp /home/jenkins/.gradle/caches/4.7/workerMain/gradle-worker.jar worker.org.gradle.process.internal.worker.GradleWorkerMain 'Gradle Test Executor 1'
Successfully started process 'Gradle Test Executor 1'

Gradle Test Executor 1 finished executing tests.

> Task :beam-sdks-java-io-mongodb:integrationTest FAILED

org.apache.beam.sdk.io.mongodb.MongoDBIOIT > classMethod FAILED
    java.lang.IllegalArgumentException: non-public interfaces from different packages
        at java.lang.reflect.Proxy$ProxyClassFactory.apply(Proxy.java:619)
        at java.lang.reflect.Proxy$ProxyClassFactory.apply(Proxy.java:557)
        at java.lang.reflect.WeakCache$Factory.get(WeakCache.java:230)
        at java.lang.reflect.WeakCache.get(WeakCache.java:127)
        at java.lang.reflect.Proxy.getProxyClass0(Proxy.java:419)
        at java.lang.reflect.Proxy.getProxyClass(Proxy.java:371)
        at org.apache.beam.sdk.options.PipelineOptionsFactory$Cache.validateWellFormed(PipelineOptionsFactory.java:1764)
        at org.apache.beam.sdk.options.PipelineOptionsFactory$Cache.validateWellFormed(PipelineOptionsFactory.java:1709)
        at org.apache.beam.sdk.options.PipelineOptionsFactory$Cache.register(PipelineOptionsFactory.java:1704)
        at org.apache.beam.sdk.options.PipelineOptionsFactory$Cache.access$500(PipelineOptionsFactory.java:1643)
        at org.apache.beam.sdk.options.PipelineOptionsFactory.register(PipelineOptionsFactory.java:523)
        at org.apache.beam.sdk.io.mongodb.MongoDBIOIT.setUp(MongoDBIOIT.java:103)

org.apache.beam.sdk.io.mongodb.MongoDBIOIT > classMethod FAILED
    java.lang.NullPointerException
        at org.apache.beam.sdk.io.mongodb.MongoDBIOIT.tearDown(MongoDBIOIT.java:110)

2 tests completed, 2 failed
Finished generating test XML results (0.014 secs) into: <https://builds.apache.org/job/beam_PerformanceTests_MongoDBIO_IT/ws/src/sdks/java/io/mongodb/build/test-results/integrationTest>
Generating HTML test report...
Finished generating test html results (0.023 secs) into: <https://builds.apache.org/job/beam_PerformanceTests_MongoDBIO_IT/ws/src/sdks/java/io/mongodb/build/reports/tests/integrationTest>
:beam-sdks-java-io-mongodb:integrationTest (Thread[Task worker for ':' Thread 8,5,main]) completed. Took 2.156 secs.

Deprecated Gradle features were used in this build, making it incompatible with Gradle 5.0.
See https://docs.gradle.org/4.7/userguide/command_line_interface.html#sec:command_line_warnings

BUILD FAILED in 12s
62 actionable tasks: 1 executed, 61 up-to-date

Publishing build scan...
https://gradle.com/s/4v44b5sutc44i


STDERR: 
FAILURE: Build failed with an exception.

* What went wrong:
Execution failed for task ':beam-sdks-java-io-mongodb:integrationTest'.
> There were failing tests. See the report at: file://<https://builds.apache.org/job/beam_PerformanceTests_MongoDBIO_IT/ws/src/sdks/java/io/mongodb/build/reports/tests/integrationTest/index.html>

* Try:
Run with --debug option to get more log output. Run with --scan to get full insights.

* Exception is:
org.gradle.api.tasks.TaskExecutionException: Execution failed for task ':beam-sdks-java-io-mongodb:integrationTest'.
	at org.gradle.api.internal.tasks.execution.ExecuteActionsTaskExecuter.executeActions(ExecuteActionsTaskExecuter.java:103)
	at org.gradle.api.internal.tasks.execution.ExecuteActionsTaskExecuter.execute(ExecuteActionsTaskExecuter.java:73)
	at org.gradle.api.internal.tasks.execution.OutputDirectoryCreatingTaskExecuter.execute(OutputDirectoryCreatingTaskExecuter.java:51)
	at org.gradle.api.internal.tasks.execution.SkipCachedTaskExecuter.execute(SkipCachedTaskExecuter.java:105)
	at org.gradle.api.internal.tasks.execution.SkipUpToDateTaskExecuter.execute(SkipUpToDateTaskExecuter.java:59)
	at org.gradle.api.internal.tasks.execution.ResolveTaskOutputCachingStateExecuter.execute(ResolveTaskOutputCachingStateExecuter.java:54)
	at org.gradle.api.internal.tasks.execution.ResolveBuildCacheKeyExecuter.execute(ResolveBuildCacheKeyExecuter.java:66)
	at org.gradle.api.internal.tasks.execution.ValidatingTaskExecuter.execute(ValidatingTaskExecuter.java:59)
	at org.gradle.api.internal.tasks.execution.SkipEmptySourceFilesTaskExecuter.execute(SkipEmptySourceFilesTaskExecuter.java:101)
	at org.gradle.api.internal.tasks.execution.FinalizeInputFilePropertiesTaskExecuter.execute(FinalizeInputFilePropertiesTaskExecuter.java:44)
	at org.gradle.api.internal.tasks.execution.CleanupStaleOutputsExecuter.execute(CleanupStaleOutputsExecuter.java:91)
	at org.gradle.api.internal.tasks.execution.ResolveTaskArtifactStateTaskExecuter.execute(ResolveTaskArtifactStateTaskExecuter.java:62)
	at org.gradle.api.internal.tasks.execution.SkipTaskWithNoActionsExecuter.execute(SkipTaskWithNoActionsExecuter.java:59)
	at org.gradle.api.internal.tasks.execution.SkipOnlyIfTaskExecuter.execute(SkipOnlyIfTaskExecuter.java:54)
	at org.gradle.api.internal.tasks.execution.ExecuteAtMostOnceTaskExecuter.execute(ExecuteAtMostOnceTaskExecuter.java:43)
	at org.gradle.api.internal.tasks.execution.CatchExceptionTaskExecuter.execute(CatchExceptionTaskExecuter.java:34)
	at org.gradle.execution.taskgraph.DefaultTaskGraphExecuter$EventFiringTaskWorker$1.run(DefaultTaskGraphExecuter.java:256)
	at org.gradle.internal.operations.DefaultBuildOperationExecutor$RunnableBuildOperationWorker.execute(DefaultBuildOperationExecutor.java:317)
	at org.gradle.internal.operations.DefaultBuildOperationExecutor$RunnableBuildOperationWorker.execute(DefaultBuildOperationExecutor.java:309)
	at org.gradle.internal.operations.DefaultBuildOperationExecutor.execute(DefaultBuildOperationExecutor.java:185)
	at org.gradle.internal.operations.DefaultBuildOperationExecutor.run(DefaultBuildOperationExecutor.java:97)
	at org.gradle.internal.operations.DelegatingBuildOperationExecutor.run(DelegatingBuildOperationExecutor.java:31)
	at org.gradle.execution.taskgraph.DefaultTaskGraphExecuter$EventFiringTaskWorker.execute(DefaultTaskGraphExecuter.java:249)
	at org.gradle.execution.taskgraph.DefaultTaskGraphExecuter$EventFiringTaskWorker.execute(DefaultTaskGraphExecuter.java:238)
	at org.gradle.execution.taskgraph.DefaultTaskPlanExecutor$TaskExecutorWorker$1.execute(DefaultTaskPlanExecutor.java:104)
	at org.gradle.execution.taskgraph.DefaultTaskPlanExecutor$TaskExecutorWorker$1.execute(DefaultTaskPlanExecutor.java:98)
	at org.gradle.execution.taskgraph.DefaultTaskExecutionPlan.execute(DefaultTaskExecutionPlan.java:663)
	at org.gradle.execution.taskgraph.DefaultTaskExecutionPlan.executeWithTask(DefaultTaskExecutionPlan.java:596)
	at org.gradle.execution.taskgraph.DefaultTaskPlanExecutor$TaskExecutorWorker.run(DefaultTaskPlanExecutor.java:98)
	at org.gradle.internal.concurrent.ExecutorPolicy$CatchAndRecordFailures.onExecute(ExecutorPolicy.java:63)
	at org.gradle.internal.concurrent.ManagedExecutorImpl$1.run(ManagedExecutorImpl.java:46)
	at org.gradle.internal.concurrent.ThreadFactoryImpl$ManagedThreadRunnable.run(ThreadFactoryImpl.java:55)
Caused by: org.gradle.api.GradleException: There were failing tests. See the report at: file://<https://builds.apache.org/job/beam_PerformanceTests_MongoDBIO_IT/ws/src/sdks/java/io/mongodb/build/reports/tests/integrationTest/index.html>
	at org.gradle.api.tasks.testing.AbstractTestTask.handleTestFailures(AbstractTestTask.java:612)
	at org.gradle.api.tasks.testing.AbstractTestTask.executeTests(AbstractTestTask.java:484)
	at org.gradle.api.tasks.testing.Test.executeTests(Test.java:583)
	at org.gradle.internal.reflect.JavaMethod.invoke(JavaMethod.java:73)
	at org.gradle.api.internal.project.taskfactory.StandardTaskAction.doExecute(StandardTaskAction.java:46)
	at org.gradle.api.internal.project.taskfactory.StandardTaskAction.execute(StandardTaskAction.java:39)
	at org.gradle.api.internal.project.taskfactory.StandardTaskAction.execute(StandardTaskAction.java:26)
	at org.gradle.api.internal.AbstractTask$TaskActionWrapper.execute(AbstractTask.java:794)
	at org.gradle.api.internal.AbstractTask$TaskActionWrapper.execute(AbstractTask.java:761)
	at org.gradle.api.internal.tasks.execution.ExecuteActionsTaskExecuter$1.run(ExecuteActionsTaskExecuter.java:124)
	at org.gradle.internal.operations.DefaultBuildOperationExecutor$RunnableBuildOperationWorker.execute(DefaultBuildOperationExecutor.java:317)
	at org.gradle.internal.operations.DefaultBuildOperationExecutor$RunnableBuildOperationWorker.execute(DefaultBuildOperationExecutor.java:309)
	at org.gradle.internal.operations.DefaultBuildOperationExecutor.execute(DefaultBuildOperationExecutor.java:185)
	at org.gradle.internal.operations.DefaultBuildOperationExecutor.run(DefaultBuildOperationExecutor.java:97)
	at org.gradle.internal.operations.DelegatingBuildOperationExecutor.run(DelegatingBuildOperationExecutor.java:31)
	at org.gradle.api.internal.tasks.execution.ExecuteActionsTaskExecuter.executeAction(ExecuteActionsTaskExecuter.java:113)
	at org.gradle.api.internal.tasks.execution.ExecuteActionsTaskExecuter.executeActions(ExecuteActionsTaskExecuter.java:95)
	... 31 more


* Get more help at https://help.gradle.org

2018-06-04 11:22:31,288 572757ca MainThread beam_integration_benchmark(1/1) ERROR    Error during benchmark beam_integration_benchmark
Traceback (most recent call last):
  File "<https://builds.apache.org/job/beam_PerformanceTests_MongoDBIO_IT/ws/PerfKitBenchmarker/perfkitbenchmarker/pkb.py",> line 667, in RunBenchmark
    DoRunPhase(spec, collector, detailed_timer)
  File "<https://builds.apache.org/job/beam_PerformanceTests_MongoDBIO_IT/ws/PerfKitBenchmarker/perfkitbenchmarker/pkb.py",> line 547, in DoRunPhase
    samples = spec.BenchmarkRun(spec)
  File "<https://builds.apache.org/job/beam_PerformanceTests_MongoDBIO_IT/ws/PerfKitBenchmarker/perfkitbenchmarker/linux_benchmarks/beam_integration_benchmark.py",> line 159, in Run
    job_type=job_type)
  File "<https://builds.apache.org/job/beam_PerformanceTests_MongoDBIO_IT/ws/PerfKitBenchmarker/perfkitbenchmarker/providers/gcp/gcp_dpb_dataflow.py",> line 90, in SubmitJob
    assert retcode == 0, "Integration Test Failed."
AssertionError: Integration Test Failed.
2018-06-04 11:22:31,289 572757ca MainThread beam_integration_benchmark(1/1) INFO     Cleaning up benchmark beam_integration_benchmark
2018-06-04 11:22:31,289 572757ca MainThread beam_integration_benchmark(1/1) INFO     Running: kubectl --kubeconfig=<https://builds.apache.org/job/beam_PerformanceTests_MongoDBIO_IT/ws/config-mongodbioit-259> delete -f <https://builds.apache.org/job/beam_PerformanceTests_MongoDBIO_IT/ws/src/.test-infra/kubernetes/mongodb/load-balancer/mongo.yml> --ignore-not-found
2018-06-04 11:22:31,684 572757ca MainThread beam_integration_benchmark(1/1) ERROR    Exception running benchmark
Traceback (most recent call last):
  File "<https://builds.apache.org/job/beam_PerformanceTests_MongoDBIO_IT/ws/PerfKitBenchmarker/perfkitbenchmarker/pkb.py",> line 801, in RunBenchmarkTask
    RunBenchmark(spec, collector)
  File "<https://builds.apache.org/job/beam_PerformanceTests_MongoDBIO_IT/ws/PerfKitBenchmarker/perfkitbenchmarker/pkb.py",> line 667, in RunBenchmark
    DoRunPhase(spec, collector, detailed_timer)
  File "<https://builds.apache.org/job/beam_PerformanceTests_MongoDBIO_IT/ws/PerfKitBenchmarker/perfkitbenchmarker/pkb.py",> line 547, in DoRunPhase
    samples = spec.BenchmarkRun(spec)
  File "<https://builds.apache.org/job/beam_PerformanceTests_MongoDBIO_IT/ws/PerfKitBenchmarker/perfkitbenchmarker/linux_benchmarks/beam_integration_benchmark.py",> line 159, in Run
    job_type=job_type)
  File "<https://builds.apache.org/job/beam_PerformanceTests_MongoDBIO_IT/ws/PerfKitBenchmarker/perfkitbenchmarker/providers/gcp/gcp_dpb_dataflow.py",> line 90, in SubmitJob
    assert retcode == 0, "Integration Test Failed."
AssertionError: Integration Test Failed.
2018-06-04 11:22:31,685 572757ca MainThread beam_integration_benchmark(1/1) ERROR    Benchmark 1/1 beam_integration_benchmark (UID: beam_integration_benchmark0) failed. Execution will continue.
2018-06-04 11:22:31,717 572757ca MainThread INFO     Benchmark run statuses:
---------------------------------------------------------------------------------
Name                        UID                          Status  Failed Substatus
---------------------------------------------------------------------------------
beam_integration_benchmark  beam_integration_benchmark0  FAILED                  
---------------------------------------------------------------------------------
Success rate: 0.00% (0/1)
2018-06-04 11:22:31,718 572757ca MainThread INFO     Complete logs can be found at: <https://builds.apache.org/job/beam_PerformanceTests_MongoDBIO_IT/ws/runs/572757ca/pkb.log>
2018-06-04 11:22:31,718 572757ca MainThread INFO     Completion statuses can be found at: <https://builds.apache.org/job/beam_PerformanceTests_MongoDBIO_IT/ws/runs/572757ca/completion_statuses.json>
Build step 'Execute shell' marked build as failure

Jenkins build is back to normal : beam_PerformanceTests_MongoDBIO_IT #261

Posted by Apache Jenkins Server <je...@builds.apache.org>.
See <https://builds.apache.org/job/beam_PerformanceTests_MongoDBIO_IT/261/display/redirect>


Build failed in Jenkins: beam_PerformanceTests_MongoDBIO_IT #260

Posted by Apache Jenkins Server <je...@builds.apache.org>.
See <https://builds.apache.org/job/beam_PerformanceTests_MongoDBIO_IT/260/display/redirect?page=changes>

Changes:

[jhsueh] [BEAM-4320] Enforce ErrorProne analysis in jackson extensions project

------------------------------------------
[...truncated 195.12 KB...]
    	at com.mongodb.connection.DefaultConnectionPool$PooledConnection.receiveMessage(DefaultConnectionPool.java:435)
    	at com.mongodb.connection.WriteCommandProtocol.receiveMessage(WriteCommandProtocol.java:234)
    	at com.mongodb.connection.WriteCommandProtocol.execute(WriteCommandProtocol.java:104)
    	at com.mongodb.connection.InsertCommandProtocol.execute(InsertCommandProtocol.java:67)
    	at com.mongodb.connection.InsertCommandProtocol.execute(InsertCommandProtocol.java:37)
    	at com.mongodb.connection.DefaultServer$DefaultServerProtocolExecutor.execute(DefaultServer.java:159)
    	at com.mongodb.connection.DefaultServerConnection.executeProtocol(DefaultServerConnection.java:286)
    	at com.mongodb.connection.DefaultServerConnection.insertCommand(DefaultServerConnection.java:115)
    	at com.mongodb.operation.MixedBulkWriteOperation$Run$2.executeWriteCommandProtocol(MixedBulkWriteOperation.java:455)
    	at com.mongodb.operation.MixedBulkWriteOperation$Run$RunExecutor.execute(MixedBulkWriteOperation.java:646)
    	at com.mongodb.operation.MixedBulkWriteOperation$Run.execute(MixedBulkWriteOperation.java:401)
    	at com.mongodb.operation.MixedBulkWriteOperation$1.call(MixedBulkWriteOperation.java:179)
    	at com.mongodb.operation.MixedBulkWriteOperation$1.call(MixedBulkWriteOperation.java:168)
    	at com.mongodb.operation.OperationHelper.withConnectionSource(OperationHelper.java:230)
    	at com.mongodb.operation.OperationHelper.withConnection(OperationHelper.java:221)
    	at com.mongodb.operation.MixedBulkWriteOperation.execute(MixedBulkWriteOperation.java:168)
    	at com.mongodb.operation.MixedBulkWriteOperation.execute(MixedBulkWriteOperation.java:74)
    	at com.mongodb.Mongo.execute(Mongo.java:781)
    	at com.mongodb.Mongo$2.execute(Mongo.java:764)
    	at com.mongodb.MongoCollectionImpl.insertMany(MongoCollectionImpl.java:323)
    	at com.mongodb.MongoCollectionImpl.insertMany(MongoCollectionImpl.java:311)
    	at org.apache.beam.sdk.io.mongodb.MongoDbIO$Write$WriteFn.flush(MongoDbIO.java:667)
    	at org.apache.beam.sdk.io.mongodb.MongoDbIO$Write$WriteFn.processElement(MongoDbIO.java:652)
    com.mongodb.MongoTimeoutException: Timed out after 30000 ms while waiting for a server that matches WritableServerSelector. Client view of cluster state is {type=UNKNOWN, servers=[{address=35.232.0.200:27017, type=UNKNOWN, state=CONNECTING, exception={com.mongodb.MongoSocketOpenException: Exception opening socket}, caused by {java.net.SocketTimeoutException: connect timed out}}]
    	at com.mongodb.connection.BaseCluster.createTimeoutException(BaseCluster.java:369)
    	at com.mongodb.connection.BaseCluster.selectServer(BaseCluster.java:101)
    	at com.mongodb.binding.ClusterBinding$ClusterBindingConnectionSource.<init>(ClusterBinding.java:75)
    	at com.mongodb.binding.ClusterBinding$ClusterBindingConnectionSource.<init>(ClusterBinding.java:71)
    	at com.mongodb.binding.ClusterBinding.getWriteConnectionSource(ClusterBinding.java:68)
    	at com.mongodb.operation.OperationHelper.withConnection(OperationHelper.java:219)
    	at com.mongodb.operation.MixedBulkWriteOperation.execute(MixedBulkWriteOperation.java:168)
    	at com.mongodb.operation.MixedBulkWriteOperation.execute(MixedBulkWriteOperation.java:74)
    	at com.mongodb.Mongo.execute(Mongo.java:781)
    	at com.mongodb.Mongo$2.execute(Mongo.java:764)
    	at com.mongodb.MongoCollectionImpl.insertMany(MongoCollectionImpl.java:323)
    	at com.mongodb.MongoCollectionImpl.insertMany(MongoCollectionImpl.java:311)
    	at org.apache.beam.sdk.io.mongodb.MongoDbIO$Write$WriteFn.flush(MongoDbIO.java:667)
    	at org.apache.beam.sdk.io.mongodb.MongoDbIO$Write$WriteFn.processElement(MongoDbIO.java:652)
    com.mongodb.MongoTimeoutException: Timed out after 30000 ms while waiting for a server that matches WritableServerSelector. Client view of cluster state is {type=UNKNOWN, servers=[{address=35.232.0.200:27017, type=UNKNOWN, state=CONNECTING, exception={com.mongodb.MongoSocketOpenException: Exception opening socket}, caused by {java.net.SocketTimeoutException: connect timed out}}]
    	at com.mongodb.connection.BaseCluster.createTimeoutException(BaseCluster.java:369)
    	at com.mongodb.connection.BaseCluster.selectServer(BaseCluster.java:101)
    	at com.mongodb.binding.ClusterBinding$ClusterBindingConnectionSource.<init>(ClusterBinding.java:75)
    	at com.mongodb.binding.ClusterBinding$ClusterBindingConnectionSource.<init>(ClusterBinding.java:71)
    	at com.mongodb.binding.ClusterBinding.getWriteConnectionSource(ClusterBinding.java:68)
    	at com.mongodb.operation.OperationHelper.withConnection(OperationHelper.java:219)
    	at com.mongodb.operation.MixedBulkWriteOperation.execute(MixedBulkWriteOperation.java:168)
    	at com.mongodb.operation.MixedBulkWriteOperation.execute(MixedBulkWriteOperation.java:74)
    	at com.mongodb.Mongo.execute(Mongo.java:781)
    	at com.mongodb.Mongo$2.execute(Mongo.java:764)
    	at com.mongodb.MongoCollectionImpl.insertMany(MongoCollectionImpl.java:323)
    	at com.mongodb.MongoCollectionImpl.insertMany(MongoCollectionImpl.java:311)
    	at org.apache.beam.sdk.io.mongodb.MongoDbIO$Write$WriteFn.flush(MongoDbIO.java:667)
    	at org.apache.beam.sdk.io.mongodb.MongoDbIO$Write$WriteFn.processElement(MongoDbIO.java:652)
    com.mongodb.MongoTimeoutException: Timed out after 30000 ms while waiting for a server that matches WritableServerSelector. Client view of cluster state is {type=UNKNOWN, servers=[{address=35.232.0.200:27017, type=UNKNOWN, state=CONNECTING, exception={com.mongodb.MongoSocketOpenException: Exception opening socket}, caused by {java.net.SocketTimeoutException: connect timed out}}]
    	at com.mongodb.connection.BaseCluster.createTimeoutException(BaseCluster.java:369)
    	at com.mongodb.connection.BaseCluster.selectServer(BaseCluster.java:101)
    	at com.mongodb.binding.ClusterBinding$ClusterBindingConnectionSource.<init>(ClusterBinding.java:75)
    	at com.mongodb.binding.ClusterBinding$ClusterBindingConnectionSource.<init>(ClusterBinding.java:71)
    	at com.mongodb.binding.ClusterBinding.getWriteConnectionSource(ClusterBinding.java:68)
    	at com.mongodb.operation.OperationHelper.withConnection(OperationHelper.java:219)
    	at com.mongodb.operation.MixedBulkWriteOperation.execute(MixedBulkWriteOperation.java:168)
    	at com.mongodb.operation.MixedBulkWriteOperation.execute(MixedBulkWriteOperation.java:74)
    	at com.mongodb.Mongo.execute(Mongo.java:781)
    	at com.mongodb.Mongo$2.execute(Mongo.java:764)
    	at com.mongodb.MongoCollectionImpl.insertMany(MongoCollectionImpl.java:323)
    	at com.mongodb.MongoCollectionImpl.insertMany(MongoCollectionImpl.java:311)
    	at org.apache.beam.sdk.io.mongodb.MongoDbIO$Write$WriteFn.flush(MongoDbIO.java:667)
    	at org.apache.beam.sdk.io.mongodb.MongoDbIO$Write$WriteFn.processElement(MongoDbIO.java:652)
    com.mongodb.MongoTimeoutException: Timed out after 30000 ms while waiting for a server that matches WritableServerSelector. Client view of cluster state is {type=UNKNOWN, servers=[{address=35.232.0.200:27017, type=UNKNOWN, state=CONNECTING, exception={com.mongodb.MongoSocketOpenException: Exception opening socket}, caused by {java.net.SocketTimeoutException: connect timed out}}]
    	at com.mongodb.connection.BaseCluster.createTimeoutException(BaseCluster.java:369)
    	at com.mongodb.connection.BaseCluster.selectServer(BaseCluster.java:101)
    	at com.mongodb.binding.ClusterBinding$ClusterBindingConnectionSource.<init>(ClusterBinding.java:75)
    	at com.mongodb.binding.ClusterBinding$ClusterBindingConnectionSource.<init>(ClusterBinding.java:71)
    	at com.mongodb.binding.ClusterBinding.getWriteConnectionSource(ClusterBinding.java:68)
    	at com.mongodb.operation.OperationHelper.withConnection(OperationHelper.java:219)
    	at com.mongodb.operation.MixedBulkWriteOperation.execute(MixedBulkWriteOperation.java:168)
    	at com.mongodb.operation.MixedBulkWriteOperation.execute(MixedBulkWriteOperation.java:74)
    	at com.mongodb.Mongo.execute(Mongo.java:781)
    	at com.mongodb.Mongo$2.execute(Mongo.java:764)
    	at com.mongodb.MongoCollectionImpl.insertMany(MongoCollectionImpl.java:323)
    	at com.mongodb.MongoCollectionImpl.insertMany(MongoCollectionImpl.java:311)
    	at org.apache.beam.sdk.io.mongodb.MongoDbIO$Write$WriteFn.flush(MongoDbIO.java:667)
    	at org.apache.beam.sdk.io.mongodb.MongoDbIO$Write$WriteFn.processElement(MongoDbIO.java:652)
    com.mongodb.MongoTimeoutException: Timed out after 30000 ms while waiting for a server that matches WritableServerSelector. Client view of cluster state is {type=UNKNOWN, servers=[{address=35.232.0.200:27017, type=UNKNOWN, state=CONNECTING, exception={com.mongodb.MongoSocketOpenException: Exception opening socket}, caused by {java.net.SocketTimeoutException: connect timed out}}]
    	at com.mongodb.connection.BaseCluster.createTimeoutException(BaseCluster.java:369)
    	at com.mongodb.connection.BaseCluster.selectServer(BaseCluster.java:101)
    	at com.mongodb.binding.ClusterBinding$ClusterBindingConnectionSource.<init>(ClusterBinding.java:75)
    	at com.mongodb.binding.ClusterBinding$ClusterBindingConnectionSource.<init>(ClusterBinding.java:71)
    	at com.mongodb.binding.ClusterBinding.getWriteConnectionSource(ClusterBinding.java:68)
    	at com.mongodb.operation.OperationHelper.withConnection(OperationHelper.java:219)
    	at com.mongodb.operation.MixedBulkWriteOperation.execute(MixedBulkWriteOperation.java:168)
    	at com.mongodb.operation.MixedBulkWriteOperation.execute(MixedBulkWriteOperation.java:74)
    	at com.mongodb.Mongo.execute(Mongo.java:781)
    	at com.mongodb.Mongo$2.execute(Mongo.java:764)
    	at com.mongodb.MongoCollectionImpl.insertMany(MongoCollectionImpl.java:323)
    	at com.mongodb.MongoCollectionImpl.insertMany(MongoCollectionImpl.java:311)
    	at org.apache.beam.sdk.io.mongodb.MongoDbIO$Write$WriteFn.flush(MongoDbIO.java:667)
    	at org.apache.beam.sdk.io.mongodb.MongoDbIO$Write$WriteFn.processElement(MongoDbIO.java:652)
    Workflow failed. Causes: S01:Generate sequence/Read(BoundedCountingSource)+Produce documents/Map+Write documents to MongoDB/ParDo(Write) failed., A work item was attempted 4 times without success. Each time the worker eventually lost contact with the service. The work item was attempted on: 
      mongodbioit0testwriteandr-06040504-ejyg-harness-1ttk,
      mongodbioit0testwriteandr-06040504-ejyg-harness-1ttk,
      mongodbioit0testwriteandr-06040504-ejyg-harness-1ttk,
      mongodbioit0testwriteandr-06040504-ejyg-harness-1ttk
        at org.apache.beam.runners.dataflow.TestDataflowRunner.run(TestDataflowRunner.java:134)
        at org.apache.beam.runners.dataflow.TestDataflowRunner.run(TestDataflowRunner.java:90)
        at org.apache.beam.runners.dataflow.TestDataflowRunner.run(TestDataflowRunner.java:55)
        at org.apache.beam.sdk.Pipeline.run(Pipeline.java:311)
        at org.apache.beam.sdk.testing.TestPipeline.run(TestPipeline.java:348)
        at org.apache.beam.sdk.testing.TestPipeline.run(TestPipeline.java:329)
        at org.apache.beam.sdk.io.mongodb.MongoDBIOIT.testWriteAndRead(MongoDBIOIT.java:118)

    com.mongodb.MongoTimeoutException: Timed out after 30000 ms while waiting for a server that matches WritableServerSelector. Client view of cluster state is {type=UNKNOWN, servers=[{address=35.232.0.200:27017, type=UNKNOWN, state=CONNECTING, exception={com.mongodb.MongoSocketOpenException: Exception opening socket}, caused by {java.net.SocketTimeoutException: connect timed out}}]
        at com.mongodb.connection.BaseCluster.createTimeoutException(BaseCluster.java:369)
        at com.mongodb.connection.BaseCluster.selectServer(BaseCluster.java:101)
        at com.mongodb.binding.ClusterBinding$ClusterBindingConnectionSource.<init>(ClusterBinding.java:75)
        at com.mongodb.binding.ClusterBinding$ClusterBindingConnectionSource.<init>(ClusterBinding.java:71)
        at com.mongodb.binding.ClusterBinding.getWriteConnectionSource(ClusterBinding.java:68)
        at com.mongodb.operation.CommandOperationHelper.executeWrappedCommandProtocol(CommandOperationHelper.java:158)
        at com.mongodb.operation.CommandOperationHelper.executeWrappedCommandProtocol(CommandOperationHelper.java:133)
        at com.mongodb.operation.CommandOperationHelper.executeWrappedCommandProtocol(CommandOperationHelper.java:128)
        at com.mongodb.operation.DropDatabaseOperation.execute(DropDatabaseOperation.java:51)
        at com.mongodb.operation.DropDatabaseOperation.execute(DropDatabaseOperation.java:36)
        at com.mongodb.Mongo.execute(Mongo.java:781)
        at com.mongodb.Mongo$2.execute(Mongo.java:764)
        at com.mongodb.MongoDatabaseImpl.drop(MongoDatabaseImpl.java:136)
        at org.apache.beam.sdk.io.mongodb.MongoDBIOIT.tearDown(MongoDBIOIT.java:103)

1 test completed, 1 failed
Finished generating test XML results (0.024 secs) into: <https://builds.apache.org/job/beam_PerformanceTests_MongoDBIO_IT/ws/src/sdks/java/io/mongodb/build/test-results/integrationTest>
Generating HTML test report...
Finished generating test html results (0.033 secs) into: <https://builds.apache.org/job/beam_PerformanceTests_MongoDBIO_IT/ws/src/sdks/java/io/mongodb/build/reports/tests/integrationTest>

> Task :beam-sdks-java-io-mongodb:integrationTest FAILED
:beam-sdks-java-io-mongodb:integrationTest (Thread[Task worker for ':' Thread 10,5,main]) completed. Took 10 mins 4.408 secs.

Deprecated Gradle features were used in this build, making it incompatible with Gradle 5.0.
See https://docs.gradle.org/4.7/userguide/command_line_interface.html#sec:command_line_warnings

BUILD FAILED in 10m 15s
62 actionable tasks: 1 executed, 61 up-to-date

Publishing build scan...
https://gradle.com/s/kf636v6cbiwk6


STDERR: 
FAILURE: Build failed with an exception.

* What went wrong:
Execution failed for task ':beam-sdks-java-io-mongodb:integrationTest'.
> There were failing tests. See the report at: file://<https://builds.apache.org/job/beam_PerformanceTests_MongoDBIO_IT/ws/src/sdks/java/io/mongodb/build/reports/tests/integrationTest/index.html>

* Try:
Run with --debug option to get more log output. Run with --scan to get full insights.

* Exception is:
org.gradle.api.tasks.TaskExecutionException: Execution failed for task ':beam-sdks-java-io-mongodb:integrationTest'.
	at org.gradle.api.internal.tasks.execution.ExecuteActionsTaskExecuter.executeActions(ExecuteActionsTaskExecuter.java:103)
	at org.gradle.api.internal.tasks.execution.ExecuteActionsTaskExecuter.execute(ExecuteActionsTaskExecuter.java:73)
	at org.gradle.api.internal.tasks.execution.OutputDirectoryCreatingTaskExecuter.execute(OutputDirectoryCreatingTaskExecuter.java:51)
	at org.gradle.api.internal.tasks.execution.SkipCachedTaskExecuter.execute(SkipCachedTaskExecuter.java:105)
	at org.gradle.api.internal.tasks.execution.SkipUpToDateTaskExecuter.execute(SkipUpToDateTaskExecuter.java:59)
	at org.gradle.api.internal.tasks.execution.ResolveTaskOutputCachingStateExecuter.execute(ResolveTaskOutputCachingStateExecuter.java:54)
	at org.gradle.api.internal.tasks.execution.ResolveBuildCacheKeyExecuter.execute(ResolveBuildCacheKeyExecuter.java:66)
	at org.gradle.api.internal.tasks.execution.ValidatingTaskExecuter.execute(ValidatingTaskExecuter.java:59)
	at org.gradle.api.internal.tasks.execution.SkipEmptySourceFilesTaskExecuter.execute(SkipEmptySourceFilesTaskExecuter.java:101)
	at org.gradle.api.internal.tasks.execution.FinalizeInputFilePropertiesTaskExecuter.execute(FinalizeInputFilePropertiesTaskExecuter.java:44)
	at org.gradle.api.internal.tasks.execution.CleanupStaleOutputsExecuter.execute(CleanupStaleOutputsExecuter.java:91)
	at org.gradle.api.internal.tasks.execution.ResolveTaskArtifactStateTaskExecuter.execute(ResolveTaskArtifactStateTaskExecuter.java:62)
	at org.gradle.api.internal.tasks.execution.SkipTaskWithNoActionsExecuter.execute(SkipTaskWithNoActionsExecuter.java:59)
	at org.gradle.api.internal.tasks.execution.SkipOnlyIfTaskExecuter.execute(SkipOnlyIfTaskExecuter.java:54)
	at org.gradle.api.internal.tasks.execution.ExecuteAtMostOnceTaskExecuter.execute(ExecuteAtMostOnceTaskExecuter.java:43)
	at org.gradle.api.internal.tasks.execution.CatchExceptionTaskExecuter.execute(CatchExceptionTaskExecuter.java:34)
	at org.gradle.execution.taskgraph.DefaultTaskGraphExecuter$EventFiringTaskWorker$1.run(DefaultTaskGraphExecuter.java:256)
	at org.gradle.internal.operations.DefaultBuildOperationExecutor$RunnableBuildOperationWorker.execute(DefaultBuildOperationExecutor.java:317)
	at org.gradle.internal.operations.DefaultBuildOperationExecutor$RunnableBuildOperationWorker.execute(DefaultBuildOperationExecutor.java:309)
	at org.gradle.internal.operations.DefaultBuildOperationExecutor.execute(DefaultBuildOperationExecutor.java:185)
	at org.gradle.internal.operations.DefaultBuildOperationExecutor.run(DefaultBuildOperationExecutor.java:97)
	at org.gradle.internal.operations.DelegatingBuildOperationExecutor.run(DelegatingBuildOperationExecutor.java:31)
	at org.gradle.execution.taskgraph.DefaultTaskGraphExecuter$EventFiringTaskWorker.execute(DefaultTaskGraphExecuter.java:249)
	at org.gradle.execution.taskgraph.DefaultTaskGraphExecuter$EventFiringTaskWorker.execute(DefaultTaskGraphExecuter.java:238)
	at org.gradle.execution.taskgraph.DefaultTaskPlanExecutor$TaskExecutorWorker$1.execute(DefaultTaskPlanExecutor.java:104)
	at org.gradle.execution.taskgraph.DefaultTaskPlanExecutor$TaskExecutorWorker$1.execute(DefaultTaskPlanExecutor.java:98)
	at org.gradle.execution.taskgraph.DefaultTaskExecutionPlan.execute(DefaultTaskExecutionPlan.java:663)
	at org.gradle.execution.taskgraph.DefaultTaskExecutionPlan.executeWithTask(DefaultTaskExecutionPlan.java:596)
	at org.gradle.execution.taskgraph.DefaultTaskPlanExecutor$TaskExecutorWorker.run(DefaultTaskPlanExecutor.java:98)
	at org.gradle.internal.concurrent.ExecutorPolicy$CatchAndRecordFailures.onExecute(ExecutorPolicy.java:63)
	at org.gradle.internal.concurrent.ManagedExecutorImpl$1.run(ManagedExecutorImpl.java:46)
	at org.gradle.internal.concurrent.ThreadFactoryImpl$ManagedThreadRunnable.run(ThreadFactoryImpl.java:55)
Caused by: org.gradle.api.GradleException: There were failing tests. See the report at: file://<https://builds.apache.org/job/beam_PerformanceTests_MongoDBIO_IT/ws/src/sdks/java/io/mongodb/build/reports/tests/integrationTest/index.html>
	at org.gradle.api.tasks.testing.AbstractTestTask.handleTestFailures(AbstractTestTask.java:612)
	at org.gradle.api.tasks.testing.AbstractTestTask.executeTests(AbstractTestTask.java:484)
	at org.gradle.api.tasks.testing.Test.executeTests(Test.java:583)
	at org.gradle.internal.reflect.JavaMethod.invoke(JavaMethod.java:73)
	at org.gradle.api.internal.project.taskfactory.StandardTaskAction.doExecute(StandardTaskAction.java:46)
	at org.gradle.api.internal.project.taskfactory.StandardTaskAction.execute(StandardTaskAction.java:39)
	at org.gradle.api.internal.project.taskfactory.StandardTaskAction.execute(StandardTaskAction.java:26)
	at org.gradle.api.internal.AbstractTask$TaskActionWrapper.execute(AbstractTask.java:794)
	at org.gradle.api.internal.AbstractTask$TaskActionWrapper.execute(AbstractTask.java:761)
	at org.gradle.api.internal.tasks.execution.ExecuteActionsTaskExecuter$1.run(ExecuteActionsTaskExecuter.java:124)
	at org.gradle.internal.operations.DefaultBuildOperationExecutor$RunnableBuildOperationWorker.execute(DefaultBuildOperationExecutor.java:317)
	at org.gradle.internal.operations.DefaultBuildOperationExecutor$RunnableBuildOperationWorker.execute(DefaultBuildOperationExecutor.java:309)
	at org.gradle.internal.operations.DefaultBuildOperationExecutor.execute(DefaultBuildOperationExecutor.java:185)
	at org.gradle.internal.operations.DefaultBuildOperationExecutor.run(DefaultBuildOperationExecutor.java:97)
	at org.gradle.internal.operations.DelegatingBuildOperationExecutor.run(DelegatingBuildOperationExecutor.java:31)
	at org.gradle.api.internal.tasks.execution.ExecuteActionsTaskExecuter.executeAction(ExecuteActionsTaskExecuter.java:113)
	at org.gradle.api.internal.tasks.execution.ExecuteActionsTaskExecuter.executeActions(ExecuteActionsTaskExecuter.java:95)
	... 31 more


* Get more help at https://help.gradle.org

2018-06-04 12:14:50,570 6d4341bd MainThread beam_integration_benchmark(1/1) ERROR    Error during benchmark beam_integration_benchmark
Traceback (most recent call last):
  File "<https://builds.apache.org/job/beam_PerformanceTests_MongoDBIO_IT/ws/PerfKitBenchmarker/perfkitbenchmarker/pkb.py",> line 667, in RunBenchmark
    DoRunPhase(spec, collector, detailed_timer)
  File "<https://builds.apache.org/job/beam_PerformanceTests_MongoDBIO_IT/ws/PerfKitBenchmarker/perfkitbenchmarker/pkb.py",> line 547, in DoRunPhase
    samples = spec.BenchmarkRun(spec)
  File "<https://builds.apache.org/job/beam_PerformanceTests_MongoDBIO_IT/ws/PerfKitBenchmarker/perfkitbenchmarker/linux_benchmarks/beam_integration_benchmark.py",> line 159, in Run
    job_type=job_type)
  File "<https://builds.apache.org/job/beam_PerformanceTests_MongoDBIO_IT/ws/PerfKitBenchmarker/perfkitbenchmarker/providers/gcp/gcp_dpb_dataflow.py",> line 90, in SubmitJob
    assert retcode == 0, "Integration Test Failed."
AssertionError: Integration Test Failed.
2018-06-04 12:14:50,571 6d4341bd MainThread beam_integration_benchmark(1/1) INFO     Cleaning up benchmark beam_integration_benchmark
2018-06-04 12:14:50,572 6d4341bd MainThread beam_integration_benchmark(1/1) INFO     Running: kubectl --kubeconfig=<https://builds.apache.org/job/beam_PerformanceTests_MongoDBIO_IT/ws/config-mongodbioit-260> delete -f <https://builds.apache.org/job/beam_PerformanceTests_MongoDBIO_IT/ws/src/.test-infra/kubernetes/mongodb/load-balancer/mongo.yml> --ignore-not-found
2018-06-04 12:14:51,621 6d4341bd MainThread beam_integration_benchmark(1/1) ERROR    Exception running benchmark
Traceback (most recent call last):
  File "<https://builds.apache.org/job/beam_PerformanceTests_MongoDBIO_IT/ws/PerfKitBenchmarker/perfkitbenchmarker/pkb.py",> line 801, in RunBenchmarkTask
    RunBenchmark(spec, collector)
  File "<https://builds.apache.org/job/beam_PerformanceTests_MongoDBIO_IT/ws/PerfKitBenchmarker/perfkitbenchmarker/pkb.py",> line 667, in RunBenchmark
    DoRunPhase(spec, collector, detailed_timer)
  File "<https://builds.apache.org/job/beam_PerformanceTests_MongoDBIO_IT/ws/PerfKitBenchmarker/perfkitbenchmarker/pkb.py",> line 547, in DoRunPhase
    samples = spec.BenchmarkRun(spec)
  File "<https://builds.apache.org/job/beam_PerformanceTests_MongoDBIO_IT/ws/PerfKitBenchmarker/perfkitbenchmarker/linux_benchmarks/beam_integration_benchmark.py",> line 159, in Run
    job_type=job_type)
  File "<https://builds.apache.org/job/beam_PerformanceTests_MongoDBIO_IT/ws/PerfKitBenchmarker/perfkitbenchmarker/providers/gcp/gcp_dpb_dataflow.py",> line 90, in SubmitJob
    assert retcode == 0, "Integration Test Failed."
AssertionError: Integration Test Failed.
2018-06-04 12:14:51,622 6d4341bd MainThread beam_integration_benchmark(1/1) ERROR    Benchmark 1/1 beam_integration_benchmark (UID: beam_integration_benchmark0) failed. Execution will continue.
2018-06-04 12:14:51,658 6d4341bd MainThread INFO     Benchmark run statuses:
---------------------------------------------------------------------------------
Name                        UID                          Status  Failed Substatus
---------------------------------------------------------------------------------
beam_integration_benchmark  beam_integration_benchmark0  FAILED                  
---------------------------------------------------------------------------------
Success rate: 0.00% (0/1)
2018-06-04 12:14:51,659 6d4341bd MainThread INFO     Complete logs can be found at: <https://builds.apache.org/job/beam_PerformanceTests_MongoDBIO_IT/ws/runs/6d4341bd/pkb.log>
2018-06-04 12:14:51,659 6d4341bd MainThread INFO     Completion statuses can be found at: <https://builds.apache.org/job/beam_PerformanceTests_MongoDBIO_IT/ws/runs/6d4341bd/completion_statuses.json>
Build step 'Execute shell' marked build as failure