You are viewing a plain text version of this content. The canonical link for it is here.
Posted to commits@logging.apache.org by Apache Jenkins Server <je...@builds.apache.org> on 2017/07/05 19:22:44 UTC

Build failed in Jenkins: logging-log4net » feature/cd-pipeline #64

See <https://builds.apache.org/job/logging-log4net/job/feature%252Fcd-pipeline/64/display/redirect>

------------------------------------------
[...truncated 125.33 KB...]
      [csc] /home/jenkins/jenkins-slave/workspace/log4net_feature_cd-pipeline-76KUCPODUF6LCE45226EBUR4GNVLYPMYVC23Z4ITBOMNJT3CA2WA/src/Util/SystemInfo.cs(1007,34): warning CS0618: `System.Configuration.ConfigurationSettings.AppSettings' is obsolete: `This property is obsolete.  Please use System.Configuration.ConfigurationManager.AppSettings'
      [csc] Compilation succeeded - 6 warning(s)

BUILD SUCCEEDED - 0 non-fatal error(s), 12 warning(s)

Total time: 3.3 seconds.

Stashed 6 file(s)
[Pipeline] stash
[log4net_feature_cd-pipeline-76KUCPODUF6LCE45226EBUR4GNVLYPMYVC23Z4ITBOMNJT3CA2WA] Running shell script
+ nant -t:mono-4.0 -buildfile:tests/nant.build runtests-mono-4.0
[Pipeline] sh
NAnt 0.92 (Build 0.92.4526.0; rc1; 05/23/2012)
Copyright (C) 2001-2012 Gerry Shaw
http://nant.sourceforge.net

Buildfile: file:///home/jenkins/jenkins-slave/workspace/log4net_feature_cd-pipeline-76KUCPODUF6LCE45226EBUR4GNVLYPMYVC23Z4ITBOMNJT3CA2WA/tests/nant.build
Target framework: Mono 4.0 Profile
Target(s) specified: runtests-mono-4.0 


check-current-build-config:


set-build-configuration:


set-debug-build-configuration:


check-current-build-config:


set-build-configuration-flags:


check-bin-dir:

    [mkdir] Creating directory '/home/jenkins/jenkins-slave/workspace/log4net_feature_cd-pipeline-76KUCPODUF6LCE45226EBUR4GNVLYPMYVC23Z4ITBOMNJT3CA2WA/tests/bin'.

check-doc-dir:

    [mkdir] Creating directory '/home/jenkins/jenkins-slave/workspace/log4net_feature_cd-pipeline-76KUCPODUF6LCE45226EBUR4GNVLYPMYVC23Z4ITBOMNJT3CA2WA/tests/doc'.

check-sdkdoc-dir:


check-sdkdoc-debug:


check-build-debug:


check-build-defines:


set-mono-4.0-runtime-configuration:


check-log4net-basedir:


check-current-bin-dir:

    [mkdir] Creating directory '/home/jenkins/jenkins-slave/workspace/log4net_feature_cd-pipeline-76KUCPODUF6LCE45226EBUR4GNVLYPMYVC23Z4ITBOMNJT3CA2WA/tests/bin/mono/4.0/debug'.

clean-current-bin-dir:

     [echo] Cleaning the bin/mono/4.0/debug binaries directory.
   [delete] Deleting directory '/home/jenkins/jenkins-slave/workspace/log4net_feature_cd-pipeline-76KUCPODUF6LCE45226EBUR4GNVLYPMYVC23Z4ITBOMNJT3CA2WA/tests/bin/mono/4.0/debug'.
    [mkdir] Creating directory '/home/jenkins/jenkins-slave/workspace/log4net_feature_cd-pipeline-76KUCPODUF6LCE45226EBUR4GNVLYPMYVC23Z4ITBOMNJT3CA2WA/tests/bin/mono/4.0/debug'.

check-log4net-output-dir:


check-log4net-assembly:

     [echo] Testing if file exists: ..//bin/mono/4.0/debug/log4net.dll 

install-nunit:

      [get] Retrieving 'https://github.com/nunit/nunitv2/releases/download/2.6.4/NUnit-2.6.4.zip' to '/home/jenkins/jenkins-slave/workspace/log4net_feature_cd-pipeline-76KUCPODUF6LCE45226EBUR4GNVLYPMYVC23Z4ITBOMNJT3CA2WA/tests/.tmp-nunit.zip'.
    [unzip] Unzipping '/home/jenkins/jenkins-slave/workspace/log4net_feature_cd-pipeline-76KUCPODUF6LCE45226EBUR4GNVLYPMYVC23Z4ITBOMNJT3CA2WA/tests/.tmp-nunit.zip' to '/home/jenkins/jenkins-slave/workspace/log4net_feature_cd-pipeline-76KUCPODUF6LCE45226EBUR4GNVLYPMYVC23Z4ITBOMNJT3CA2WA/tests/.tmp-nunit'.
     [copy] Copying 1 file to '/home/jenkins/jenkins-slave/workspace/log4net_feature_cd-pipeline-76KUCPODUF6LCE45226EBUR4GNVLYPMYVC23Z4ITBOMNJT3CA2WA/tests/lib/mono/4.0/debug'.
   [delete] Deleting file /home/jenkins/jenkins-slave/workspace/log4net_feature_cd-pipeline-76KUCPODUF6LCE45226EBUR4GNVLYPMYVC23Z4ITBOMNJT3CA2WA/tests/.tmp-nunit.zip.
   [delete] Deleting directory '/home/jenkins/jenkins-slave/workspace/log4net_feature_cd-pipeline-76KUCPODUF6LCE45226EBUR4GNVLYPMYVC23Z4ITBOMNJT3CA2WA/tests/.tmp-nunit'.

compile-mono-4.0:

     [copy] Copying 3 files to '/home/jenkins/jenkins-slave/workspace/log4net_feature_cd-pipeline-76KUCPODUF6LCE45226EBUR4GNVLYPMYVC23Z4ITBOMNJT3CA2WA/tests/bin/mono/4.0/debug'.
     [copy] Copying 1 file to '/home/jenkins/jenkins-slave/workspace/log4net_feature_cd-pipeline-76KUCPODUF6LCE45226EBUR4GNVLYPMYVC23Z4ITBOMNJT3CA2WA/tests/bin/mono/4.0/debug'.
      [csc] Compiling 46 files to '/home/jenkins/jenkins-slave/workspace/log4net_feature_cd-pipeline-76KUCPODUF6LCE45226EBUR4GNVLYPMYVC23Z4ITBOMNJT3CA2WA/tests/bin/mono/4.0/debug/log4net.Tests.dll'.

runtests-mono-4.0:

   [nunit2] log4net:WARN Exception while rendering format [IGNORE THIS WARNING - EXCEPTION EXPECTED Before {0} After {1} {2}]
   [nunit2] System.FormatException: Index (zero based) must be greater than or equal to zero and less than the size of the argument list.
   [nunit2]   at System.Text.StringBuilder.AppendFormat (IFormatProvider provider, System.String format, System.Object[] args) <0x41544c20 + 0x009cb> in <filename unknown>:0 
   [nunit2]   at System.String.Format (IFormatProvider provider, System.String format, System.Object[] args) <0x41544a60 + 0x00093> in <filename unknown>:0 
   [nunit2]   at log4net.Util.SystemStringFormat.StringFormat (IFormatProvider provider, System.String format, System.Object[] args) <0x4165a790 + 0x00068> in <filename unknown>:0 
   [nunit2] log4net:ERROR Hello
   [nunit2] log4net:ERROR World
   [nunit2] log4net:ERROR This will be recorded.
   [nunit2] log4net:ERROR This will be recorded.
   [nunit2] 
   [nunit2] /home/jenkins/jenkins-slave/workspace/log4net_feature_cd-pipeline-76KUCPODUF6LCE45226EBUR4GNVLYPMYVC23Z4ITBOMNJT3CA2WA/tests/nant.build(828,10):
   [nunit2] Tests Failed.

BUILD SUCCEEDED - 1 non-fatal error(s), 0 warning(s)

Total time: 19.9 seconds.

[Pipeline] stash
Stashed 1 file(s)
[Pipeline] }
$ docker stop --time=1 85adbee4feebb22d897f95b53fde241fd3d12e8b09770d46a00515258bf0486f
$ docker rm -f 85adbee4feebb22d897f95b53fde241fd3d12e8b09770d46a00515258bf0486f
[Pipeline] // withDockerContainer
[Pipeline] }
[Pipeline] // stage
[Pipeline] stage
[Pipeline] { (build netstandard)
[Pipeline] getContext
[Pipeline] readFile
[Pipeline] sh
[log4net_feature_cd-pipeline-76KUCPODUF6LCE45226EBUR4GNVLYPMYVC23Z4ITBOMNJT3CA2WA] Running shell script
+ docker build -t 220643b688e1e37454b379682087ec420123d257 -f buildtools/docker/builder-netstandard/Dockerfile buildtools/docker/builder-netstandard
Sending build context to Docker daemon 2.048 kB
Step 1/3 : FROM microsoft/dotnet
 ---> ab1dcd1a2496
Step 2/3 : MAINTAINER "dev@logging.apache.org"
 ---> Using cache
 ---> 1a392e603f49
Step 3/3 : RUN apt-get update && apt-get install -y nant git
 ---> Using cache
 ---> 67e2a492c30d
Successfully built 67e2a492c30d
[Pipeline] dockerFingerprintFrom
[Pipeline] sh
[log4net_feature_cd-pipeline-76KUCPODUF6LCE45226EBUR4GNVLYPMYVC23Z4ITBOMNJT3CA2WA] Running shell script
+ docker inspect -f . 220643b688e1e37454b379682087ec420123d257
.
[Pipeline] withDockerContainer
H22 does not seem to be running inside a container
$ docker run -t -d -u 10025:12040 -w /home/jenkins/jenkins-slave/workspace/log4net_feature_cd-pipeline-76KUCPODUF6LCE45226EBUR4GNVLYPMYVC23Z4ITBOMNJT3CA2WA -v /home/jenkins/jenkins-slave/workspace/log4net_feature_cd-pipeline-76KUCPODUF6LCE45226EBUR4GNVLYPMYVC23Z4ITBOMNJT3CA2WA:/home/jenkins/jenkins-slave/workspace/log4net_feature_cd-pipeline-76KUCPODUF6LCE45226EBUR4GNVLYPMYVC23Z4ITBOMNJT3CA2WA:rw -v /home/jenkins/jenkins-slave/workspace/log4net_feature_cd-pipeline-76KUCPODUF6LCE45226EBUR4GNVLYPMYVC23Z4ITBOMNJT3CA2WA@tmp:/home/jenkins/jenkins-slave/workspace/log4net_feature_cd-pipeline-76KUCPODUF6LCE45226EBUR4GNVLYPMYVC23Z4ITBOMNJT3CA2WA@tmp:rw -e ******** -e ******** -e ******** -e ******** -e ******** -e ******** -e ******** -e ******** -e ******** -e ******** -e ******** -e ******** -e ******** -e ******** -e ******** -e ******** -e ******** -e ******** -e ******** -e ******** -e ******** -e ******** -e ******** --entrypoint cat 220643b688e1e37454b379682087ec420123d257
[Pipeline] {
[Pipeline] withEnv
[Pipeline] {
[Pipeline] sh
[log4net_feature_cd-pipeline-76KUCPODUF6LCE45226EBUR4GNVLYPMYVC23Z4ITBOMNJT3CA2WA] Running shell script
+ rm -rf bin/ tests/
[Pipeline] checkout
 > git rev-parse --is-inside-work-tree # timeout=10
Fetching changes from 2 remote Git repositories
 > git config remote.origin.url https://github.com/apache/logging-log4net.git # timeout=10
Fetching upstream changes from https://github.com/apache/logging-log4net.git
 > git --version # timeout=10
using GIT_ASKPASS to set credentials dpsenner at github
 > git fetch --tags --progress https://github.com/apache/logging-log4net.git +refs/heads/*:refs/remotes/origin/*
 > git config remote.origin1.url https://github.com/apache/logging-log4net.git # timeout=10
Fetching upstream changes from https://github.com/apache/logging-log4net.git
using GIT_ASKPASS to set credentials dpsenner at github
 > git fetch --tags --progress https://github.com/apache/logging-log4net.git +refs/pull/*/head:refs/remotes/origin/pr/*
Checking out Revision fb9564a8edda45db850adcb5ae7b4ddf7f94f2b8 (feature/cd-pipeline)
 > git config core.sparsecheckout # timeout=10
 > git checkout -f fb9564a8edda45db850adcb5ae7b4ddf7f94f2b8
[Pipeline] sh
[log4net_feature_cd-pipeline-76KUCPODUF6LCE45226EBUR4GNVLYPMYVC23Z4ITBOMNJT3CA2WA] Running shell script
+ nant compile-netstandard
NAnt 0.92 (Build 0.92.4526.0; rc1; 05/23/2012)
Copyright (C) 2001-2012 Gerry Shaw
http://nant.sourceforge.net

Buildfile: file:///home/jenkins/jenkins-slave/workspace/log4net_feature_cd-pipeline-76KUCPODUF6LCE45226EBUR4GNVLYPMYVC23Z4ITBOMNJT3CA2WA/log4net.build
Target framework: Mono 4.0 Profile
Target(s) specified: compile-netstandard 


check-current-build-config:


set-build-configuration:


set-debug-build-configuration:


check-current-build-config:


set-build-configuration-flags:


compile-netstandard:


set-debug-build-configuration:


check-current-build-config:


set-build-configuration-flags:


compile-netstandard-current-configuration:

     [exec] 1.0.4
     [exec] /usr/share/dotnet/sdk/1.0.4/NuGet.targets(97,5): error : Failed to read NuGet.Config due to unauthorized access. Path: '/.nuget/NuGet/NuGet.Config'. [/home/jenkins/jenkins-slave/workspace/log4net_feature_cd-pipeline-76KUCPODUF6LCE45226EBUR4GNVLYPMYVC23Z4ITBOMNJT3CA2WA/netstandard/log4net.netstandard.sln]
     [exec] /usr/share/dotnet/sdk/1.0.4/NuGet.targets(97,5): error :   Access to the path '/.nuget/NuGet' is denied. [/home/jenkins/jenkins-slave/workspace/log4net_feature_cd-pipeline-76KUCPODUF6LCE45226EBUR4GNVLYPMYVC23Z4ITBOMNJT3CA2WA/netstandard/log4net.netstandard.sln]
     [exec] /usr/share/dotnet/sdk/1.0.4/NuGet.targets(97,5): error :   Permission denied [/home/jenkins/jenkins-slave/workspace/log4net_feature_cd-pipeline-76KUCPODUF6LCE45226EBUR4GNVLYPMYVC23Z4ITBOMNJT3CA2WA/netstandard/log4net.netstandard.sln]

BUILD FAILED

/home/jenkins/jenkins-slave/workspace/log4net_feature_cd-pipeline-76KUCPODUF6LCE45226EBUR4GNVLYPMYVC23Z4ITBOMNJT3CA2WA/log4net.build(2016,8):
External Program Failed: dotnet (return code was 1)

Total time: 2.7 seconds.

[Pipeline] }
[Pipeline] // withEnv
[Pipeline] }
$ docker stop --time=1 c07203f684987f590086fc742c71d92b8c5949d67102a1408d9c201a7316935f
$ docker rm -f c07203f684987f590086fc742c71d92b8c5949d67102a1408d9c201a7316935f
[Pipeline] // withDockerContainer
[Pipeline] }
[Pipeline] // stage
[Pipeline] stage
[Pipeline] { (build site)
Stage 'build site' skipped due to earlier failure(s)
[Pipeline] }
[Pipeline] // stage
[Pipeline] stage
[Pipeline] { (prepare package)
Stage 'prepare package' skipped due to earlier failure(s)
[Pipeline] }
[Pipeline] // stage
[Pipeline] stage
[Pipeline] { (check test results)
Stage 'check test results' skipped due to earlier failure(s)
[Pipeline] }
[Pipeline] // stage
[Pipeline] stage
[Pipeline] { (publish site)
Stage 'publish site' skipped due to earlier failure(s)
[Pipeline] }
[Pipeline] // stage
[Pipeline] stage
[Pipeline] { (Declarative: Post Actions)

Build failed in Jenkins: logging-log4net » feature/cd-pipeline #69

Posted by Apache Jenkins Server <je...@builds.apache.org>.
See <https://builds.apache.org/job/logging-log4net/job/feature%252Fcd-pipeline/69/display/redirect>

------------------------------------------
[...truncated 837.72 KB...]
Setting up libmono-codecontracts4.0-cil (3.2.8+dfsg-10) ...
Setting up libmono-compilerservices-symbolwriter4.0-cil (3.2.8+dfsg-10) ...
Setting up libmono-csharp4.0c-cil (3.2.8+dfsg-10) ...
Setting up libmono-debugger-soft4.0a-cil (3.2.8+dfsg-10) ...
Setting up libmono-microsoft-csharp4.0-cil (3.2.8+dfsg-10) ...
Setting up libmono-system-componentmodel-dataannotations4.0-cil (3.2.8+dfsg-10) ...
Setting up libmono-system-xml-linq4.0-cil (3.2.8+dfsg-10) ...
Setting up libmono-sharpzip4.84-cil (3.2.8+dfsg-10) ...
Setting up libmono-ldap4.0-cil (3.2.8+dfsg-10) ...
Setting up libmono-management2.0-cil (3.2.8+dfsg-10) ...
Setting up libmono-management4.0-cil (3.2.8+dfsg-10) ...
Setting up libmono-rabbitmq4.0-cil (3.2.8+dfsg-10) ...
Setting up libmono-microsoft-build4.0-cil (3.2.8+dfsg-10) ...
Setting up libmono-microsoft-build-utilities-v4.0-4.0-cil (3.2.8+dfsg-10) ...
Setting up libmono-microsoft-build-engine4.0-cil (3.2.8+dfsg-10) ...
Setting up libmono-xbuild-tasks4.0-cil (3.2.8+dfsg-10) ...
Setting up libmono-microsoft-build-tasks-v4.0-4.0-cil (3.2.8+dfsg-10) ...
Setting up libmono-parallel4.0-cil (3.2.8+dfsg-10) ...
Setting up libmono-relaxng4.0-cil (3.2.8+dfsg-10) ...
Setting up libmono-simd4.0-cil (3.2.8+dfsg-10) ...
Setting up libmono-system-componentmodel-composition4.0-cil (3.2.8+dfsg-10) ...
Setting up libmono-system-configuration-install4.0-cil (3.2.8+dfsg-10) ...
Setting up libmono-system-data-services-client4.0-cil (3.2.8+dfsg-10) ...
Setting up libmono-webbrowser4.0-cil (3.2.8+dfsg-10) ...
Setting up libmono-system-servicemodel-activation4.0-cil (3.2.8+dfsg-10) ...
Setting up libmono-system-dynamic4.0-cil (3.2.8+dfsg-10) ...
Setting up libmono-system-io-compression4.0-cil (3.2.8+dfsg-10) ...
Setting up libmono-system-io-compression-filesystem4.0-cil (3.2.8+dfsg-10) ...
Setting up libmono-system-json4.0-cil (3.2.8+dfsg-10) ...
Setting up libmono-system-ldap4.0-cil (3.2.8+dfsg-10) ...
Setting up libmono-system-ldap-protocols4.0-cil (3.2.8+dfsg-10) ...
Setting up libmono-system-management4.0-cil (3.2.8+dfsg-10) ...
Setting up libmono-system-net4.0-cil (3.2.8+dfsg-10) ...
Setting up libmono-system-net-http4.0-cil (3.2.8+dfsg-10) ...
Setting up libmono-system-net-http-webrequest4.0-cil (3.2.8+dfsg-10) ...
Setting up libmono-system-reactive-interfaces2.2-cil (3.2.8+dfsg-10) ...
Setting up libmono-system-reactive-core2.2-cil (3.2.8+dfsg-10) ...
Setting up libmono-system-reactive-linq2.2-cil (3.2.8+dfsg-10) ...
Setting up libmono-system-reactive-debugger2.2-cil (3.2.8+dfsg-10) ...
Setting up libmono-system-reactive-experimental2.2-cil (3.2.8+dfsg-10) ...
Setting up libmono-system-reactive-providers2.2-cil (3.2.8+dfsg-10) ...
Setting up libmono-system-reactive-observable-aliases0.0-cil (3.2.8+dfsg-10) ...
Setting up libmono-system-reactive-platformservices2.2-cil (3.2.8+dfsg-10) ...
Setting up libmono-system-reactive-runtime-remoting2.2-cil (3.2.8+dfsg-10) ...
Setting up libmono-system-xaml4.0-cil (3.2.8+dfsg-10) ...
Setting up libmono-windowsbase4.0-cil (3.2.8+dfsg-10) ...
Setting up libmono-system-reactive-windows-threading2.2-cil (3.2.8+dfsg-10) ...
Setting up libmono-system-runtime-durableinstancing4.0-cil (3.2.8+dfsg-10) ...
Setting up libmono-system-threading-tasks-dataflow4.0-cil (3.2.8+dfsg-10) ...
Setting up libmono-system-web-mvc1.0-cil (3.2.8+dfsg-10) ...
Setting up libmono-system-web-mvc2.0-cil (3.2.8+dfsg-10) ...
Setting up libmono-system-web-razor2.0-cil (3.2.8+dfsg-10) ...
Setting up libmono-system-windows4.0-cil (3.2.8+dfsg-10) ...
Setting up libnunit-core-interfaces2.6.3-cil (2.6.3+dfsg-1) ...
* Installing 1 assembly from libnunit-core-interfaces2.6.3-cil into Mono
Setting up libnunit-core2.6.3-cil (2.6.3+dfsg-1) ...
* Installing 1 assembly from libnunit-core2.6.3-cil into Mono
Setting up libnunit-framework2.6.3-cil (2.6.3+dfsg-1) ...
* Installing 1 assembly from libnunit-framework2.6.3-cil into Mono
Setting up libnunit-mocks2.6.3-cil (2.6.3+dfsg-1) ...
* Installing 1 assembly from libnunit-mocks2.6.3-cil into Mono
Setting up mono-csharp-shell (3.2.8+dfsg-10) ...
Setting up mono-mcs (3.2.8+dfsg-10) ...
Setting up mono-xbuild (3.2.8+dfsg-10) ...
Setting up libmono-system-security4.0-cil (3.2.8+dfsg-10) ...
Setting up libmono-system-configuration4.0-cil (3.2.8+dfsg-10) ...
Setting up libmono-system-transactions4.0-cil (3.2.8+dfsg-10) ...
Setting up libmono-system-enterpriseservices4.0-cil (3.2.8+dfsg-10) ...
Setting up libmono-system-data4.0-cil (3.2.8+dfsg-10) ...
Setting up libmono-sqlite4.0-cil (3.2.8+dfsg-10) ...
Setting up libmono-system-web-applicationservices4.0-cil (3.2.8+dfsg-10) ...
Setting up libmono-web4.0-cil (3.2.8+dfsg-10) ...
Setting up libmono-system-runtime2.0-cil (3.2.8+dfsg-10) ...
Setting up libmono-db2-1.0-cil (3.2.8+dfsg-10) ...
Setting up libmono-system-runtime-serialization4.0-cil (3.2.8+dfsg-10) ...
Setting up libmono-entityframework6.0-cil (3.2.8+dfsg-10) ...
Setting up libmono-entityframework-sqlserver6.0-cil (3.2.8+dfsg-10) ...
Setting up libmono-messaging4.0-cil (3.2.8+dfsg-10) ...
Setting up libmono-messaging-rabbitmq4.0-cil (3.2.8+dfsg-10) ...
Setting up libmono-npgsql4.0-cil (3.2.8+dfsg-10) ...
Setting up libmono-oracle4.0-cil (3.2.8+dfsg-10) ...
Setting up libmono-system-data-datasetextensions4.0-cil (3.2.8+dfsg-10) ...
Setting up libmono-system-data-linq4.0-cil (3.2.8+dfsg-10) ...
Setting up libmono-system-identitymodel4.0-cil (3.2.8+dfsg-10) ...
Setting up libmono-system-identitymodel-selectors4.0-cil (3.2.8+dfsg-10) ...
Setting up libmono-system-windows-forms4.0-cil (3.2.8+dfsg-10) ...
Setting up libmono-system-messaging4.0-cil (3.2.8+dfsg-10) ...
Setting up libmono-system-drawing-design4.0-cil (3.2.8+dfsg-10) ...
Setting up libmono-system-json-microsoft4.0-cil (3.2.8+dfsg-10) ...
Setting up libmono-system-net-http-formatting4.0-cil (3.2.8+dfsg-10) ...
Setting up libmono-system-reactive-windows-forms2.2-cil (3.2.8+dfsg-10) ...
Setting up libmono-system-runtime-caching4.0-cil (3.2.8+dfsg-10) ...
Setting up libmono-system-serviceprocess4.0-cil (3.2.8+dfsg-10) ...
Setting up libmono-system-web-http4.0-cil (3.2.8+dfsg-10) ...
Setting up libmono-system-windows-forms-datavisualization4.0a-cil (3.2.8+dfsg-10) ...
Setting up libmono-webmatrix-data4.0-cil (3.2.8+dfsg-10) ...
Setting up libmono-winforms2.0-cil (3.2.8+dfsg-10) ...
Setting up libmono-system-web4.0-cil (3.2.8+dfsg-10) ...
Setting up liblog4net1.2-cil (1.2.10+dfsg-6) ...
* Installing 1 assembly from liblog4net1.2-cil into Mono
Setting up libmono-http4.0-cil (3.2.8+dfsg-10) ...
Setting up libmono-microsoft-web-infrastructure1.0-cil (3.2.8+dfsg-10) ...
Setting up libmono-system-design4.0-cil (3.2.8+dfsg-10) ...
Setting up libmono-system-runtime4.0-cil (3.2.8+dfsg-10) ...
Setting up libmono-system-web-abstractions4.0-cil (3.2.8+dfsg-10) ...
Setting up libmono-system-web-extensions-design4.0-cil (3.2.8+dfsg-10) ...
Setting up libmono-system-web-http-webhost4.0-cil (3.2.8+dfsg-10) ...
Setting up libmono-system-web-webpages-deployment2.0-cil (3.2.8+dfsg-10) ...
Setting up libmono-system-web-webpages2.0-cil (3.2.8+dfsg-10) ...
Setting up libmono-system-web-webpages-razor2.0-cil (3.2.8+dfsg-10) ...
Setting up libmono-system-web-routing4.0-cil (3.2.8+dfsg-10) ...
Setting up libnunit-util2.6.3-cil (2.6.3+dfsg-1) ...
* Installing 1 assembly from libnunit-util2.6.3-cil into Mono
Setting up libnunit-console-runner2.6.3-cil (2.6.3+dfsg-1) ...
* Installing 1 assembly from libnunit-console-runner2.6.3-cil into Mono
Setting up libnunit-cil-dev (2.6.3+dfsg-1) ...
Setting up libmono-system-web-services4.0-cil (3.2.8+dfsg-10) ...
Setting up libmono-system-servicemodel4.0a-cil (3.2.8+dfsg-10) ...
Setting up libmono-system-web-extensions4.0-cil (3.2.8+dfsg-10) ...
Setting up libmono-system-servicemodel-web4.0-cil (3.2.8+dfsg-10) ...
Setting up libmono-system-data-services4.0-cil (3.2.8+dfsg-10) ...
Setting up libmono-system-servicemodel-discovery4.0-cil (3.2.8+dfsg-10) ...
Setting up libmono-system-servicemodel-routing4.0-cil (3.2.8+dfsg-10) ...
Setting up libmono-system-web-dynamicdata4.0-cil (3.2.8+dfsg-10) ...
Setting up libmono-system-web-http-selfhost4.0-cil (3.2.8+dfsg-10) ...
Setting up libmono-system-web-mvc3.0-cil (3.2.8+dfsg-10) ...
Setting up libmono-system-xml-serialization4.0-cil (3.2.8+dfsg-10) ...
Setting up libmono-cil-dev (3.2.8+dfsg-10) ...
Setting up mono-devel (3.2.8+dfsg-10) ...
update-alternatives: using /usr/bin/mono-csc to provide /usr/bin/cli-csc (c-sharp-compiler) in auto mode
update-alternatives: using /usr/bin/resgen to provide /usr/bin/cli-resgen (resource-file-generator) in auto mode
update-alternatives: using /usr/bin/al to provide /usr/bin/cli-al (assembly-linker) in auto mode
update-alternatives: using /usr/bin/sn to provide /usr/bin/cli-sn (strong-name-tool) in auto mode
Setting up nant (0.92~rc1+dfsg-4) ...
Processing triggers for libc-bin (2.19-18+deb8u10) ...
Processing triggers for systemd (215-17+deb8u7) ...
Processing triggers for sgml-base (1.26+nmu4) ...
 ---> 13b82daa5a4e
Removing intermediate container 6f3f9c82dd3b
Successfully built 13b82daa5a4e
[Pipeline] dockerFingerprintFrom
[Pipeline] sh
[log4net_feature_cd-pipeline-76KUCPODUF6LCE45226EBUR4GNVLYPMYVC23Z4ITBOMNJT3CA2WA] Running shell script
+ docker inspect -f . 220643b688e1e37454b379682087ec420123d257
.
[Pipeline] withDockerContainer
H23 does not seem to be running inside a container
$ docker run -t -d -u 10025:12040 -w /home/jenkins/jenkins-slave/workspace/log4net_feature_cd-pipeline-76KUCPODUF6LCE45226EBUR4GNVLYPMYVC23Z4ITBOMNJT3CA2WA -v /home/jenkins/jenkins-slave/workspace/log4net_feature_cd-pipeline-76KUCPODUF6LCE45226EBUR4GNVLYPMYVC23Z4ITBOMNJT3CA2WA:/home/jenkins/jenkins-slave/workspace/log4net_feature_cd-pipeline-76KUCPODUF6LCE45226EBUR4GNVLYPMYVC23Z4ITBOMNJT3CA2WA:rw -v /home/jenkins/jenkins-slave/workspace/log4net_feature_cd-pipeline-76KUCPODUF6LCE45226EBUR4GNVLYPMYVC23Z4ITBOMNJT3CA2WA@tmp:/home/jenkins/jenkins-slave/workspace/log4net_feature_cd-pipeline-76KUCPODUF6LCE45226EBUR4GNVLYPMYVC23Z4ITBOMNJT3CA2WA@tmp:rw -e ******** -e ******** -e ******** -e ******** -e ******** -e ******** -e ******** -e ******** -e ******** -e ******** -e ******** -e ******** -e ******** -e ******** -e ******** -e ******** -e ******** -e ******** -e ******** -e ******** -e ******** -e ******** -e ******** --entrypoint cat 220643b688e1e37454b379682087ec420123d257
[Pipeline] {
[Pipeline] sh
[log4net_feature_cd-pipeline-76KUCPODUF6LCE45226EBUR4GNVLYPMYVC23Z4ITBOMNJT3CA2WA] Running shell script
+ rm -rf bin/ tests/
[Pipeline] checkout
 > git rev-parse --is-inside-work-tree # timeout=10
Fetching changes from 2 remote Git repositories
 > git config remote.origin.url https://github.com/apache/logging-log4net.git # timeout=10
Fetching upstream changes from https://github.com/apache/logging-log4net.git
 > git --version # timeout=10
using GIT_ASKPASS to set credentials dpsenner at github
 > git fetch --tags --progress https://github.com/apache/logging-log4net.git +refs/heads/*:refs/remotes/origin/*
 > git config remote.origin1.url https://github.com/apache/logging-log4net.git # timeout=10
Fetching upstream changes from https://github.com/apache/logging-log4net.git
using GIT_ASKPASS to set credentials dpsenner at github
 > git fetch --tags --progress https://github.com/apache/logging-log4net.git +refs/pull/*/head:refs/remotes/origin/pr/*
Checking out Revision 3d0d4247ff5bfad12d15848e1638ff5d1d747a45 (feature/cd-pipeline)
 > git config core.sparsecheckout # timeout=10
 > git checkout -f 3d0d4247ff5bfad12d15848e1638ff5d1d747a45
[Pipeline] sh
[log4net_feature_cd-pipeline-76KUCPODUF6LCE45226EBUR4GNVLYPMYVC23Z4ITBOMNJT3CA2WA] Running shell script
+ nant compile-netstandard
NAnt 0.92 (Build 0.92.4526.0; rc1; 05/23/2012)
Copyright (C) 2001-2012 Gerry Shaw
http://nant.sourceforge.net

Buildfile: file:///home/jenkins/jenkins-slave/workspace/log4net_feature_cd-pipeline-76KUCPODUF6LCE45226EBUR4GNVLYPMYVC23Z4ITBOMNJT3CA2WA/log4net.build
Target framework: Mono 4.0 Profile
Target(s) specified: compile-netstandard 


check-current-build-config:


set-build-configuration:


set-debug-build-configuration:


check-current-build-config:


set-build-configuration-flags:


compile-netstandard:


set-debug-build-configuration:


check-current-build-config:


set-build-configuration-flags:


compile-netstandard-current-configuration:

     [exec] 1.0.4
     [exec] /usr/share/dotnet/sdk/1.0.4/NuGet.targets(97,5): error : Failed to read NuGet.Config due to unauthorized access. Path: '/.nuget/NuGet/NuGet.Config'. [/home/jenkins/jenkins-slave/workspace/log4net_feature_cd-pipeline-76KUCPODUF6LCE45226EBUR4GNVLYPMYVC23Z4ITBOMNJT3CA2WA/netstandard/log4net.netstandard.sln]
     [exec] /usr/share/dotnet/sdk/1.0.4/NuGet.targets(97,5): error :   Access to the path '/.nuget/NuGet' is denied. [/home/jenkins/jenkins-slave/workspace/log4net_feature_cd-pipeline-76KUCPODUF6LCE45226EBUR4GNVLYPMYVC23Z4ITBOMNJT3CA2WA/netstandard/log4net.netstandard.sln]
     [exec] /usr/share/dotnet/sdk/1.0.4/NuGet.targets(97,5): error :   Permission denied [/home/jenkins/jenkins-slave/workspace/log4net_feature_cd-pipeline-76KUCPODUF6LCE45226EBUR4GNVLYPMYVC23Z4ITBOMNJT3CA2WA/netstandard/log4net.netstandard.sln]

BUILD FAILED

/home/jenkins/jenkins-slave/workspace/log4net_feature_cd-pipeline-76KUCPODUF6LCE45226EBUR4GNVLYPMYVC23Z4ITBOMNJT3CA2WA/log4net.build(1766,8):
External Program Failed: dotnet (return code was 1)

Total time: 2.9 seconds.

[Pipeline] }
$ docker stop --time=1 003913959c754b7350ac9a982842e176f5f53e1a60399a7218fac686058c2459
$ docker rm -f 003913959c754b7350ac9a982842e176f5f53e1a60399a7218fac686058c2459
[Pipeline] // withDockerContainer
[Pipeline] }
[Pipeline] // stage
[Pipeline] stage
[Pipeline] { (build site)
Stage 'build site' skipped due to earlier failure(s)
[Pipeline] }
[Pipeline] // stage
[Pipeline] stage
[Pipeline] { (prepare package)
Stage 'prepare package' skipped due to earlier failure(s)
[Pipeline] }
[Pipeline] // stage
[Pipeline] stage
[Pipeline] { (check test results)
Stage 'check test results' skipped due to earlier failure(s)
[Pipeline] }
[Pipeline] // stage
[Pipeline] stage
[Pipeline] { (publish site)
Stage 'publish site' skipped due to earlier failure(s)
[Pipeline] }
[Pipeline] // stage
[Pipeline] stage
[Pipeline] { (Declarative: Post Actions)
[Pipeline] step

Build failed in Jenkins: logging-log4net » feature/cd-pipeline #68

Posted by Apache Jenkins Server <je...@builds.apache.org>.
See <https://builds.apache.org/job/logging-log4net/job/feature%252Fcd-pipeline/68/display/redirect>

------------------------------------------
[...truncated 125.94 KB...]

BUILD SUCCEEDED - 0 non-fatal error(s), 12 warning(s)

Total time: 2.7 seconds.

[Pipeline] stash
Stashed 6 file(s)
[Pipeline] sh
[log4net_feature_cd-pipeline-76KUCPODUF6LCE45226EBUR4GNVLYPMYVC23Z4ITBOMNJT3CA2WA] Running shell script
+ nant -t:mono-4.0 -buildfile:tests/nant.build runtests-mono-4.0
NAnt 0.92 (Build 0.92.4526.0; rc1; 05/23/2012)
Copyright (C) 2001-2012 Gerry Shaw
http://nant.sourceforge.net

Buildfile: file:///home/jenkins/jenkins-slave/workspace/log4net_feature_cd-pipeline-76KUCPODUF6LCE45226EBUR4GNVLYPMYVC23Z4ITBOMNJT3CA2WA/tests/nant.build
Target framework: Mono 4.0 Profile
Target(s) specified: runtests-mono-4.0 


check-current-build-config:


set-build-configuration:


set-debug-build-configuration:


check-current-build-config:


set-build-configuration-flags:


check-bin-dir:

    [mkdir] Creating directory '/home/jenkins/jenkins-slave/workspace/log4net_feature_cd-pipeline-76KUCPODUF6LCE45226EBUR4GNVLYPMYVC23Z4ITBOMNJT3CA2WA/tests/bin'.

check-doc-dir:

    [mkdir] Creating directory '/home/jenkins/jenkins-slave/workspace/log4net_feature_cd-pipeline-76KUCPODUF6LCE45226EBUR4GNVLYPMYVC23Z4ITBOMNJT3CA2WA/tests/doc'.

check-sdkdoc-dir:


check-sdkdoc-debug:


check-build-debug:


check-build-defines:


set-mono-4.0-runtime-configuration:


check-log4net-basedir:


check-current-bin-dir:

    [mkdir] Creating directory '/home/jenkins/jenkins-slave/workspace/log4net_feature_cd-pipeline-76KUCPODUF6LCE45226EBUR4GNVLYPMYVC23Z4ITBOMNJT3CA2WA/tests/bin/mono/4.0/debug'.

clean-current-bin-dir:

     [echo] Cleaning the bin/mono/4.0/debug binaries directory.
   [delete] Deleting directory '/home/jenkins/jenkins-slave/workspace/log4net_feature_cd-pipeline-76KUCPODUF6LCE45226EBUR4GNVLYPMYVC23Z4ITBOMNJT3CA2WA/tests/bin/mono/4.0/debug'.
    [mkdir] Creating directory '/home/jenkins/jenkins-slave/workspace/log4net_feature_cd-pipeline-76KUCPODUF6LCE45226EBUR4GNVLYPMYVC23Z4ITBOMNJT3CA2WA/tests/bin/mono/4.0/debug'.

check-log4net-output-dir:


check-log4net-assembly:

     [echo] Testing if file exists: ..//bin/mono/4.0/debug/log4net.dll 

install-nunit:

      [get] Retrieving 'https://github.com/nunit/nunitv2/releases/download/2.6.4/NUnit-2.6.4.zip' to '/home/jenkins/jenkins-slave/workspace/log4net_feature_cd-pipeline-76KUCPODUF6LCE45226EBUR4GNVLYPMYVC23Z4ITBOMNJT3CA2WA/tests/.tmp-nunit.zip'.
    [unzip] Unzipping '/home/jenkins/jenkins-slave/workspace/log4net_feature_cd-pipeline-76KUCPODUF6LCE45226EBUR4GNVLYPMYVC23Z4ITBOMNJT3CA2WA/tests/.tmp-nunit.zip' to '/home/jenkins/jenkins-slave/workspace/log4net_feature_cd-pipeline-76KUCPODUF6LCE45226EBUR4GNVLYPMYVC23Z4ITBOMNJT3CA2WA/tests/.tmp-nunit'.
     [copy] Copying 1 file to '/home/jenkins/jenkins-slave/workspace/log4net_feature_cd-pipeline-76KUCPODUF6LCE45226EBUR4GNVLYPMYVC23Z4ITBOMNJT3CA2WA/tests/lib/mono/4.0/debug'.
   [delete] Deleting file /home/jenkins/jenkins-slave/workspace/log4net_feature_cd-pipeline-76KUCPODUF6LCE45226EBUR4GNVLYPMYVC23Z4ITBOMNJT3CA2WA/tests/.tmp-nunit.zip.
   [delete] Deleting directory '/home/jenkins/jenkins-slave/workspace/log4net_feature_cd-pipeline-76KUCPODUF6LCE45226EBUR4GNVLYPMYVC23Z4ITBOMNJT3CA2WA/tests/.tmp-nunit'.

compile-mono-4.0:

     [copy] Copying 3 files to '/home/jenkins/jenkins-slave/workspace/log4net_feature_cd-pipeline-76KUCPODUF6LCE45226EBUR4GNVLYPMYVC23Z4ITBOMNJT3CA2WA/tests/bin/mono/4.0/debug'.
     [copy] Copying 1 file to '/home/jenkins/jenkins-slave/workspace/log4net_feature_cd-pipeline-76KUCPODUF6LCE45226EBUR4GNVLYPMYVC23Z4ITBOMNJT3CA2WA/tests/bin/mono/4.0/debug'.
      [csc] Compiling 46 files to '/home/jenkins/jenkins-slave/workspace/log4net_feature_cd-pipeline-76KUCPODUF6LCE45226EBUR4GNVLYPMYVC23Z4ITBOMNJT3CA2WA/tests/bin/mono/4.0/debug/log4net.Tests.dll'.

runtests-mono-4.0:

   [nunit2] log4net:WARN Exception while rendering format [IGNORE THIS WARNING - EXCEPTION EXPECTED Before {0} After {1} {2}]
   [nunit2] System.FormatException: Index (zero based) must be greater than or equal to zero and less than the size of the argument list.
   [nunit2]   at System.Text.StringBuilder.AppendFormat (IFormatProvider provider, System.String format, System.Object[] args) <0x41e4cc20 + 0x009cb> in <filename unknown>:0 
   [nunit2]   at System.String.Format (IFormatProvider provider, System.String format, System.Object[] args) <0x41e4ca60 + 0x00093> in <filename unknown>:0 
   [nunit2]   at log4net.Util.SystemStringFormat.StringFormat (IFormatProvider provider, System.String format, System.Object[] args) <0x41f62790 + 0x00068> in <filename unknown>:0 
   [nunit2] log4net:ERROR Hello
   [nunit2] log4net:ERROR World
   [nunit2] log4net:ERROR This will be recorded.
   [nunit2] log4net:ERROR This will be recorded.
   [nunit2] 
   [nunit2] /home/jenkins/jenkins-slave/workspace/log4net_feature_cd-pipeline-76KUCPODUF6LCE45226EBUR4GNVLYPMYVC23Z4ITBOMNJT3CA2WA/tests/nant.build(828,10):
   [nunit2] Tests Failed.

BUILD SUCCEEDED - 1 non-fatal error(s), 0 warning(s)

Total time: 19.4 seconds.

[Pipeline] stash
Stashed 1 file(s)
[Pipeline] }
$ docker stop --time=1 ba47deda6845e636581728e9d35a0e3303d9cf4184f00f351cfc3833280eb763
$ docker rm -f ba47deda6845e636581728e9d35a0e3303d9cf4184f00f351cfc3833280eb763
[Pipeline] // withDockerContainer
[Pipeline] }
[Pipeline] // stage
[Pipeline] stage
[Pipeline] { (build netstandard)
[Pipeline] getContext
[Pipeline] readFile
[Pipeline] sh
[log4net_feature_cd-pipeline-76KUCPODUF6LCE45226EBUR4GNVLYPMYVC23Z4ITBOMNJT3CA2WA] Running shell script
+ docker build -t 220643b688e1e37454b379682087ec420123d257 -f buildtools/docker/builder-netstandard/Dockerfile buildtools/docker/builder-netstandard
Sending build context to Docker daemon 2.048 kB
Step 1 : FROM microsoft/dotnet
 ---> e692284946db
Step 2 : MAINTAINER "dev@logging.apache.org"
 ---> Using cache
 ---> 4a76b9d068f2
Step 3 : RUN apt-get update && apt-get install -y nant git
 ---> Using cache
 ---> 3e13e04d3894
Successfully built 3e13e04d3894
[Pipeline] dockerFingerprintFrom
[Pipeline] sh
[log4net_feature_cd-pipeline-76KUCPODUF6LCE45226EBUR4GNVLYPMYVC23Z4ITBOMNJT3CA2WA] Running shell script
+ docker inspect -f . 220643b688e1e37454b379682087ec420123d257
.
[Pipeline] withDockerContainer
ubuntu-2 does not seem to be running inside a container
$ docker run -t -d -u 2396:2396 -w /home/jenkins/jenkins-slave/workspace/log4net_feature_cd-pipeline-76KUCPODUF6LCE45226EBUR4GNVLYPMYVC23Z4ITBOMNJT3CA2WA -v /home/jenkins/jenkins-slave/workspace/log4net_feature_cd-pipeline-76KUCPODUF6LCE45226EBUR4GNVLYPMYVC23Z4ITBOMNJT3CA2WA:/home/jenkins/jenkins-slave/workspace/log4net_feature_cd-pipeline-76KUCPODUF6LCE45226EBUR4GNVLYPMYVC23Z4ITBOMNJT3CA2WA:rw -v /home/jenkins/jenkins-slave/workspace/log4net_feature_cd-pipeline-76KUCPODUF6LCE45226EBUR4GNVLYPMYVC23Z4ITBOMNJT3CA2WA@tmp:/home/jenkins/jenkins-slave/workspace/log4net_feature_cd-pipeline-76KUCPODUF6LCE45226EBUR4GNVLYPMYVC23Z4ITBOMNJT3CA2WA@tmp:rw -e ******** -e ******** -e ******** -e ******** -e ******** -e ******** -e ******** -e ******** -e ******** -e ******** -e ******** -e ******** -e ******** -e ******** -e ******** -e ******** -e ******** -e ******** -e ******** -e ******** -e ******** -e ******** -e ******** --entrypoint cat 220643b688e1e37454b379682087ec420123d257
[Pipeline] {
[Pipeline] sh
[log4net_feature_cd-pipeline-76KUCPODUF6LCE45226EBUR4GNVLYPMYVC23Z4ITBOMNJT3CA2WA] Running shell script
++ pwd
+ export HOME=/home/jenkins/jenkins-slave/workspace/log4net_feature_cd-pipeline-76KUCPODUF6LCE45226EBUR4GNVLYPMYVC23Z4ITBOMNJT3CA2WA
+ HOME=/home/jenkins/jenkins-slave/workspace/log4net_feature_cd-pipeline-76KUCPODUF6LCE45226EBUR4GNVLYPMYVC23Z4ITBOMNJT3CA2WA
[Pipeline] sh
[log4net_feature_cd-pipeline-76KUCPODUF6LCE45226EBUR4GNVLYPMYVC23Z4ITBOMNJT3CA2WA] Running shell script
+ rm -rf bin/ tests/
[Pipeline] checkout
 > git rev-parse --is-inside-work-tree # timeout=10
Fetching changes from 2 remote Git repositories
 > git config remote.origin.url https://github.com/apache/logging-log4net.git # timeout=10
Fetching upstream changes from https://github.com/apache/logging-log4net.git
 > git --version # timeout=10
using GIT_ASKPASS to set credentials dpsenner at github
 > git fetch --tags --progress https://github.com/apache/logging-log4net.git +refs/heads/*:refs/remotes/origin/*
 > git config remote.origin1.url https://github.com/apache/logging-log4net.git # timeout=10
Fetching upstream changes from https://github.com/apache/logging-log4net.git
using GIT_ASKPASS to set credentials dpsenner at github
 > git fetch --tags --progress https://github.com/apache/logging-log4net.git +refs/pull/*/head:refs/remotes/origin/pr/*
Checking out Revision 0e6ad3b1f90f3fce2a009479432af1e82e9a46ce (feature/cd-pipeline)
 > git config core.sparsecheckout # timeout=10
 > git checkout -f 0e6ad3b1f90f3fce2a009479432af1e82e9a46ce
[Pipeline] sh
[log4net_feature_cd-pipeline-76KUCPODUF6LCE45226EBUR4GNVLYPMYVC23Z4ITBOMNJT3CA2WA] Running shell script
+ nant compile-netstandard
NAnt 0.92 (Build 0.92.4526.0; rc1; 05/23/2012)
Copyright (C) 2001-2012 Gerry Shaw
http://nant.sourceforge.net

Buildfile: file:///home/jenkins/jenkins-slave/workspace/log4net_feature_cd-pipeline-76KUCPODUF6LCE45226EBUR4GNVLYPMYVC23Z4ITBOMNJT3CA2WA/log4net.build
Target framework: Mono 4.0 Profile
Target(s) specified: compile-netstandard 


check-current-build-config:


set-build-configuration:


set-debug-build-configuration:


check-current-build-config:


set-build-configuration-flags:


compile-netstandard:


set-debug-build-configuration:


check-current-build-config:


set-build-configuration-flags:


compile-netstandard-current-configuration:

     [exec] 1.0.4
     [exec] /usr/share/dotnet/sdk/1.0.4/NuGet.targets(97,5): error : Failed to read NuGet.Config due to unauthorized access. Path: '/.nuget/NuGet/NuGet.Config'. [/home/jenkins/jenkins-slave/workspace/log4net_feature_cd-pipeline-76KUCPODUF6LCE45226EBUR4GNVLYPMYVC23Z4ITBOMNJT3CA2WA/netstandard/log4net.netstandard.sln]
     [exec] /usr/share/dotnet/sdk/1.0.4/NuGet.targets(97,5): error :   Access to the path '/.nuget/NuGet' is denied. [/home/jenkins/jenkins-slave/workspace/log4net_feature_cd-pipeline-76KUCPODUF6LCE45226EBUR4GNVLYPMYVC23Z4ITBOMNJT3CA2WA/netstandard/log4net.netstandard.sln]
     [exec] /usr/share/dotnet/sdk/1.0.4/NuGet.targets(97,5): error :   Permission denied [/home/jenkins/jenkins-slave/workspace/log4net_feature_cd-pipeline-76KUCPODUF6LCE45226EBUR4GNVLYPMYVC23Z4ITBOMNJT3CA2WA/netstandard/log4net.netstandard.sln]

BUILD FAILED

/home/jenkins/jenkins-slave/workspace/log4net_feature_cd-pipeline-76KUCPODUF6LCE45226EBUR4GNVLYPMYVC23Z4ITBOMNJT3CA2WA/log4net.build(1766,8):
External Program Failed: dotnet (return code was 1)

Total time: 2.1 seconds.

[Pipeline] }
$ docker stop --time=1 65e798e6faada953886621f4e6436156c35c03afd3443242215552bcc1bf701f
$ docker rm -f 65e798e6faada953886621f4e6436156c35c03afd3443242215552bcc1bf701f
[Pipeline] // withDockerContainer
[Pipeline] }
[Pipeline] // stage
[Pipeline] stage
[Pipeline] { (build site)
Stage 'build site' skipped due to earlier failure(s)
[Pipeline] }
[Pipeline] // stage
[Pipeline] stage
[Pipeline] { (prepare package)
Stage 'prepare package' skipped due to earlier failure(s)
[Pipeline] }
[Pipeline] // stage
[Pipeline] stage
[Pipeline] { (check test results)
Stage 'check test results' skipped due to earlier failure(s)
[Pipeline] }
[Pipeline] // stage
[Pipeline] stage
[Pipeline] { (publish site)
Stage 'publish site' skipped due to earlier failure(s)
[Pipeline] }
[Pipeline] // stage
[Pipeline] stage
[Pipeline] { (Declarative: Post Actions)
[Pipeline] step

Build failed in Jenkins: logging-log4net » feature/cd-pipeline #67

Posted by Apache Jenkins Server <je...@builds.apache.org>.
See <https://builds.apache.org/job/logging-log4net/job/feature%252Fcd-pipeline/67/display/redirect>

------------------------------------------
[...truncated 125.49 KB...]
      [csc] /home/jenkins/jenkins-slave/workspace/log4net_feature_cd-pipeline-76KUCPODUF6LCE45226EBUR4GNVLYPMYVC23Z4ITBOMNJT3CA2WA/src/Util/SystemInfo.cs(1007,34): warning CS0618: `System.Configuration.ConfigurationSettings.AppSettings' is obsolete: `This property is obsolete.  Please use System.Configuration.ConfigurationManager.AppSettings'
      [csc] Compilation succeeded - 6 warning(s)

BUILD SUCCEEDED - 0 non-fatal error(s), 12 warning(s)

Total time: 2.8 seconds.

[Pipeline] stash
Stashed 6 file(s)
[Pipeline] sh
[log4net_feature_cd-pipeline-76KUCPODUF6LCE45226EBUR4GNVLYPMYVC23Z4ITBOMNJT3CA2WA] Running shell script
+ nant -t:mono-4.0 -buildfile:tests/nant.build runtests-mono-4.0
NAnt 0.92 (Build 0.92.4526.0; rc1; 05/23/2012)
Copyright (C) 2001-2012 Gerry Shaw
http://nant.sourceforge.net

Buildfile: file:///home/jenkins/jenkins-slave/workspace/log4net_feature_cd-pipeline-76KUCPODUF6LCE45226EBUR4GNVLYPMYVC23Z4ITBOMNJT3CA2WA/tests/nant.build
Target framework: Mono 4.0 Profile
Target(s) specified: runtests-mono-4.0 


check-current-build-config:


set-build-configuration:


set-debug-build-configuration:


check-current-build-config:


set-build-configuration-flags:


check-bin-dir:

    [mkdir] Creating directory '/home/jenkins/jenkins-slave/workspace/log4net_feature_cd-pipeline-76KUCPODUF6LCE45226EBUR4GNVLYPMYVC23Z4ITBOMNJT3CA2WA/tests/bin'.

check-doc-dir:

    [mkdir] Creating directory '/home/jenkins/jenkins-slave/workspace/log4net_feature_cd-pipeline-76KUCPODUF6LCE45226EBUR4GNVLYPMYVC23Z4ITBOMNJT3CA2WA/tests/doc'.

check-sdkdoc-dir:


check-sdkdoc-debug:


check-build-debug:


check-build-defines:


set-mono-4.0-runtime-configuration:


check-log4net-basedir:


check-current-bin-dir:

    [mkdir] Creating directory '/home/jenkins/jenkins-slave/workspace/log4net_feature_cd-pipeline-76KUCPODUF6LCE45226EBUR4GNVLYPMYVC23Z4ITBOMNJT3CA2WA/tests/bin/mono/4.0/debug'.

clean-current-bin-dir:

     [echo] Cleaning the bin/mono/4.0/debug binaries directory.
   [delete] Deleting directory '/home/jenkins/jenkins-slave/workspace/log4net_feature_cd-pipeline-76KUCPODUF6LCE45226EBUR4GNVLYPMYVC23Z4ITBOMNJT3CA2WA/tests/bin/mono/4.0/debug'.
    [mkdir] Creating directory '/home/jenkins/jenkins-slave/workspace/log4net_feature_cd-pipeline-76KUCPODUF6LCE45226EBUR4GNVLYPMYVC23Z4ITBOMNJT3CA2WA/tests/bin/mono/4.0/debug'.

check-log4net-output-dir:


check-log4net-assembly:

     [echo] Testing if file exists: ..//bin/mono/4.0/debug/log4net.dll 

install-nunit:

      [get] Retrieving 'https://github.com/nunit/nunitv2/releases/download/2.6.4/NUnit-2.6.4.zip' to '/home/jenkins/jenkins-slave/workspace/log4net_feature_cd-pipeline-76KUCPODUF6LCE45226EBUR4GNVLYPMYVC23Z4ITBOMNJT3CA2WA/tests/.tmp-nunit.zip'.
    [unzip] Unzipping '/home/jenkins/jenkins-slave/workspace/log4net_feature_cd-pipeline-76KUCPODUF6LCE45226EBUR4GNVLYPMYVC23Z4ITBOMNJT3CA2WA/tests/.tmp-nunit.zip' to '/home/jenkins/jenkins-slave/workspace/log4net_feature_cd-pipeline-76KUCPODUF6LCE45226EBUR4GNVLYPMYVC23Z4ITBOMNJT3CA2WA/tests/.tmp-nunit'.
     [copy] Copying 1 file to '/home/jenkins/jenkins-slave/workspace/log4net_feature_cd-pipeline-76KUCPODUF6LCE45226EBUR4GNVLYPMYVC23Z4ITBOMNJT3CA2WA/tests/lib/mono/4.0/debug'.
   [delete] Deleting file /home/jenkins/jenkins-slave/workspace/log4net_feature_cd-pipeline-76KUCPODUF6LCE45226EBUR4GNVLYPMYVC23Z4ITBOMNJT3CA2WA/tests/.tmp-nunit.zip.
   [delete] Deleting directory '/home/jenkins/jenkins-slave/workspace/log4net_feature_cd-pipeline-76KUCPODUF6LCE45226EBUR4GNVLYPMYVC23Z4ITBOMNJT3CA2WA/tests/.tmp-nunit'.

compile-mono-4.0:

     [copy] Copying 3 files to '/home/jenkins/jenkins-slave/workspace/log4net_feature_cd-pipeline-76KUCPODUF6LCE45226EBUR4GNVLYPMYVC23Z4ITBOMNJT3CA2WA/tests/bin/mono/4.0/debug'.
     [copy] Copying 1 file to '/home/jenkins/jenkins-slave/workspace/log4net_feature_cd-pipeline-76KUCPODUF6LCE45226EBUR4GNVLYPMYVC23Z4ITBOMNJT3CA2WA/tests/bin/mono/4.0/debug'.
      [csc] Compiling 46 files to '/home/jenkins/jenkins-slave/workspace/log4net_feature_cd-pipeline-76KUCPODUF6LCE45226EBUR4GNVLYPMYVC23Z4ITBOMNJT3CA2WA/tests/bin/mono/4.0/debug/log4net.Tests.dll'.

runtests-mono-4.0:

   [nunit2] log4net:WARN Exception while rendering format [IGNORE THIS WARNING - EXCEPTION EXPECTED Before {0} After {1} {2}]
   [nunit2] System.FormatException: Index (zero based) must be greater than or equal to zero and less than the size of the argument list.
   [nunit2]   at System.Text.StringBuilder.AppendFormat (IFormatProvider provider, System.String format, System.Object[] args) <0x40c92c20 + 0x009cb> in <filename unknown>:0 
   [nunit2]   at System.String.Format (IFormatProvider provider, System.String format, System.Object[] args) <0x40c92a60 + 0x00093> in <filename unknown>:0 
   [nunit2]   at log4net.Util.SystemStringFormat.StringFormat (IFormatProvider provider, System.String format, System.Object[] args) <0x40da8b80 + 0x00068> in <filename unknown>:0 
   [nunit2] log4net:ERROR Hello
   [nunit2] log4net:ERROR World
   [nunit2] log4net:ERROR This will be recorded.
   [nunit2] log4net:ERROR This will be recorded.
   [nunit2] 
   [nunit2] /home/jenkins/jenkins-slave/workspace/log4net_feature_cd-pipeline-76KUCPODUF6LCE45226EBUR4GNVLYPMYVC23Z4ITBOMNJT3CA2WA/tests/nant.build(828,10):
   [nunit2] Tests Failed.

BUILD SUCCEEDED - 1 non-fatal error(s), 0 warning(s)

Total time: 20.6 seconds.

Stashed 1 file(s)
[Pipeline] stash
[Pipeline] }
$ docker stop --time=1 c0890fb8d24fc058fba4857f7296dc1016f88f863d5e400a136e714bc8deaa6e
$ docker rm -f c0890fb8d24fc058fba4857f7296dc1016f88f863d5e400a136e714bc8deaa6e
[Pipeline] // withDockerContainer
[Pipeline] }
[Pipeline] // stage
[Pipeline] stage
[Pipeline] { (build netstandard)
[Pipeline] getContext
[Pipeline] readFile
[log4net_feature_cd-pipeline-76KUCPODUF6LCE45226EBUR4GNVLYPMYVC23Z4ITBOMNJT3CA2WA] Running shell script
[Pipeline] sh
+ docker build -t 220643b688e1e37454b379682087ec420123d257 -f buildtools/docker/builder-netstandard/Dockerfile buildtools/docker/builder-netstandard
Sending build context to Docker daemon 2.048 kB
Step 1 : FROM microsoft/dotnet
 ---> e692284946db
Step 2 : MAINTAINER "dev@logging.apache.org"
 ---> Using cache
 ---> 4a76b9d068f2
Step 3 : RUN apt-get update && apt-get install -y nant git
 ---> Using cache
 ---> 3e13e04d3894
Successfully built 3e13e04d3894
[Pipeline] dockerFingerprintFrom
[Pipeline] sh
[log4net_feature_cd-pipeline-76KUCPODUF6LCE45226EBUR4GNVLYPMYVC23Z4ITBOMNJT3CA2WA] Running shell script
+ docker inspect -f . 220643b688e1e37454b379682087ec420123d257
.
[Pipeline] withDockerContainer
ubuntu-2 does not seem to be running inside a container
$ docker run -t -d -u 2396:2396 -w /home/jenkins/jenkins-slave/workspace/log4net_feature_cd-pipeline-76KUCPODUF6LCE45226EBUR4GNVLYPMYVC23Z4ITBOMNJT3CA2WA -v /home/jenkins/jenkins-slave/workspace/log4net_feature_cd-pipeline-76KUCPODUF6LCE45226EBUR4GNVLYPMYVC23Z4ITBOMNJT3CA2WA:/home/jenkins/jenkins-slave/workspace/log4net_feature_cd-pipeline-76KUCPODUF6LCE45226EBUR4GNVLYPMYVC23Z4ITBOMNJT3CA2WA:rw -v /home/jenkins/jenkins-slave/workspace/log4net_feature_cd-pipeline-76KUCPODUF6LCE45226EBUR4GNVLYPMYVC23Z4ITBOMNJT3CA2WA@tmp:/home/jenkins/jenkins-slave/workspace/log4net_feature_cd-pipeline-76KUCPODUF6LCE45226EBUR4GNVLYPMYVC23Z4ITBOMNJT3CA2WA@tmp:rw -e ******** -e ******** -e ******** -e ******** -e ******** -e ******** -e ******** -e ******** -e ******** -e ******** -e ******** -e ******** -e ******** -e ******** -e ******** -e ******** -e ******** -e ******** -e ******** -e ******** -e ******** -e ******** -e ******** --entrypoint cat 220643b688e1e37454b379682087ec420123d257
[Pipeline] {
[Pipeline] sh
[log4net_feature_cd-pipeline-76KUCPODUF6LCE45226EBUR4GNVLYPMYVC23Z4ITBOMNJT3CA2WA] Running shell script
++ pwd
+ set HOME=/home/jenkins/jenkins-slave/workspace/log4net_feature_cd-pipeline-76KUCPODUF6LCE45226EBUR4GNVLYPMYVC23Z4ITBOMNJT3CA2WA
[Pipeline] sh
[log4net_feature_cd-pipeline-76KUCPODUF6LCE45226EBUR4GNVLYPMYVC23Z4ITBOMNJT3CA2WA] Running shell script
+ rm -rf bin/ tests/
[Pipeline] checkout
 > git rev-parse --is-inside-work-tree # timeout=10
Fetching changes from 2 remote Git repositories
 > git config remote.origin.url https://github.com/apache/logging-log4net.git # timeout=10
Fetching upstream changes from https://github.com/apache/logging-log4net.git
 > git --version # timeout=10
using GIT_ASKPASS to set credentials dpsenner at github
 > git fetch --tags --progress https://github.com/apache/logging-log4net.git +refs/heads/*:refs/remotes/origin/*
 > git config remote.origin1.url https://github.com/apache/logging-log4net.git # timeout=10
Fetching upstream changes from https://github.com/apache/logging-log4net.git
using GIT_ASKPASS to set credentials dpsenner at github
 > git fetch --tags --progress https://github.com/apache/logging-log4net.git +refs/pull/*/head:refs/remotes/origin/pr/*
Checking out Revision ca4eddd2ef4203a7f0d1a7c84c2234665847b70a (feature/cd-pipeline)
 > git config core.sparsecheckout # timeout=10
 > git checkout -f ca4eddd2ef4203a7f0d1a7c84c2234665847b70a
[Pipeline] sh
[log4net_feature_cd-pipeline-76KUCPODUF6LCE45226EBUR4GNVLYPMYVC23Z4ITBOMNJT3CA2WA] Running shell script
+ nant compile-netstandard
NAnt 0.92 (Build 0.92.4526.0; rc1; 05/23/2012)
Copyright (C) 2001-2012 Gerry Shaw
http://nant.sourceforge.net

Buildfile: file:///home/jenkins/jenkins-slave/workspace/log4net_feature_cd-pipeline-76KUCPODUF6LCE45226EBUR4GNVLYPMYVC23Z4ITBOMNJT3CA2WA/log4net.build
Target framework: Mono 4.0 Profile
Target(s) specified: compile-netstandard 


check-current-build-config:


set-build-configuration:


set-debug-build-configuration:


check-current-build-config:


set-build-configuration-flags:


compile-netstandard:


set-debug-build-configuration:


check-current-build-config:


set-build-configuration-flags:


compile-netstandard-current-configuration:

     [exec] 1.0.4
     [exec] /usr/share/dotnet/sdk/1.0.4/NuGet.targets(97,5): error : Failed to read NuGet.Config due to unauthorized access. Path: '/.nuget/NuGet/NuGet.Config'. [/home/jenkins/jenkins-slave/workspace/log4net_feature_cd-pipeline-76KUCPODUF6LCE45226EBUR4GNVLYPMYVC23Z4ITBOMNJT3CA2WA/netstandard/log4net.netstandard.sln]
     [exec] /usr/share/dotnet/sdk/1.0.4/NuGet.targets(97,5): error :   Access to the path '/.nuget/NuGet' is denied. [/home/jenkins/jenkins-slave/workspace/log4net_feature_cd-pipeline-76KUCPODUF6LCE45226EBUR4GNVLYPMYVC23Z4ITBOMNJT3CA2WA/netstandard/log4net.netstandard.sln]
     [exec] /usr/share/dotnet/sdk/1.0.4/NuGet.targets(97,5): error :   Permission denied [/home/jenkins/jenkins-slave/workspace/log4net_feature_cd-pipeline-76KUCPODUF6LCE45226EBUR4GNVLYPMYVC23Z4ITBOMNJT3CA2WA/netstandard/log4net.netstandard.sln]

BUILD FAILED

/home/jenkins/jenkins-slave/workspace/log4net_feature_cd-pipeline-76KUCPODUF6LCE45226EBUR4GNVLYPMYVC23Z4ITBOMNJT3CA2WA/log4net.build(2016,8):
External Program Failed: dotnet (return code was 1)

Total time: 2.2 seconds.

[Pipeline] }
$ docker stop --time=1 32774cc91401693faa95b9fece9ef357bbaa1a8eaf835a5edb660390ae1eab71
$ docker rm -f 32774cc91401693faa95b9fece9ef357bbaa1a8eaf835a5edb660390ae1eab71
[Pipeline] // withDockerContainer
[Pipeline] }
[Pipeline] // stage
[Pipeline] stage
[Pipeline] { (build site)
Stage 'build site' skipped due to earlier failure(s)
[Pipeline] }
[Pipeline] // stage
[Pipeline] stage
[Pipeline] { (prepare package)
Stage 'prepare package' skipped due to earlier failure(s)
[Pipeline] }
[Pipeline] // stage
[Pipeline] stage
[Pipeline] { (check test results)
Stage 'check test results' skipped due to earlier failure(s)
[Pipeline] }
[Pipeline] // stage
[Pipeline] stage
[Pipeline] { (publish site)
Stage 'publish site' skipped due to earlier failure(s)
[Pipeline] }
[Pipeline] // stage
[Pipeline] stage
[Pipeline] { (Declarative: Post Actions)

Build failed in Jenkins: logging-log4net » feature/cd-pipeline #66

Posted by Apache Jenkins Server <je...@builds.apache.org>.
See <https://builds.apache.org/job/logging-log4net/job/feature%252Fcd-pipeline/66/display/redirect>

------------------------------------------
[...truncated 124.23 KB...]
      [csc] /home/jenkins/jenkins-slave/workspace/log4net_feature_cd-pipeline-76KUCPODUF6LCE45226EBUR4GNVLYPMYVC23Z4ITBOMNJT3CA2WA@2/src/Config/XmlConfigurator.cs(134,64): warning CS0618: `System.Configuration.ConfigurationSettings.GetConfig(string)' is obsolete: `This method is obsolete, it has been replaced by System.Configuration!System.Configuration.ConfigurationManager.GetSection'
      [csc] /home/jenkins/jenkins-slave/workspace/log4net_feature_cd-pipeline-76KUCPODUF6LCE45226EBUR4GNVLYPMYVC23Z4ITBOMNJT3CA2WA@2/src/Config/XmlConfigurator.cs(748,6): warning CS0618: `System.Xml.XmlValidatingReader' is obsolete: `Use XmlReader created by XmlReader.Create() method using appropriate XmlReaderSettings instead.'
      [csc] /home/jenkins/jenkins-slave/workspace/log4net_feature_cd-pipeline-76KUCPODUF6LCE45226EBUR4GNVLYPMYVC23Z4ITBOMNJT3CA2WA@2/src/Config/XmlConfigurator.cs(748,42): warning CS0618: `System.Xml.XmlValidatingReader' is obsolete: `Use XmlReader created by XmlReader.Create() method using appropriate XmlReaderSettings instead.'
      [csc] /home/jenkins/jenkins-slave/workspace/log4net_feature_cd-pipeline-76KUCPODUF6LCE45226EBUR4GNVLYPMYVC23Z4ITBOMNJT3CA2WA@2/src/Util/TypeConverters/IPAddressConverter.cs(122,29): warning CS0618: `System.Net.Dns.GetHostByName(string)' is obsolete: `Use GetHostEntry instead'
      [csc] /home/jenkins/jenkins-slave/workspace/log4net_feature_cd-pipeline-76KUCPODUF6LCE45226EBUR4GNVLYPMYVC23Z4ITBOMNJT3CA2WA@2/src/Util/SystemInfo.cs(1007,34): warning CS0618: `System.Configuration.ConfigurationSettings.AppSettings' is obsolete: `This property is obsolete.  Please use System.Configuration.ConfigurationManager.AppSettings'
      [csc] Compilation succeeded - 6 warning(s)

BUILD SUCCEEDED - 0 non-fatal error(s), 12 warning(s)

Total time: 3.2 seconds.

[Pipeline] stash
Stashed 6 file(s)
[Pipeline] sh
[log4net_feature_cd-pipeline-76KUCPODUF6LCE45226EBUR4GNVLYPMYVC23Z4ITBOMNJT3CA2WA@2] Running shell script
+ nant -t:mono-4.0 -buildfile:tests/nant.build runtests-mono-4.0
NAnt 0.92 (Build 0.92.4526.0; rc1; 05/23/2012)
Copyright (C) 2001-2012 Gerry Shaw
http://nant.sourceforge.net

Buildfile: file:///home/jenkins/jenkins-slave/workspace/log4net_feature_cd-pipeline-76KUCPODUF6LCE45226EBUR4GNVLYPMYVC23Z4ITBOMNJT3CA2WA@2/tests/nant.build
Target framework: Mono 4.0 Profile
Target(s) specified: runtests-mono-4.0 


check-current-build-config:


set-build-configuration:


set-debug-build-configuration:


check-current-build-config:


set-build-configuration-flags:


check-bin-dir:

    [mkdir] Creating directory '/home/jenkins/jenkins-slave/workspace/log4net_feature_cd-pipeline-76KUCPODUF6LCE45226EBUR4GNVLYPMYVC23Z4ITBOMNJT3CA2WA@2/tests/bin'.

check-doc-dir:

    [mkdir] Creating directory '/home/jenkins/jenkins-slave/workspace/log4net_feature_cd-pipeline-76KUCPODUF6LCE45226EBUR4GNVLYPMYVC23Z4ITBOMNJT3CA2WA@2/tests/doc'.

check-sdkdoc-dir:


check-sdkdoc-debug:


check-build-debug:


check-build-defines:


set-mono-4.0-runtime-configuration:


check-log4net-basedir:


check-current-bin-dir:

    [mkdir] Creating directory '/home/jenkins/jenkins-slave/workspace/log4net_feature_cd-pipeline-76KUCPODUF6LCE45226EBUR4GNVLYPMYVC23Z4ITBOMNJT3CA2WA@2/tests/bin/mono/4.0/debug'.

clean-current-bin-dir:

     [echo] Cleaning the bin/mono/4.0/debug binaries directory.
   [delete] Deleting directory '/home/jenkins/jenkins-slave/workspace/log4net_feature_cd-pipeline-76KUCPODUF6LCE45226EBUR4GNVLYPMYVC23Z4ITBOMNJT3CA2WA@2/tests/bin/mono/4.0/debug'.
    [mkdir] Creating directory '/home/jenkins/jenkins-slave/workspace/log4net_feature_cd-pipeline-76KUCPODUF6LCE45226EBUR4GNVLYPMYVC23Z4ITBOMNJT3CA2WA@2/tests/bin/mono/4.0/debug'.

check-log4net-output-dir:


check-log4net-assembly:

     [echo] Testing if file exists: ..//bin/mono/4.0/debug/log4net.dll 

install-nunit:

      [get] Retrieving 'https://github.com/nunit/nunitv2/releases/download/2.6.4/NUnit-2.6.4.zip' to '/home/jenkins/jenkins-slave/workspace/log4net_feature_cd-pipeline-76KUCPODUF6LCE45226EBUR4GNVLYPMYVC23Z4ITBOMNJT3CA2WA@2/tests/.tmp-nunit.zip'.
    [unzip] Unzipping '/home/jenkins/jenkins-slave/workspace/log4net_feature_cd-pipeline-76KUCPODUF6LCE45226EBUR4GNVLYPMYVC23Z4ITBOMNJT3CA2WA@2/tests/.tmp-nunit.zip' to '/home/jenkins/jenkins-slave/workspace/log4net_feature_cd-pipeline-76KUCPODUF6LCE45226EBUR4GNVLYPMYVC23Z4ITBOMNJT3CA2WA@2/tests/.tmp-nunit'.
     [copy] Copying 1 file to '/home/jenkins/jenkins-slave/workspace/log4net_feature_cd-pipeline-76KUCPODUF6LCE45226EBUR4GNVLYPMYVC23Z4ITBOMNJT3CA2WA@2/tests/lib/mono/4.0/debug'.
   [delete] Deleting file /home/jenkins/jenkins-slave/workspace/log4net_feature_cd-pipeline-76KUCPODUF6LCE45226EBUR4GNVLYPMYVC23Z4ITBOMNJT3CA2WA@2/tests/.tmp-nunit.zip.
   [delete] Deleting directory '/home/jenkins/jenkins-slave/workspace/log4net_feature_cd-pipeline-76KUCPODUF6LCE45226EBUR4GNVLYPMYVC23Z4ITBOMNJT3CA2WA@2/tests/.tmp-nunit'.

compile-mono-4.0:

     [copy] Copying 3 files to '/home/jenkins/jenkins-slave/workspace/log4net_feature_cd-pipeline-76KUCPODUF6LCE45226EBUR4GNVLYPMYVC23Z4ITBOMNJT3CA2WA@2/tests/bin/mono/4.0/debug'.
     [copy] Copying 1 file to '/home/jenkins/jenkins-slave/workspace/log4net_feature_cd-pipeline-76KUCPODUF6LCE45226EBUR4GNVLYPMYVC23Z4ITBOMNJT3CA2WA@2/tests/bin/mono/4.0/debug'.
      [csc] Compiling 46 files to '/home/jenkins/jenkins-slave/workspace/log4net_feature_cd-pipeline-76KUCPODUF6LCE45226EBUR4GNVLYPMYVC23Z4ITBOMNJT3CA2WA@2/tests/bin/mono/4.0/debug/log4net.Tests.dll'.

runtests-mono-4.0:

   [nunit2] log4net:WARN Exception while rendering format [IGNORE THIS WARNING - EXCEPTION EXPECTED Before {0} After {1} {2}]
   [nunit2] System.FormatException: Index (zero based) must be greater than or equal to zero and less than the size of the argument list.
   [nunit2]   at System.Text.StringBuilder.AppendFormat (IFormatProvider provider, System.String format, System.Object[] args) <0x40c62c20 + 0x009cb> in <filename unknown>:0 
   [nunit2]   at System.String.Format (IFormatProvider provider, System.String format, System.Object[] args) <0x40c62a60 + 0x00093> in <filename unknown>:0 
   [nunit2]   at log4net.Util.SystemStringFormat.StringFormat (IFormatProvider provider, System.String format, System.Object[] args) <0x40d79050 + 0x00068> in <filename unknown>:0 
   [nunit2] log4net:ERROR Hello
   [nunit2] log4net:ERROR World
   [nunit2] log4net:ERROR This will be recorded.
   [nunit2] log4net:ERROR This will be recorded.
   [nunit2] 
   [nunit2] /home/jenkins/jenkins-slave/workspace/log4net_feature_cd-pipeline-76KUCPODUF6LCE45226EBUR4GNVLYPMYVC23Z4ITBOMNJT3CA2WA@2/tests/nant.build(828,10):
   [nunit2] Tests Failed.

BUILD SUCCEEDED - 1 non-fatal error(s), 0 warning(s)

Total time: 20 seconds.

[Pipeline] stash
Stashed 1 file(s)
[Pipeline] }
$ docker stop --time=1 8ecdc7fd5eb311563dea1c1828d46824b83a8b62fc14b56ea29e1ff44ea48316
$ docker rm -f 8ecdc7fd5eb311563dea1c1828d46824b83a8b62fc14b56ea29e1ff44ea48316
[Pipeline] // withDockerContainer
[Pipeline] }
[Pipeline] // stage
[Pipeline] stage
[Pipeline] { (build netstandard)
[Pipeline] getContext
[Pipeline] readFile
[Pipeline] sh
[log4net_feature_cd-pipeline-76KUCPODUF6LCE45226EBUR4GNVLYPMYVC23Z4ITBOMNJT3CA2WA@2] Running shell script
+ docker build -t 220643b688e1e37454b379682087ec420123d257 -f buildtools/docker/builder-netstandard/Dockerfile buildtools/docker/builder-netstandard
Sending build context to Docker daemon 2.048 kB
Step 1/3 : FROM microsoft/dotnet
 ---> ab1dcd1a2496
Step 2/3 : MAINTAINER "dev@logging.apache.org"
 ---> Using cache
 ---> 1a392e603f49
Step 3/3 : RUN apt-get update && apt-get install -y nant git
 ---> Using cache
 ---> 67e2a492c30d
Successfully built 67e2a492c30d
[Pipeline] dockerFingerprintFrom
[Pipeline] sh
[log4net_feature_cd-pipeline-76KUCPODUF6LCE45226EBUR4GNVLYPMYVC23Z4ITBOMNJT3CA2WA@2] Running shell script
+ docker inspect -f . 220643b688e1e37454b379682087ec420123d257
.
[Pipeline] withDockerContainer
H22 does not seem to be running inside a container
$ docker run -t -d -u 10025:12040 -e HOME=/home/jenkins -e USER=jenkins -w /home/jenkins/jenkins-slave/workspace/log4net_feature_cd-pipeline-76KUCPODUF6LCE45226EBUR4GNVLYPMYVC23Z4ITBOMNJT3CA2WA@2 -v /home/jenkins/jenkins-slave/workspace/log4net_feature_cd-pipeline-76KUCPODUF6LCE45226EBUR4GNVLYPMYVC23Z4ITBOMNJT3CA2WA@2:/home/jenkins/jenkins-slave/workspace/log4net_feature_cd-pipeline-76KUCPODUF6LCE45226EBUR4GNVLYPMYVC23Z4ITBOMNJT3CA2WA@2:rw -v /home/jenkins/jenkins-slave/workspace/log4net_feature_cd-pipeline-76KUCPODUF6LCE45226EBUR4GNVLYPMYVC23Z4ITBOMNJT3CA2WA@2@tmp:/home/jenkins/jenkins-slave/workspace/log4net_feature_cd-pipeline-76KUCPODUF6LCE45226EBUR4GNVLYPMYVC23Z4ITBOMNJT3CA2WA@2@tmp:rw -e ******** -e ******** -e ******** -e ******** -e ******** -e ******** -e ******** -e ******** -e ******** -e ******** -e ******** -e ******** -e ******** -e ******** -e ******** -e ******** -e ******** -e ******** -e ******** -e ******** -e ******** -e ******** -e ******** --entrypoint cat 220643b688e1e37454b379682087ec420123d257
[Pipeline] {
[Pipeline] sh
[log4net_feature_cd-pipeline-76KUCPODUF6LCE45226EBUR4GNVLYPMYVC23Z4ITBOMNJT3CA2WA@2] Running shell script
+ rm -rf bin/ tests/
[Pipeline] checkout
 > git rev-parse --is-inside-work-tree # timeout=10
Fetching changes from 2 remote Git repositories
 > git config remote.origin.url https://github.com/apache/logging-log4net.git # timeout=10
Fetching upstream changes from https://github.com/apache/logging-log4net.git
 > git --version # timeout=10
using GIT_ASKPASS to set credentials dpsenner at github
 > git fetch --tags --progress https://github.com/apache/logging-log4net.git +refs/heads/*:refs/remotes/origin/*
 > git config remote.origin1.url https://github.com/apache/logging-log4net.git # timeout=10
Fetching upstream changes from https://github.com/apache/logging-log4net.git
using GIT_ASKPASS to set credentials dpsenner at github
 > git fetch --tags --progress https://github.com/apache/logging-log4net.git +refs/pull/*/head:refs/remotes/origin/pr/*
Checking out Revision 65e72eb2defbc98412b102fd7caa32e37a57f424 (feature/cd-pipeline)
 > git config core.sparsecheckout # timeout=10
 > git checkout -f 65e72eb2defbc98412b102fd7caa32e37a57f424
[Pipeline] sh
[log4net_feature_cd-pipeline-76KUCPODUF6LCE45226EBUR4GNVLYPMYVC23Z4ITBOMNJT3CA2WA@2] Running shell script
+ nant compile-netstandard
NAnt 0.92 (Build 0.92.4526.0; rc1; 05/23/2012)
Copyright (C) 2001-2012 Gerry Shaw
http://nant.sourceforge.net

Buildfile: file:///home/jenkins/jenkins-slave/workspace/log4net_feature_cd-pipeline-76KUCPODUF6LCE45226EBUR4GNVLYPMYVC23Z4ITBOMNJT3CA2WA@2/log4net.build
Target framework: Mono 4.0 Profile
Target(s) specified: compile-netstandard 


check-current-build-config:


set-build-configuration:


set-debug-build-configuration:


check-current-build-config:


set-build-configuration-flags:


compile-netstandard:


set-debug-build-configuration:


check-current-build-config:


set-build-configuration-flags:


compile-netstandard-current-configuration:

     [exec] 1.0.4
     [exec] /usr/share/dotnet/sdk/1.0.4/NuGet.targets(97,5): error : Failed to read NuGet.Config due to unauthorized access. Path: '/home/jenkins/.nuget/NuGet/NuGet.Config'. [/home/jenkins/jenkins-slave/workspace/log4net_feature_cd-pipeline-76KUCPODUF6LCE45226EBUR4GNVLYPMYVC23Z4ITBOMNJT3CA2WA@2/netstandard/log4net.netstandard.sln]
     [exec] /usr/share/dotnet/sdk/1.0.4/NuGet.targets(97,5): error :   Access to the path '/home/jenkins/.nuget/NuGet' is denied. [/home/jenkins/jenkins-slave/workspace/log4net_feature_cd-pipeline-76KUCPODUF6LCE45226EBUR4GNVLYPMYVC23Z4ITBOMNJT3CA2WA@2/netstandard/log4net.netstandard.sln]
     [exec] /usr/share/dotnet/sdk/1.0.4/NuGet.targets(97,5): error :   Permission denied [/home/jenkins/jenkins-slave/workspace/log4net_feature_cd-pipeline-76KUCPODUF6LCE45226EBUR4GNVLYPMYVC23Z4ITBOMNJT3CA2WA@2/netstandard/log4net.netstandard.sln]

BUILD FAILED

/home/jenkins/jenkins-slave/workspace/log4net_feature_cd-pipeline-76KUCPODUF6LCE45226EBUR4GNVLYPMYVC23Z4ITBOMNJT3CA2WA@2/log4net.build(2016,8):
External Program Failed: dotnet (return code was 1)

Total time: 2.6 seconds.

[Pipeline] }
$ docker stop --time=1 0490c51e33a1b72e5db795b4c3a3ef4fc0cfffd637d3406c15bdb5152418fe65
$ docker rm -f 0490c51e33a1b72e5db795b4c3a3ef4fc0cfffd637d3406c15bdb5152418fe65
[Pipeline] // withDockerContainer
[Pipeline] }
[Pipeline] // stage
[Pipeline] stage
[Pipeline] { (build site)
Stage 'build site' skipped due to earlier failure(s)
[Pipeline] }
[Pipeline] // stage
[Pipeline] stage
[Pipeline] { (prepare package)
Stage 'prepare package' skipped due to earlier failure(s)
[Pipeline] }
[Pipeline] // stage
[Pipeline] stage
[Pipeline] { (check test results)
Stage 'check test results' skipped due to earlier failure(s)
[Pipeline] }
[Pipeline] // stage
[Pipeline] stage
[Pipeline] { (publish site)
Stage 'publish site' skipped due to earlier failure(s)
[Pipeline] }
[Pipeline] // stage
[Pipeline] stage
[Pipeline] { (Declarative: Post Actions)

Build failed in Jenkins: logging-log4net » feature/cd-pipeline #65

Posted by Apache Jenkins Server <je...@builds.apache.org>.
See <https://builds.apache.org/job/logging-log4net/job/feature%252Fcd-pipeline/65/display/redirect>

------------------------------------------
[...truncated 123.99 KB...]
      [csc] /home/jenkins/jenkins-slave/workspace/log4net_feature_cd-pipeline-76KUCPODUF6LCE45226EBUR4GNVLYPMYVC23Z4ITBOMNJT3CA2WA/src/Config/XmlConfigurator.cs(134,64): warning CS0618: `System.Configuration.ConfigurationSettings.GetConfig(string)' is obsolete: `This method is obsolete, it has been replaced by System.Configuration!System.Configuration.ConfigurationManager.GetSection'
      [csc] /home/jenkins/jenkins-slave/workspace/log4net_feature_cd-pipeline-76KUCPODUF6LCE45226EBUR4GNVLYPMYVC23Z4ITBOMNJT3CA2WA/src/Config/XmlConfigurator.cs(748,6): warning CS0618: `System.Xml.XmlValidatingReader' is obsolete: `Use XmlReader created by XmlReader.Create() method using appropriate XmlReaderSettings instead.'
      [csc] /home/jenkins/jenkins-slave/workspace/log4net_feature_cd-pipeline-76KUCPODUF6LCE45226EBUR4GNVLYPMYVC23Z4ITBOMNJT3CA2WA/src/Config/XmlConfigurator.cs(748,42): warning CS0618: `System.Xml.XmlValidatingReader' is obsolete: `Use XmlReader created by XmlReader.Create() method using appropriate XmlReaderSettings instead.'
      [csc] /home/jenkins/jenkins-slave/workspace/log4net_feature_cd-pipeline-76KUCPODUF6LCE45226EBUR4GNVLYPMYVC23Z4ITBOMNJT3CA2WA/src/Util/TypeConverters/IPAddressConverter.cs(122,29): warning CS0618: `System.Net.Dns.GetHostByName(string)' is obsolete: `Use GetHostEntry instead'
      [csc] /home/jenkins/jenkins-slave/workspace/log4net_feature_cd-pipeline-76KUCPODUF6LCE45226EBUR4GNVLYPMYVC23Z4ITBOMNJT3CA2WA/src/Util/SystemInfo.cs(1007,34): warning CS0618: `System.Configuration.ConfigurationSettings.AppSettings' is obsolete: `This property is obsolete.  Please use System.Configuration.ConfigurationManager.AppSettings'
      [csc] Compilation succeeded - 6 warning(s)

BUILD SUCCEEDED - 0 non-fatal error(s), 12 warning(s)

Total time: 3.2 seconds.

[Pipeline] stash
Stashed 6 file(s)
[Pipeline] sh
[log4net_feature_cd-pipeline-76KUCPODUF6LCE45226EBUR4GNVLYPMYVC23Z4ITBOMNJT3CA2WA] Running shell script
+ nant -t:mono-4.0 -buildfile:tests/nant.build runtests-mono-4.0
NAnt 0.92 (Build 0.92.4526.0; rc1; 05/23/2012)
Copyright (C) 2001-2012 Gerry Shaw
http://nant.sourceforge.net

Buildfile: file:///home/jenkins/jenkins-slave/workspace/log4net_feature_cd-pipeline-76KUCPODUF6LCE45226EBUR4GNVLYPMYVC23Z4ITBOMNJT3CA2WA/tests/nant.build
Target framework: Mono 4.0 Profile
Target(s) specified: runtests-mono-4.0 


check-current-build-config:


set-build-configuration:


set-debug-build-configuration:


check-current-build-config:


set-build-configuration-flags:


check-bin-dir:

    [mkdir] Creating directory '/home/jenkins/jenkins-slave/workspace/log4net_feature_cd-pipeline-76KUCPODUF6LCE45226EBUR4GNVLYPMYVC23Z4ITBOMNJT3CA2WA/tests/bin'.

check-doc-dir:

    [mkdir] Creating directory '/home/jenkins/jenkins-slave/workspace/log4net_feature_cd-pipeline-76KUCPODUF6LCE45226EBUR4GNVLYPMYVC23Z4ITBOMNJT3CA2WA/tests/doc'.

check-sdkdoc-dir:


check-sdkdoc-debug:


check-build-debug:


check-build-defines:


set-mono-4.0-runtime-configuration:


check-log4net-basedir:


check-current-bin-dir:

    [mkdir] Creating directory '/home/jenkins/jenkins-slave/workspace/log4net_feature_cd-pipeline-76KUCPODUF6LCE45226EBUR4GNVLYPMYVC23Z4ITBOMNJT3CA2WA/tests/bin/mono/4.0/debug'.

clean-current-bin-dir:

     [echo] Cleaning the bin/mono/4.0/debug binaries directory.
   [delete] Deleting directory '/home/jenkins/jenkins-slave/workspace/log4net_feature_cd-pipeline-76KUCPODUF6LCE45226EBUR4GNVLYPMYVC23Z4ITBOMNJT3CA2WA/tests/bin/mono/4.0/debug'.
    [mkdir] Creating directory '/home/jenkins/jenkins-slave/workspace/log4net_feature_cd-pipeline-76KUCPODUF6LCE45226EBUR4GNVLYPMYVC23Z4ITBOMNJT3CA2WA/tests/bin/mono/4.0/debug'.

check-log4net-output-dir:


check-log4net-assembly:

     [echo] Testing if file exists: ..//bin/mono/4.0/debug/log4net.dll 

install-nunit:

      [get] Retrieving 'https://github.com/nunit/nunitv2/releases/download/2.6.4/NUnit-2.6.4.zip' to '/home/jenkins/jenkins-slave/workspace/log4net_feature_cd-pipeline-76KUCPODUF6LCE45226EBUR4GNVLYPMYVC23Z4ITBOMNJT3CA2WA/tests/.tmp-nunit.zip'.
    [unzip] Unzipping '/home/jenkins/jenkins-slave/workspace/log4net_feature_cd-pipeline-76KUCPODUF6LCE45226EBUR4GNVLYPMYVC23Z4ITBOMNJT3CA2WA/tests/.tmp-nunit.zip' to '/home/jenkins/jenkins-slave/workspace/log4net_feature_cd-pipeline-76KUCPODUF6LCE45226EBUR4GNVLYPMYVC23Z4ITBOMNJT3CA2WA/tests/.tmp-nunit'.
     [copy] Copying 1 file to '/home/jenkins/jenkins-slave/workspace/log4net_feature_cd-pipeline-76KUCPODUF6LCE45226EBUR4GNVLYPMYVC23Z4ITBOMNJT3CA2WA/tests/lib/mono/4.0/debug'.
   [delete] Deleting file /home/jenkins/jenkins-slave/workspace/log4net_feature_cd-pipeline-76KUCPODUF6LCE45226EBUR4GNVLYPMYVC23Z4ITBOMNJT3CA2WA/tests/.tmp-nunit.zip.
   [delete] Deleting directory '/home/jenkins/jenkins-slave/workspace/log4net_feature_cd-pipeline-76KUCPODUF6LCE45226EBUR4GNVLYPMYVC23Z4ITBOMNJT3CA2WA/tests/.tmp-nunit'.

compile-mono-4.0:

     [copy] Copying 3 files to '/home/jenkins/jenkins-slave/workspace/log4net_feature_cd-pipeline-76KUCPODUF6LCE45226EBUR4GNVLYPMYVC23Z4ITBOMNJT3CA2WA/tests/bin/mono/4.0/debug'.
     [copy] Copying 1 file to '/home/jenkins/jenkins-slave/workspace/log4net_feature_cd-pipeline-76KUCPODUF6LCE45226EBUR4GNVLYPMYVC23Z4ITBOMNJT3CA2WA/tests/bin/mono/4.0/debug'.
      [csc] Compiling 46 files to '/home/jenkins/jenkins-slave/workspace/log4net_feature_cd-pipeline-76KUCPODUF6LCE45226EBUR4GNVLYPMYVC23Z4ITBOMNJT3CA2WA/tests/bin/mono/4.0/debug/log4net.Tests.dll'.

runtests-mono-4.0:

   [nunit2] log4net:WARN Exception while rendering format [IGNORE THIS WARNING - EXCEPTION EXPECTED Before {0} After {1} {2}]
   [nunit2] System.FormatException: Index (zero based) must be greater than or equal to zero and less than the size of the argument list.
   [nunit2]   at System.Text.StringBuilder.AppendFormat (IFormatProvider provider, System.String format, System.Object[] args) <0x41a85c20 + 0x009cb> in <filename unknown>:0 
   [nunit2]   at System.String.Format (IFormatProvider provider, System.String format, System.Object[] args) <0x41a85a60 + 0x00093> in <filename unknown>:0 
   [nunit2]   at log4net.Util.SystemStringFormat.StringFormat (IFormatProvider provider, System.String format, System.Object[] args) <0x41b9c260 + 0x00068> in <filename unknown>:0 
   [nunit2] log4net:ERROR Hello
   [nunit2] log4net:ERROR World
   [nunit2] log4net:ERROR This will be recorded.
   [nunit2] log4net:ERROR This will be recorded.
   [nunit2] 
   [nunit2] /home/jenkins/jenkins-slave/workspace/log4net_feature_cd-pipeline-76KUCPODUF6LCE45226EBUR4GNVLYPMYVC23Z4ITBOMNJT3CA2WA/tests/nant.build(828,10):
   [nunit2] Tests Failed.

BUILD SUCCEEDED - 1 non-fatal error(s), 0 warning(s)

Total time: 20 seconds.

[Pipeline] stash
Stashed 1 file(s)
[Pipeline] }
$ docker stop --time=1 9f48c3e2f50fee0f293785d7a0250763163e22066c1ff8663ba6b9ca5d0ee425
$ docker rm -f 9f48c3e2f50fee0f293785d7a0250763163e22066c1ff8663ba6b9ca5d0ee425
[Pipeline] // withDockerContainer
[Pipeline] }
[Pipeline] // stage
[Pipeline] stage
[Pipeline] { (build netstandard)
[Pipeline] getContext
[Pipeline] readFile
[Pipeline] sh
[log4net_feature_cd-pipeline-76KUCPODUF6LCE45226EBUR4GNVLYPMYVC23Z4ITBOMNJT3CA2WA] Running shell script
+ docker build -t 220643b688e1e37454b379682087ec420123d257 -f buildtools/docker/builder-netstandard/Dockerfile buildtools/docker/builder-netstandard
Sending build context to Docker daemon 2.048 kB
Step 1/3 : FROM microsoft/dotnet
 ---> ab1dcd1a2496
Step 2/3 : MAINTAINER "dev@logging.apache.org"
 ---> Using cache
 ---> 1a392e603f49
Step 3/3 : RUN apt-get update && apt-get install -y nant git
 ---> Using cache
 ---> 67e2a492c30d
Successfully built 67e2a492c30d
[Pipeline] dockerFingerprintFrom
[Pipeline] sh
[log4net_feature_cd-pipeline-76KUCPODUF6LCE45226EBUR4GNVLYPMYVC23Z4ITBOMNJT3CA2WA] Running shell script
+ docker inspect -f . 220643b688e1e37454b379682087ec420123d257
.
[Pipeline] withDockerContainer
H22 does not seem to be running inside a container
$ docker run -t -d -u 10025:12040 -e HOME=/home/jenkins -e USER=jenkins -w /home/jenkins/jenkins-slave/workspace/log4net_feature_cd-pipeline-76KUCPODUF6LCE45226EBUR4GNVLYPMYVC23Z4ITBOMNJT3CA2WA -v /home/jenkins/jenkins-slave/workspace/log4net_feature_cd-pipeline-76KUCPODUF6LCE45226EBUR4GNVLYPMYVC23Z4ITBOMNJT3CA2WA:/home/jenkins/jenkins-slave/workspace/log4net_feature_cd-pipeline-76KUCPODUF6LCE45226EBUR4GNVLYPMYVC23Z4ITBOMNJT3CA2WA:rw -v /home/jenkins/jenkins-slave/workspace/log4net_feature_cd-pipeline-76KUCPODUF6LCE45226EBUR4GNVLYPMYVC23Z4ITBOMNJT3CA2WA@tmp:/home/jenkins/jenkins-slave/workspace/log4net_feature_cd-pipeline-76KUCPODUF6LCE45226EBUR4GNVLYPMYVC23Z4ITBOMNJT3CA2WA@tmp:rw -e ******** -e ******** -e ******** -e ******** -e ******** -e ******** -e ******** -e ******** -e ******** -e ******** -e ******** -e ******** -e ******** -e ******** -e ******** -e ******** -e ******** -e ******** -e ******** -e ******** -e ******** -e ******** -e ******** --entrypoint cat 220643b688e1e37454b379682087ec420123d257
[Pipeline] {
[Pipeline] sh
[log4net_feature_cd-pipeline-76KUCPODUF6LCE45226EBUR4GNVLYPMYVC23Z4ITBOMNJT3CA2WA] Running shell script
+ rm -rf bin/ tests/
[Pipeline] checkout
 > git rev-parse --is-inside-work-tree # timeout=10
Fetching changes from 2 remote Git repositories
 > git config remote.origin.url https://github.com/apache/logging-log4net.git # timeout=10
Fetching upstream changes from https://github.com/apache/logging-log4net.git
 > git --version # timeout=10
using GIT_ASKPASS to set credentials dpsenner at github
 > git fetch --tags --progress https://github.com/apache/logging-log4net.git +refs/heads/*:refs/remotes/origin/*
 > git config remote.origin1.url https://github.com/apache/logging-log4net.git # timeout=10
Fetching upstream changes from https://github.com/apache/logging-log4net.git
using GIT_ASKPASS to set credentials dpsenner at github
 > git fetch --tags --progress https://github.com/apache/logging-log4net.git +refs/pull/*/head:refs/remotes/origin/pr/*
Checking out Revision 02121d3610696fbc9bc8c2d0cced9bc899a7dc86 (feature/cd-pipeline)
 > git config core.sparsecheckout # timeout=10
 > git checkout -f 02121d3610696fbc9bc8c2d0cced9bc899a7dc86
[Pipeline] sh
[log4net_feature_cd-pipeline-76KUCPODUF6LCE45226EBUR4GNVLYPMYVC23Z4ITBOMNJT3CA2WA] Running shell script
+ nant compile-netstandard
NAnt 0.92 (Build 0.92.4526.0; rc1; 05/23/2012)
Copyright (C) 2001-2012 Gerry Shaw
http://nant.sourceforge.net

Buildfile: file:///home/jenkins/jenkins-slave/workspace/log4net_feature_cd-pipeline-76KUCPODUF6LCE45226EBUR4GNVLYPMYVC23Z4ITBOMNJT3CA2WA/log4net.build
Target framework: Mono 4.0 Profile
Target(s) specified: compile-netstandard 


check-current-build-config:


set-build-configuration:


set-debug-build-configuration:


check-current-build-config:


set-build-configuration-flags:


compile-netstandard:


set-debug-build-configuration:


check-current-build-config:


set-build-configuration-flags:


compile-netstandard-current-configuration:

     [exec] 1.0.4
     [exec] /usr/share/dotnet/sdk/1.0.4/NuGet.targets(97,5): error : Failed to read NuGet.Config due to unauthorized access. Path: '/home/jenkins/.nuget/NuGet/NuGet.Config'. [/home/jenkins/jenkins-slave/workspace/log4net_feature_cd-pipeline-76KUCPODUF6LCE45226EBUR4GNVLYPMYVC23Z4ITBOMNJT3CA2WA/netstandard/log4net.netstandard.sln]
     [exec] /usr/share/dotnet/sdk/1.0.4/NuGet.targets(97,5): error :   Access to the path '/home/jenkins/.nuget/NuGet' is denied. [/home/jenkins/jenkins-slave/workspace/log4net_feature_cd-pipeline-76KUCPODUF6LCE45226EBUR4GNVLYPMYVC23Z4ITBOMNJT3CA2WA/netstandard/log4net.netstandard.sln]
     [exec] /usr/share/dotnet/sdk/1.0.4/NuGet.targets(97,5): error :   Permission denied [/home/jenkins/jenkins-slave/workspace/log4net_feature_cd-pipeline-76KUCPODUF6LCE45226EBUR4GNVLYPMYVC23Z4ITBOMNJT3CA2WA/netstandard/log4net.netstandard.sln]

BUILD FAILED

/home/jenkins/jenkins-slave/workspace/log4net_feature_cd-pipeline-76KUCPODUF6LCE45226EBUR4GNVLYPMYVC23Z4ITBOMNJT3CA2WA/log4net.build(2016,8):
External Program Failed: dotnet (return code was 1)

Total time: 2.5 seconds.

[Pipeline] }
$ docker stop --time=1 b471112145ee5d24acf7771163695548aaeb37600b5545554906be1a48a30d47
$ docker rm -f b471112145ee5d24acf7771163695548aaeb37600b5545554906be1a48a30d47
[Pipeline] // withDockerContainer
[Pipeline] }
[Pipeline] // stage
[Pipeline] stage
[Pipeline] { (build site)
Stage 'build site' skipped due to earlier failure(s)
[Pipeline] }
[Pipeline] // stage
[Pipeline] stage
[Pipeline] { (prepare package)
Stage 'prepare package' skipped due to earlier failure(s)
[Pipeline] }
[Pipeline] // stage
[Pipeline] stage
[Pipeline] { (check test results)
Stage 'check test results' skipped due to earlier failure(s)
[Pipeline] }
[Pipeline] // stage
[Pipeline] stage
[Pipeline] { (publish site)
Stage 'publish site' skipped due to earlier failure(s)
[Pipeline] }
[Pipeline] // stage
[Pipeline] stage
[Pipeline] { (Declarative: Post Actions)