You are viewing a plain text version of this content. The canonical link for it is here.
Posted to dev@qpid.apache.org by "Aidan Skinner (JIRA)" <qp...@incubator.apache.org> on 2008/04/24 14:49:21 UTC

[jira] Created: (QPID-964) CombinedTest.testForwardAll fails

CombinedTest.testForwardAll fails
---------------------------------

                 Key: QPID-964
                 URL: https://issues.apache.org/jira/browse/QPID-964
             Project: Qpid
          Issue Type: Bug
          Components: Java Client, Java Tests
    Affects Versions: M3
            Reporter: Aidan Skinner
             Fix For: M3


Fails when run against a 0-10 broker 

Didn't receive all messages... got 0 expected 1

java.lang.Exception: Didn't receive all messages... got 0 expected 1
at org.apache.qpid.test.unit.client.forwardall.Client.waitUntilComplete(Client.java:106)
at org.apache.qpid.test.unit.client.forwardall.Client.shutdownWhenComplete(Client.java:80)
at org.apache.qpid.test.unit.client.forwardall.CombinedTest.testForwardAll(CombinedTest.java:59)
at org.apache.qpid.testutil.QpidTestCase.runBare(QpidTestCase.java:131)
at org.apache.qpid.testutil.QpidTestCase.run(QpidTestCase.java:157)

-- 
This message is automatically generated by JIRA.
-
You can reply to this email to add a comment to the issue online.


[jira] Resolved: (QPID-964) CombinedTest.testForwardAll fails

Posted by "Aidan Skinner (JIRA)" <qp...@incubator.apache.org>.
     [ https://issues.apache.org/jira/browse/QPID-964?page=com.atlassian.jira.plugin.system.issuetabpanels:all-tabpanel ]

Aidan Skinner resolved QPID-964.
--------------------------------

    Resolution: Fixed
      Assignee: Aidan Skinner

> CombinedTest.testForwardAll fails
> ---------------------------------
>
>                 Key: QPID-964
>                 URL: https://issues.apache.org/jira/browse/QPID-964
>             Project: Qpid
>          Issue Type: Bug
>          Components: Java Client, Java Tests
>    Affects Versions: M3
>            Reporter: Aidan Skinner
>            Assignee: Aidan Skinner
>             Fix For: M3
>
>
> Fails when run against a 0-10 broker 
> Didn't receive all messages... got 0 expected 1
> java.lang.Exception: Didn't receive all messages... got 0 expected 1
> at org.apache.qpid.test.unit.client.forwardall.Client.waitUntilComplete(Client.java:106)
> at org.apache.qpid.test.unit.client.forwardall.Client.shutdownWhenComplete(Client.java:80)
> at org.apache.qpid.test.unit.client.forwardall.CombinedTest.testForwardAll(CombinedTest.java:59)
> at org.apache.qpid.testutil.QpidTestCase.runBare(QpidTestCase.java:131)
> at org.apache.qpid.testutil.QpidTestCase.run(QpidTestCase.java:157)

-- 
This message is automatically generated by JIRA.
-
You can reply to this email to add a comment to the issue online.


[jira] Commented: (QPID-964) CombinedTest.testForwardAll fails

Posted by "Senaka Fernando (JIRA)" <qp...@incubator.apache.org>.
    [ https://issues.apache.org/jira/browse/QPID-964?page=com.atlassian.jira.plugin.system.issuetabpanels:comment-tabpanel&focusedCommentId=12592786#action_12592786 ] 

Senaka Fernando commented on QPID-964:
--------------------------------------

Hi Aidan,

On Ubuntu 7.10 I get,

Running org.apache.qpid.test.unit.client.forwardall.CombinedTest
Tests run: 1, Failures: 0, Errors: 0, Skipped: 0, Time elapsed: 0.231 sec

revision: 651431

Regards,
Senaka

> CombinedTest.testForwardAll fails
> ---------------------------------
>
>                 Key: QPID-964
>                 URL: https://issues.apache.org/jira/browse/QPID-964
>             Project: Qpid
>          Issue Type: Bug
>          Components: Java Client, Java Tests
>    Affects Versions: M3
>            Reporter: Aidan Skinner
>             Fix For: M3
>
>
> Fails when run against a 0-10 broker 
> Didn't receive all messages... got 0 expected 1
> java.lang.Exception: Didn't receive all messages... got 0 expected 1
> at org.apache.qpid.test.unit.client.forwardall.Client.waitUntilComplete(Client.java:106)
> at org.apache.qpid.test.unit.client.forwardall.Client.shutdownWhenComplete(Client.java:80)
> at org.apache.qpid.test.unit.client.forwardall.CombinedTest.testForwardAll(CombinedTest.java:59)
> at org.apache.qpid.testutil.QpidTestCase.runBare(QpidTestCase.java:131)
> at org.apache.qpid.testutil.QpidTestCase.run(QpidTestCase.java:157)

-- 
This message is automatically generated by JIRA.
-
You can reply to this email to add a comment to the issue online.