You are viewing a plain text version of this content. The canonical link for it is here.
Posted to notifications@maven.apache.org by Apache Jenkins Server <je...@builds.apache.org> on 2018/12/17 21:48:27 UTC
Build unstable in Jenkins: Maven TLP » maven-javadoc-plugin » MJAVADOC-134 #1
See https://builds.apache.org/job/maven-box/job/maven-javadoc-plugin/job/MJAVADOC-134/1/
No changes.
28 tests failed.
FAILED: org.apache.maven.plugins.javadoc.AggregatorJavadocReportTest.testAggregateJavadocResources
Error Message:
null
Stack Trace:
junit.framework.AssertionFailedError
at org.apache.maven.plugins.javadoc.AggregatorJavadocReportTest.testAggregateJavadocResources(AggregatorJavadocReportTest.java:245)
FAILED: org.apache.maven.plugins.javadoc.AggregatorJavadocReportTest.testAggregate
Error Message:
null
Stack Trace:
junit.framework.AssertionFailedError
at org.apache.maven.plugins.javadoc.AggregatorJavadocReportTest.testAggregate(AggregatorJavadocReportTest.java:208)
FAILED: org.apache.maven.plugins.javadoc.AggregatorJavadocReportTest.testAggregateJavadocResources
Error Message:
null
Stack Trace:
junit.framework.AssertionFailedError
at org.apache.maven.plugins.javadoc.AggregatorJavadocReportTest.testAggregateJavadocResources(AggregatorJavadocReportTest.java:245)
FAILED: org.apache.maven.plugins.javadoc.AggregatorJavadocReportTest.testAggregate
Error Message:
null
Stack Trace:
junit.framework.AssertionFailedError
at org.apache.maven.plugins.javadoc.AggregatorJavadocReportTest.testAggregate(AggregatorJavadocReportTest.java:208)
FAILED: org.apache.maven.plugins.javadoc.AggregatorJavadocReportTest.testAggregateJavadocResources
Error Message:
null
Stack Trace:
junit.framework.AssertionFailedError
at org.apache.maven.plugins.javadoc.AggregatorJavadocReportTest.testAggregateJavadocResources(AggregatorJavadocReportTest.java:245)
FAILED: org.apache.maven.plugins.javadoc.AggregatorJavadocReportTest.testAggregate
Error Message:
null
Stack Trace:
junit.framework.AssertionFailedError
at org.apache.maven.plugins.javadoc.AggregatorJavadocReportTest.testAggregate(AggregatorJavadocReportTest.java:208)
FAILED: org.apache.maven.plugins.javadoc.AggregatorJavadocReportTest.testAggregateJavadocResources
Error Message:
null
Stack Trace:
junit.framework.AssertionFailedError
at org.apache.maven.plugins.javadoc.AggregatorJavadocReportTest.testAggregateJavadocResources(AggregatorJavadocReportTest.java:245)
FAILED: org.apache.maven.plugins.javadoc.AggregatorJavadocReportTest.testAggregate
Error Message:
null
Stack Trace:
junit.framework.AssertionFailedError
at org.apache.maven.plugins.javadoc.AggregatorJavadocReportTest.testAggregate(AggregatorJavadocReportTest.java:208)
FAILED: org.apache.maven.plugins.javadoc.AggregatorJavadocReportTest.testAggregateJavadocResources
Error Message:
null
Stack Trace:
junit.framework.AssertionFailedError
at org.apache.maven.plugins.javadoc.AggregatorJavadocReportTest.testAggregateJavadocResources(AggregatorJavadocReportTest.java:245)
FAILED: org.apache.maven.plugins.javadoc.AggregatorJavadocReportTest.testAggregate
Error Message:
null
Stack Trace:
junit.framework.AssertionFailedError
at org.apache.maven.plugins.javadoc.AggregatorJavadocReportTest.testAggregate(AggregatorJavadocReportTest.java:208)
FAILED: org.apache.maven.plugins.javadoc.AggregatorJavadocReportTest.testAggregateJavadocResources
Error Message:
null
Stack Trace:
junit.framework.AssertionFailedError
at org.apache.maven.plugins.javadoc.AggregatorJavadocReportTest.testAggregateJavadocResources(AggregatorJavadocReportTest.java:245)
FAILED: org.apache.maven.plugins.javadoc.AggregatorJavadocReportTest.testAggregate
Error Message:
null
Stack Trace:
junit.framework.AssertionFailedError
at org.apache.maven.plugins.javadoc.AggregatorJavadocReportTest.testAggregate(AggregatorJavadocReportTest.java:208)
FAILED: org.apache.maven.plugins.javadoc.AggregatorJavadocReportTest.testAggregateJavadocResources
Error Message:
null
Stack Trace:
junit.framework.AssertionFailedError
at org.apache.maven.plugins.javadoc.AggregatorJavadocReportTest.testAggregateJavadocResources(AggregatorJavadocReportTest.java:245)
FAILED: org.apache.maven.plugins.javadoc.AggregatorJavadocReportTest.testAggregate
Error Message:
null
Stack Trace:
junit.framework.AssertionFailedError
at org.apache.maven.plugins.javadoc.AggregatorJavadocReportTest.testAggregate(AggregatorJavadocReportTest.java:208)
FAILED: org.apache.maven.plugins.javadoc.AggregatorJavadocReportTest.testAggregateJavadocResources
Error Message:
null
Stack Trace:
junit.framework.AssertionFailedError
at org.apache.maven.plugins.javadoc.AggregatorJavadocReportTest.testAggregateJavadocResources(AggregatorJavadocReportTest.java:245)
FAILED: org.apache.maven.plugins.javadoc.AggregatorJavadocReportTest.testAggregate
Error Message:
null
Stack Trace:
junit.framework.AssertionFailedError
at org.apache.maven.plugins.javadoc.AggregatorJavadocReportTest.testAggregate(AggregatorJavadocReportTest.java:208)
FAILED: org.apache.maven.plugins.javadoc.AggregatorJavadocReportTest.testAggregateJavadocResources
Error Message:
null
Stack Trace:
junit.framework.AssertionFailedError
at org.apache.maven.plugins.javadoc.AggregatorJavadocReportTest.testAggregateJavadocResources(AggregatorJavadocReportTest.java:245)
FAILED: org.apache.maven.plugins.javadoc.AggregatorJavadocReportTest.testAggregate
Error Message:
null
Stack Trace:
junit.framework.AssertionFailedError
at org.apache.maven.plugins.javadoc.AggregatorJavadocReportTest.testAggregate(AggregatorJavadocReportTest.java:208)
FAILED: org.apache.maven.plugins.javadoc.AggregatorJavadocReportTest.testAggregateJavadocResources
Error Message:
null
Stack Trace:
junit.framework.AssertionFailedError
at org.apache.maven.plugins.javadoc.AggregatorJavadocReportTest.testAggregateJavadocResources(AggregatorJavadocReportTest.java:245)
FAILED: org.apache.maven.plugins.javadoc.AggregatorJavadocReportTest.testAggregate
Error Message:
null
Stack Trace:
junit.framework.AssertionFailedError
at org.apache.maven.plugins.javadoc.AggregatorJavadocReportTest.testAggregate(AggregatorJavadocReportTest.java:208)
FAILED: org.apache.maven.plugins.javadoc.AggregatorJavadocReportTest.testAggregateJavadocResources
Error Message:
null
Stack Trace:
junit.framework.AssertionFailedError
at org.apache.maven.plugins.javadoc.AggregatorJavadocReportTest.testAggregateJavadocResources(AggregatorJavadocReportTest.java:245)
FAILED: org.apache.maven.plugins.javadoc.AggregatorJavadocReportTest.testAggregate
Error Message:
null
Stack Trace:
junit.framework.AssertionFailedError
at org.apache.maven.plugins.javadoc.AggregatorJavadocReportTest.testAggregate(AggregatorJavadocReportTest.java:208)
FAILED: org.apache.maven.plugins.javadoc.AggregatorJavadocReportTest.testAggregateJavadocResources
Error Message:
null
Stack Trace:
junit.framework.AssertionFailedError
at org.apache.maven.plugins.javadoc.AggregatorJavadocReportTest.testAggregateJavadocResources(AggregatorJavadocReportTest.java:245)
FAILED: org.apache.maven.plugins.javadoc.AggregatorJavadocReportTest.testAggregate
Error Message:
null
Stack Trace:
junit.framework.AssertionFailedError
at org.apache.maven.plugins.javadoc.AggregatorJavadocReportTest.testAggregate(AggregatorJavadocReportTest.java:208)
FAILED: org.apache.maven.plugins.javadoc.AggregatorJavadocReportTest.testAggregateJavadocResources
Error Message:
null
Stack Trace:
junit.framework.AssertionFailedError
at org.apache.maven.plugins.javadoc.AggregatorJavadocReportTest.testAggregateJavadocResources(AggregatorJavadocReportTest.java:245)
FAILED: org.apache.maven.plugins.javadoc.AggregatorJavadocReportTest.testAggregate
Error Message:
null
Stack Trace:
junit.framework.AssertionFailedError
at org.apache.maven.plugins.javadoc.AggregatorJavadocReportTest.testAggregate(AggregatorJavadocReportTest.java:208)
FAILED: org.apache.maven.plugins.javadoc.AggregatorJavadocReportTest.testAggregateJavadocResources
Error Message:
null
Stack Trace:
junit.framework.AssertionFailedError
at org.apache.maven.plugins.javadoc.AggregatorJavadocReportTest.testAggregateJavadocResources(AggregatorJavadocReportTest.java:245)
FAILED: org.apache.maven.plugins.javadoc.AggregatorJavadocReportTest.testAggregate
Error Message:
null
Stack Trace:
junit.framework.AssertionFailedError
at org.apache.maven.plugins.javadoc.AggregatorJavadocReportTest.testAggregate(AggregatorJavadocReportTest.java:208)
Build log:
[...truncated 6.39 MB...]
[windows-jdk11-m3.5.x_build] [INFO] Downloaded from central: https://repo.maven.apache.org/maven2/org/codehaus/plexus/plexus-resources/1.1.0/plexus-resources-1.1.0.jar (23 kB at 83 kB/s)
[windows-jdk11-m3.5.x_build] [INFO] Downloaded from central: https://repo.maven.apache.org/maven2/com/google/guava/guava/19.0/guava-19.0.jar (2.3 MB at 7.8 MB/s)
[windows-jdk11-m3.5.x_build] [INFO] Downloaded from central: https://repo.maven.apache.org/maven2/javax/xml/bind/jaxb-api/2.3.0/jaxb-api-2.3.0.jar (126 kB at 383 kB/s)
[windows-jdk11-m3.5.x_build] [INFO] Downloaded from central: https://repo.maven.apache.org/maven2/org/apache/maven/doxia/doxia-integration-tools/1.6/doxia-integration-tools-1.6.jar (45 kB at 136 kB/s)
[windows-jdk11-m3.5.x_build] [INFO] There are 4 errors reported by Checkstyle 6.18 with config/maven_checks.xml ruleset.
[windows-jdk11-m3.5.x_build] [INFO] Ignored 4 errors, 0 violation remaining.
[windows-jdk11-m3.5.x_build] [INFO]
[windows-jdk11-m3.5.x_build] [INFO] --- maven-invoker-plugin:3.1.0:verify (integration-test) @ maven-javadoc-plugin ---
[windows-jdk11-m3.5.x_build] [INFO] -------------------------------------------------
[windows-jdk11-m3.5.x_build] [INFO] Build Summary:
[windows-jdk11-m3.5.x_build] [INFO] Passed: 44, Failed: 0, Errors: 0, Skipped: 1
[windows-jdk11-m3.5.x_build] [INFO] -------------------------------------------------
[windows-jdk11-m3.5.x_build] [INFO] ------------------------------------------------------------------------
[windows-jdk11-m3.5.x_build] [INFO] BUILD SUCCESS
[windows-jdk11-m3.5.x_build] [INFO] ------------------------------------------------------------------------
[windows-jdk11-m3.5.x_build] [INFO] Total time: 17:13 min
[windows-jdk11-m3.5.x_build] [INFO] Finished at: 2018-12-17T13:45:54-08:00
[windows-jdk11-m3.5.x_build] [INFO] Final Memory: 56M/190M
[windows-jdk11-m3.5.x_build] [INFO] ------------------------------------------------------------------------
[windows-jdk11-m3.5.x_build] [INFO] [jenkins-event-spy] Generated F:\jenkins\jenkins-slave\workspace\javadoc-plugin_MJAVADOC-134-WD2D35IKVL5AMZLDC76FJ2W2EJ7GUMKGGBRPVZ3UA52MWCOJCPHA@2@tmp\withMavencbc495b0\maven-spy-20181217-132840-3477807604667801724525.log
[Pipeline] [linux-jdk7-m3.2.x_build] }
[Pipeline] [linux-jdk7-m3.3.x_build] }
[Pipeline] [windows-jdk7-m3.3.x_build] }
[windows-jdk7-m3.3.x_build] [withMaven] artifactsPublisher - Archive artifact windows-jdk7-m3.3.x_build\pom.xml under org\apache\maven\plugins\maven-javadoc-plugin\3.0.2-SNAPSHOT\maven-javadoc-plugin-3.0.2-SNAPSHOT.pom
[windows-jdk7-m3.3.x_build] [withMaven] artifactsPublisher - Archive artifact windows-jdk7-m3.3.x_build\target\maven-javadoc-plugin-3.0.2-SNAPSHOT.jar under org\apache\maven\plugins\maven-javadoc-plugin\3.0.2-SNAPSHOT\maven-javadoc-plugin-3.0.2-SNAPSHOT.jar
[windows-jdk7-m3.3.x_build] [Fast Archiver] No prior successful build to compare, so performing full copy of artifacts
[windows-jdk7-m3.3.x_build] [withMaven] invokerPublisher - Archive invoker results for Maven artifact MavenArtifact{org.apache.maven.plugins:maven-javadoc-plugin::3.0.2-SNAPSHOT(version: 3.0.2-SNAPSHOT, snapshot:false) } generated by PluginInvocation{org.apache.maven.plugins:maven-invoker-plugin:3.1.0@integration-test integration-test}: windows-jdk7-m3.3.x_build\target\invoker-reports\*.xml
[windows-jdk7-m3.3.x_build] performing MavenInvokerRecorder, reportsFilenamePattern:'**/windows-jdk7-m3.3.x_build\target\invoker-reports/BUILD*.xml', invokerBuildDir:'**/windows-jdk7-m3.3.x_build\target\it'
[windows-jdk7-m3.3.x_build] Found reports:[f:\jenkins\jenkins-slave\workspace\javadoc-plugin_MJAVADOC-134-WD2D35IKVL5AMZLDC76FJ2W2EJ7GUMKGGBRPVZ3UA52MWCOJCPHA@3\windows-jdk7-m3.3.x_build\target\invoker-reports\BUILD-MJAVADOC-110.xml, f:\jenkins\jenkins-slave\workspace\javadoc-plugin_MJAVADOC-134-WD2D35IKVL5AMZLDC76FJ2W2EJ7GUMKGGBRPVZ3UA52MWCOJCPHA@3\windows-jdk7-m3.3.x_build\target\invoker-reports\BUILD-MJAVADOC-126.xml, f:\jenkins\jenkins-slave\workspace\javadoc-plugin_MJAVADOC-134-WD2D35IKVL5AMZLDC76FJ2W2EJ7GUMKGGBRPVZ3UA52MWCOJCPHA@3\windows-jdk7-m3.3.x_build\target\invoker-reports\BUILD-MJAVADOC-134_multiaggregate.xml, f:\jenkins\jenkins-slave\workspace\javadoc-plugin_MJAVADOC-134-WD2D35IKVL5AMZLDC76FJ2W2EJ7GUMKGGBRPVZ3UA52MWCOJCPHA@3\windows-jdk7-m3.3.x_build\target\invoker-reports\BUILD-MJAVADOC-137.xml, f:\jenkins\jenkins-slave\workspace\javadoc-plugin_MJAVADOC-134-WD2D35IKVL5AMZLDC76FJ2W2EJ7GUMKGGBRPVZ3UA52MWCOJCPHA@3\windows-jdk7-m3.3.x_build\target\invoker-reports\BUILD-MJAVADOC-172.xml, f:\jenkins\jenkins-slave\workspace\javadoc-plugin_MJAVADOC-134-WD2D35IKVL5AMZLDC76FJ2W2EJ7GUMKGGBRPVZ3UA52MWCOJCPHA@3\windows-jdk7-m3.3.x_build\target\invoker-reports\BUILD-MJAVADOC-180.xml, f:\jenkins\jenkins-slave\workspace\javadoc-plugin_MJAVADOC-134-WD2D35IKVL5AMZLDC76FJ2W2EJ7GUMKGGBRPVZ3UA52MWCOJCPHA@3\windows-jdk7-m3.3.x_build\target\invoker-reports\BUILD-MJAVADOC-194.xml, f:\jenkins\jenkins-slave\workspace\javadoc-plugin_MJAVADOC-134-WD2D35IKVL5AMZLDC76FJ2W2EJ7GUMKGGBRPVZ3UA52MWCOJCPHA@3\windows-jdk7-m3.3.x_build\target\invoker-reports\BUILD-MJAVADOC-250.xml, f:\jenkins\jenkins-slave\workspace\javadoc-plugin_MJAVADOC-134-WD2D35IKVL5AMZLDC76FJ2W2EJ7GUMKGGBRPVZ3UA52MWCOJCPHA@3\windows-jdk7-m3.3.x_build\target\invoker-reports\BUILD-MJAVADOC-257.xml, f:\jenkins\jenkins-slave\workspace\javadoc-plugin_MJAVADOC-134-WD2D35IKVL5AMZLDC76FJ2W2EJ7GUMKGGBRPVZ3UA52MWCOJCPHA@3\windows-jdk7-m3.3.x_build\target\invoker-reports\BUILD-MJAVADOC-259.xml, f:\jenkins\jenkins-slave\workspace\javadoc-plugin_MJAVADOC-134-WD2D35IKVL5AMZLDC76FJ2W2EJ7GUMKGGBRPVZ3UA52MWCOJCPHA@3\windows-jdk7-m3.3.x_build\target\invoker-reports\BUILD-MJAVADOC-262.xml, f:\jenkins\jenkins-slave\workspace\javadoc-plugin_MJAVADOC-134-WD2D35IKVL5AMZLDC76FJ2W2EJ7GUMKGGBRPVZ3UA52MWCOJCPHA@3\windows-jdk7-m3.3.x_build\target\invoker-reports\BUILD-MJAVADOC-275.xml, f:\jenkins\jenkins-slave\workspace\javadoc-plugin_MJAVADOC-134-WD2D35IKVL5AMZLDC76FJ2W2EJ7GUMKGGBRPVZ3UA52MWCOJCPHA@3\windows-jdk7-m3.3.x_build\target\invoker-reports\BUILD-MJAVADOC-278.xml, f:\jenkins\jenkins-slave\workspace\javadoc-plugin_MJAVADOC-134-WD2D35IKVL5AMZLDC76FJ2W2EJ7GUMKGGBRPVZ3UA52MWCOJCPHA@3\windows-jdk7-m3.3.x_build\target\invoker-reports\BUILD-MJAVADOC-320.xml, f:\jenkins\jenkins-slave\workspace\javadoc-plugin_MJAVADOC-134-WD2D35IKVL5AMZLDC76FJ2W2EJ7GUMKGGBRPVZ3UA52MWCOJCPHA@3\windows-jdk7-m3.3.x_build\target\invoker-reports\BUILD-MJAVADOC-325.xml, f:\jenkins\jenkins-slave\workspace\javadoc-plugin_MJAVADOC-134-WD2D35IKVL5AMZLDC76FJ2W2EJ7GUMKGGBRPVZ3UA52MWCOJCPHA@3\windows-jdk7-m3.3.x_build\target\invoker-reports\BUILD-MJAVADOC-365.xml, f:\jenkins\jenkins-slave\workspace\javadoc-plugin_MJAVADOC-134-WD2D35IKVL5AMZLDC76FJ2W2EJ7GUMKGGBRPVZ3UA52MWCOJCPHA@3\windows-jdk7-m3.3.x_build\target\invoker-reports\BUILD-MJAVADOC-369.xml, f:\jenkins\jenkins-slave\workspace\javadoc-plugin_MJAVADOC-134-WD2D35IKVL5AMZLDC76FJ2W2EJ7GUMKGGBRPVZ3UA52MWCOJCPHA@3\windows-jdk7-m3.3.x_build\target\invoker-reports\BUILD-MJAVADOC-384.xml, f:\jenkins\jenkins-slave\workspace\javadoc-plugin_MJAVADOC-134-WD2D35IKVL5AMZLDC76FJ2W2EJ7GUMKGGBRPVZ3UA52MWCOJCPHA@3\windows-jdk7-m3.3.x_build\target\invoker-reports\BUILD-MJAVADOC-407.xml, f:\jenkins\jenkins-slave\workspace\javadoc-plugin_MJAVADOC-134-WD2D35IKVL5AMZLDC76FJ2W2EJ7GUMKGGBRPVZ3UA52MWCOJCPHA@3\windows-jdk7-m3.3.x_build\target\invoker-reports\BUILD-MJAVADOC-414.xml, f:\jenkins\jenkins-slave\workspace\javadoc-plugin_MJAVADOC-134-WD2D35IKVL5AMZLDC76FJ2W2EJ7GUMKGGBRPVZ3UA52MWCOJCPHA@3\windows-jdk7-m3.3.x_build\target\invoker-reports\BUILD-MJAVADOC-420_fixparam.xml, f:\jenkins\jenkins-slave\workspace\javadoc-plugin_MJAVADOC-134-WD2D35IKVL5AMZLDC76FJ2W2EJ7GUMKGGBRPVZ3UA52MWCOJCPHA@3\windows-jdk7-m3.3.x_build\target\invoker-reports\BUILD-MJAVADOC-427.xml, f:\jenkins\jenkins-slave\workspace\javadoc-plugin_MJAVADOC-134-WD2D35IKVL5AMZLDC76FJ2W2EJ7GUMKGGBRPVZ3UA52MWCOJCPHA@3\windows-jdk7-m3.3.x_build\target\invoker-reports\BUILD-MJAVADOC-434_fixcompile.xml, f:\jenkins\jenkins-slave\workspace\javadoc-plugin_MJAVADOC-134-WD2D35IKVL5AMZLDC76FJ2W2EJ7GUMKGGBRPVZ3UA52MWCOJCPHA@3\windows-jdk7-m3.3.x_build\target\invoker-reports\BUILD-MJAVADOC-437.xml, f:\jenkins\jenkins-slave\workspace\javadoc-plugin_MJAVADOC-134-WD2D35IKVL5AMZLDC76FJ2W2EJ7GUMKGGBRPVZ3UA52MWCOJCPHA@3\windows-jdk7-m3.3.x_build\target\invoker-reports\BUILD-MJAVADOC-449_aggr_modulepath.xml, f:\jenkins\jenkins-slave\workspace\javadoc-plugin_MJAVADOC-134-WD2D35IKVL5AMZLDC76FJ2W2EJ7GUMKGGBRPVZ3UA52MWCOJCPHA@3\windows-jdk7-m3.3.x_build\target\invoker-reports\BUILD-MJAVADOC-494_aggregate-repositories.xml, f:\jenkins\jenkins-slave\workspace\javadoc-plugin_MJAVADOC-134-WD2D35IKVL5AMZLDC76FJ2W2EJ7GUMKGGBRPVZ3UA52MWCOJCPHA@3\windows-jdk7-m3.3.x_build\target\invoker-reports\BUILD-MJAVADOC-495_offline-filescheme.xml, f:\jenkins\jenkins-slave\workspace\javadoc-plugin_MJAVADOC-134-WD2D35IKVL5AMZLDC76FJ2W2EJ7GUMKGGBRPVZ3UA52MWCOJCPHA@3\windows-jdk7-m3.3.x_build\target\invoker-reports\BUILD-MJAVADOC-497.xml, f:\jenkins\jenkins-slave\workspace\javadoc-plugin_MJAVADOC-134-WD2D35IKVL5AMZLDC76FJ2W2EJ7GUMKGGBRPVZ3UA52MWCOJCPHA@3\windows-jdk7-m3.3.x_build\target\invoker-reports\BUILD-MJAVADOC-498_aggr_modulepath.xml, f:\jenkins\jenkins-slave\workspace\javadoc-plugin_MJAVADOC-134-WD2D35IKVL5AMZLDC76FJ2W2EJ7GUMKGGBRPVZ3UA52MWCOJCPHA@3\windows-jdk7-m3.3.x_build\target\invoker-reports\BUILD-MJAVADOC-498_mm_modulepath.xml, f:\jenkins\jenkins-slave\workspace\javadoc-plugin_MJAVADOC-134-WD2D35IKVL5AMZLDC76FJ2W2EJ7GUMKGGBRPVZ3UA52MWCOJCPHA@3\windows-jdk7-m3.3.x_build\target\invoker-reports\BUILD-MJAVADOC-498_modulepath.xml, f:\jenkins\jenkins-slave\workspace\javadoc-plugin_MJAVADOC-134-WD2D35IKVL5AMZLDC76FJ2W2EJ7GUMKGGBRPVZ3UA52MWCOJCPHA@3\windows-jdk7-m3.3.x_build\target\invoker-reports\BUILD-MJAVADOC-506_excl-module-info.xml, f:\jenkins\jenkins-slave\workspace\javadoc-plugin_MJAVADOC-134-WD2D35IKVL5AMZLDC76FJ2W2EJ7GUMKGGBRPVZ3UA52MWCOJCPHA@3\windows-jdk7-m3.3.x_build\target\invoker-reports\BUILD-MJAVADOC-508.xml, f:\jenkins\jenkins-slave\workspace\javadoc-plugin_MJAVADOC-134-WD2D35IKVL5AMZLDC76FJ2W2EJ7GUMKGGBRPVZ3UA52MWCOJCPHA@3\windows-jdk7-m3.3.x_build\target\invoker-reports\BUILD-MJAVADOC-514_3rdparty-doclettags.xml, f:\jenkins\jenkins-slave\workspace\javadoc-plugin_MJAVADOC-134-WD2D35IKVL5AMZLDC76FJ2W2EJ7GUMKGGBRPVZ3UA52MWCOJCPHA@3\windows-jdk7-m3.3.x_build\target\invoker-reports\BUILD-MJAVADOC-528.xml, f:\jenkins\jenkins-slave\workspace\javadoc-plugin_MJAVADOC-134-WD2D35IKVL5AMZLDC76FJ2W2EJ7GUMKGGBRPVZ3UA52MWCOJCPHA@3\windows-jdk7-m3.3.x_build\target\invoker-reports\BUILD-MJAVADOC-538.xml, f:\jenkins\jenkins-slave\workspace\javadoc-plugin_MJAVADOC-134-WD2D35IKVL5AMZLDC76FJ2W2EJ7GUMKGGBRPVZ3UA52MWCOJCPHA@3\windows-jdk7-m3.3.x_build\target\invoker-reports\BUILD-additional-dependencies-non-aggregate.xml, f:\jenkins\jenkins-slave\workspace\javadoc-plugin_MJAVADOC-134-WD2D35IKVL5AMZLDC76FJ2W2EJ7GUMKGGBRPVZ3UA52MWCOJCPHA@3\windows-jdk7-m3.3.x_build\target\invoker-reports\BUILD-additional-dependencies.xml, f:\jenkins\jenkins-slave\workspace\javadoc-plugin_MJAVADOC-134-WD2D35IKVL5AMZLDC76FJ2W2EJ7GUMKGGBRPVZ3UA52MWCOJCPHA@3\windows-jdk7-m3.3.x_build\target\invoker-reports\BUILD-dependencySource-1.xml, f:\jenkins\jenkins-slave\workspace\javadoc-plugin_MJAVADOC-134-WD2D35IKVL5AMZLDC76FJ2W2EJ7GUMKGGBRPVZ3UA52MWCOJCPHA@3\windows-jdk7-m3.3.x_build\target\invoker-reports\BUILD-dependencySource-2.xml, f:\jenkins\jenkins-slave\workspace\javadoc-plugin_MJAVADOC-134-WD2D35IKVL5AMZLDC76FJ2W2EJ7GUMKGGBRPVZ3UA52MWCOJCPHA@3\windows-jdk7-m3.3.x_build\target\invoker-reports\BUILD-dependencySource-3.xml, f:\jenkins\jenkins-slave\workspace\javadoc-plugin_MJAVADOC-134-WD2D35IKVL5AMZLDC76FJ2W2EJ7GUMKGGBRPVZ3UA52MWCOJCPHA@3\windows-jdk7-m3.3.x_build\target\invoker-reports\BUILD-dependencySource-4.xml, f:\jenkins\jenkins-slave\workspace\javadoc-plugin_MJAVADOC-134-WD2D35IKVL5AMZLDC76FJ2W2EJ7GUMKGGBRPVZ3UA52MWCOJCPHA@3\windows-jdk7-m3.3.x_build\target\invoker-reports\BUILD-detectLinks.xml, f:\jenkins\jenkins-slave\workspace\javadoc-plugin_MJAVADOC-134-WD2D35IKVL5AMZLDC76FJ2W2EJ7GUMKGGBRPVZ3UA52MWCOJCPHA@3\windows-jdk7-m3.3.x_build\target\invoker-reports\BUILD-javadoc-fix.xml, f:\jenkins\jenkins-slave\workspace\javadoc-plugin_MJAVADOC-134-WD2D35IKVL5AMZLDC76FJ2W2EJ7GUMKGGBRPVZ3UA52MWCOJCPHA@3\windows-jdk7-m3.3.x_build\target\invoker-reports\BUILD-site-failOnError.xml]
[windows-jdk7-m3.3.x_build] Found logs:[f:\jenkins\jenkins-slave\workspace\javadoc-plugin_MJAVADOC-134-WD2D35IKVL5AMZLDC76FJ2W2EJ7GUMKGGBRPVZ3UA52MWCOJCPHA@3\windows-jdk7-m3.3.x_build\target\it\MJAVADOC-110\build.log, f:\jenkins\jenkins-slave\workspace\javadoc-plugin_MJAVADOC-134-WD2D35IKVL5AMZLDC76FJ2W2EJ7GUMKGGBRPVZ3UA52MWCOJCPHA@3\windows-jdk7-m3.3.x_build\target\it\MJAVADOC-126\build.log, f:\jenkins\jenkins-slave\workspace\javadoc-plugin_MJAVADOC-134-WD2D35IKVL5AMZLDC76FJ2W2EJ7GUMKGGBRPVZ3UA52MWCOJCPHA@3\windows-jdk7-m3.3.x_build\target\it\MJAVADOC-134_multiaggregate\build.log, f:\jenkins\jenkins-slave\workspace\javadoc-plugin_MJAVADOC-134-WD2D35IKVL5AMZLDC76FJ2W2EJ7GUMKGGBRPVZ3UA52MWCOJCPHA@3\windows-jdk7-m3.3.x_build\target\it\MJAVADOC-137\build.log, f:\jenkins\jenkins-slave\workspace\javadoc-plugin_MJAVADOC-134-WD2D35IKVL5AMZLDC76FJ2W2EJ7GUMKGGBRPVZ3UA52MWCOJCPHA@3\windows-jdk7-m3.3.x_build\target\it\MJAVADOC-172\build.log, f:\jenkins\jenkins-slave\workspace\javadoc-plugin_MJAVADOC-134-WD2D35IKVL5AMZLDC76FJ2W2EJ7GUMKGGBRPVZ3UA52MWCOJCPHA@3\windows-jdk7-m3.3.x_build\target\it\MJAVADOC-180\build.log, f:\jenkins\jenkins-slave\workspace\javadoc-plugin_MJAVADOC-134-WD2D35IKVL5AMZLDC76FJ2W2EJ7GUMKGGBRPVZ3UA52MWCOJCPHA@3\windows-jdk7-m3.3.x_build\target\it\MJAVADOC-194\build.log, f:\jenkins\jenkins-slave\workspace\javadoc-plugin_MJAVADOC-134-WD2D35IKVL5AMZLDC76FJ2W2EJ7GUMKGGBRPVZ3UA52MWCOJCPHA@3\windows-jdk7-m3.3.x_build\target\it\MJAVADOC-250\build.log, f:\jenkins\jenkins-slave\workspace\javadoc-plugin_MJAVADOC-134-WD2D35IKVL5AMZLDC76FJ2W2EJ7GUMKGGBRPVZ3UA52MWCOJCPHA@3\windows-jdk7-m3.3.x_build\target\it\MJAVADOC-257\build.log, f:\jenkins\jenkins-slave\workspace\javadoc-plugin_MJAVADOC-134-WD2D35IKVL5AMZLDC76FJ2W2EJ7GUMKGGBRPVZ3UA52MWCOJCPHA@3\windows-jdk7-m3.3.x_build\target\it\MJAVADOC-259\build.log, f:\jenkins\jenkins-slave\workspace\javadoc-plugin_MJAVADOC-134-WD2D35IKVL5AMZLDC76FJ2W2EJ7GUMKGGBRPVZ3UA52MWCOJCPHA@3\windows-jdk7-m3.3.x_build\target\it\MJAVADOC-262\build.log, f:\jenkins\jenkins-slave\workspace\javadoc-plugin_MJAVADOC-134-WD2D35IKVL5AMZLDC76FJ2W2EJ7GUMKGGBRPVZ3UA52MWCOJCPHA@3\windows-jdk7-m3.3.x_build\target\it\MJAVADOC-275\build.log, f:\jenkins\jenkins-slave\workspace\javadoc-plugin_MJAVADOC-134-WD2D35IKVL5AMZLDC76FJ2W2EJ7GUMKGGBRPVZ3UA52MWCOJCPHA@3\windows-jdk7-m3.3.x_build\target\it\MJAVADOC-278\build.log, f:\jenkins\jenkins-slave\workspace\javadoc-plugin_MJAVADOC-134-WD2D35IKVL5AMZLDC76FJ2W2EJ7GUMKGGBRPVZ3UA52MWCOJCPHA@3\windows-jdk7-m3.3.x_build\target\it\MJAVADOC-320\build.log, f:\jenkins\jenkins-slave\workspace\javadoc-plugin_MJAVADOC-134-WD2D35IKVL5AMZLDC76FJ2W2EJ7GUMKGGBRPVZ3UA52MWCOJCPHA@3\windows-jdk7-m3.3.x_build\target\it\MJAVADOC-325\build.log, f:\jenkins\jenkins-slave\workspace\javadoc-plugin_MJAVADOC-134-WD2D35IKVL5AMZLDC76FJ2W2EJ7GUMKGGBRPVZ3UA52MWCOJCPHA@3\windows-jdk7-m3.3.x_build\target\it\MJAVADOC-365\build.log, f:\jenkins\jenkins-slave\workspace\javadoc-plugin_MJAVADOC-134-WD2D35IKVL5AMZLDC76FJ2W2EJ7GUMKGGBRPVZ3UA52MWCOJCPHA@3\windows-jdk7-m3.3.x_build\target\it\MJAVADOC-369\build.log, f:\jenkins\jenkins-slave\workspace\javadoc-plugin_MJAVADOC-134-WD2D35IKVL5AMZLDC76FJ2W2EJ7GUMKGGBRPVZ3UA52MWCOJCPHA@3\windows-jdk7-m3.3.x_build\target\it\MJAVADOC-384\build.log, f:\jenkins\jenkins-slave\workspace\javadoc-plugin_MJAVADOC-134-WD2D35IKVL5AMZLDC76FJ2W2EJ7GUMKGGBRPVZ3UA52MWCOJCPHA@3\windows-jdk7-m3.3.x_build\target\it\MJAVADOC-407\build.log, f:\jenkins\jenkins-slave\workspace\javadoc-plugin_MJAVADOC-134-WD2D35IKVL5AMZLDC76FJ2W2EJ7GUMKGGBRPVZ3UA52MWCOJCPHA@3\windows-jdk7-m3.3.x_build\target\it\MJAVADOC-414\build.log, f:\jenkins\jenkins-slave\workspace\javadoc-plugin_MJAVADOC-134-WD2D35IKVL5AMZLDC76FJ2W2EJ7GUMKGGBRPVZ3UA52MWCOJCPHA@3\windows-jdk7-m3.3.x_build\target\it\MJAVADOC-420_fixparam\build.log, f:\jenkins\jenkins-slave\workspace\javadoc-plugin_MJAVADOC-134-WD2D35IKVL5AMZLDC76FJ2W2EJ7GUMKGGBRPVZ3UA52MWCOJCPHA@3\windows-jdk7-m3.3.x_build\target\it\MJAVADOC-434_fixcompile\build.log, f:\jenkins\jenkins-slave\workspace\javadoc-plugin_MJAVADOC-134-WD2D35IKVL5AMZLDC76FJ2W2EJ7GUMKGGBRPVZ3UA52MWCOJCPHA@3\windows-jdk7-m3.3.x_build\target\it\MJAVADOC-437\build.log, f:\jenkins\jenkins-slave\workspace\javadoc-plugin_MJAVADOC-134-WD2D35IKVL5AMZLDC76FJ2W2EJ7GUMKGGBRPVZ3UA52MWCOJCPHA@3\windows-jdk7-m3.3.x_build\target\it\MJAVADOC-494_aggregate-repositories\build.log, f:\jenkins\jenkins-slave\workspace\javadoc-plugin_MJAVADOC-134-WD2D35IKVL5AMZLDC76FJ2W2EJ7GUMKGGBRPVZ3UA52MWCOJCPHA@3\windows-jdk7-m3.3.x_build\target\it\MJAVADOC-495_offline-filescheme\build.log, f:\jenkins\jenkins-slave\workspace\javadoc-plugin_MJAVADOC-134-WD2D35IKVL5AMZLDC76FJ2W2EJ7GUMKGGBRPVZ3UA52MWCOJCPHA@3\windows-jdk7-m3.3.x_build\target\it\MJAVADOC-497\build.log, f:\jenkins\jenkins-slave\workspace\javadoc-plugin_MJAVADOC-134-WD2D35IKVL5AMZLDC76FJ2W2EJ7GUMKGGBRPVZ3UA52MWCOJCPHA@3\windows-jdk7-m3.3.x_build\target\it\MJAVADOC-506_excl-module-info\build.log, f:\jenkins\jenkins-slave\workspace\javadoc-plugin_MJAVADOC-134-WD2D35IKVL5AMZLDC76FJ2W2EJ7GUMKGGBRPVZ3UA52MWCOJCPHA@3\windows-jdk7-m3.3.x_build\target\it\MJAVADOC-508\build.log, f:\jenkins\jenkins-slave\workspace\javadoc-plugin_MJAVADOC-134-WD2D35IKVL5AMZLDC76FJ2W2EJ7GUMKGGBRPVZ3UA52MWCOJCPHA@3\windows-jdk7-m3.3.x_build\target\it\MJAVADOC-514_3rdparty-doclettags\build.log, f:\jenkins\jenkins-slave\workspace\javadoc-plugin_MJAVADOC-134-WD2D35IKVL5AMZLDC76FJ2W2EJ7GUMKGGBRPVZ3UA52MWCOJCPHA@3\windows-jdk7-m3.3.x_build\target\it\MJAVADOC-528\build.log, f:\jenkins\jenkins-slave\workspace\javadoc-plugin_MJAVADOC-134-WD2D35IKVL5AMZLDC76FJ2W2EJ7GUMKGGBRPVZ3UA52MWCOJCPHA@3\windows-jdk7-m3.3.x_build\target\it\MJAVADOC-538\build.log, f:\jenkins\jenkins-slave\workspace\javadoc-plugin_MJAVADOC-134-WD2D35IKVL5AMZLDC76FJ2W2EJ7GUMKGGBRPVZ3UA52MWCOJCPHA@3\windows-jdk7-m3.3.x_build\target\it\additional-dependencies-non-aggregate\build.log, f:\jenkins\jenkins-slave\workspace\javadoc-plugin_MJAVADOC-134-WD2D35IKVL5AMZLDC76FJ2W2EJ7GUMKGGBRPVZ3UA52MWCOJCPHA@3\windows-jdk7-m3.3.x_build\target\it\additional-dependencies\build.log, f:\jenkins\jenkins-slave\workspace\javadoc-plugin_MJAVADOC-134-WD2D35IKVL5AMZLDC76FJ2W2EJ7GUMKGGBRPVZ3UA52MWCOJCPHA@3\windows-jdk7-m3.3.x_build\target\it\dependencySource-1\build.log, f:\jenkins\jenkins-slave\workspace\javadoc-plugin_MJAVADOC-134-WD2D35IKVL5AMZLDC76FJ2W2EJ7GUMKGGBRPVZ3UA52MWCOJCPHA@3\windows-jdk7-m3.3.x_build\target\it\dependencySource-2\build.log, f:\jenkins\jenkins-slave\workspace\javadoc-plugin_MJAVADOC-134-WD2D35IKVL5AMZLDC76FJ2W2EJ7GUMKGGBRPVZ3UA52MWCOJCPHA@3\windows-jdk7-m3.3.x_build\target\it\dependencySource-3\build.log, f:\jenkins\jenkins-slave\workspace\javadoc-plugin_MJAVADOC-134-WD2D35IKVL5AMZLDC76FJ2W2EJ7GUMKGGBRPVZ3UA52MWCOJCPHA@3\windows-jdk7-m3.3.x_build\target\it\dependencySource-4\build.log, f:\jenkins\jenkins-slave\workspace\javadoc-plugin_MJAVADOC-134-WD2D35IKVL5AMZLDC76FJ2W2EJ7GUMKGGBRPVZ3UA52MWCOJCPHA@3\windows-jdk7-m3.3.x_build\target\it\detectLinks\build.log, f:\jenkins\jenkins-slave\workspace\javadoc-plugin_MJAVADOC-134-WD2D35IKVL5AMZLDC76FJ2W2EJ7GUMKGGBRPVZ3UA52MWCOJCPHA@3\windows-jdk7-m3.3.x_build\target\it\javadoc-fix\build.log, f:\jenkins\jenkins-slave\workspace\javadoc-plugin_MJAVADOC-134-WD2D35IKVL5AMZLDC76FJ2W2EJ7GUMKGGBRPVZ3UA52MWCOJCPHA@3\windows-jdk7-m3.3.x_build\target\it\site-failOnError\build.log]
[windows-jdk7-m3.3.x_build] Finished parsing Maven Invoker results (found 45)
[windows-jdk7-m3.3.x_build] [withMaven] junitPublisher - Archive test results for Maven artifact org.apache.maven.plugins:maven-javadoc-plugin:3.0.2-SNAPSHOT generated by maven-surefire-plugin:test (default-test): windows-jdk7-m3.3.x_build\target\surefire-reports\*.xml
[windows-jdk7-m3.3.x_build] Recording test results
[windows-jdk7-m3.3.x_build] [withMaven] openTasksPublisher - Scan Tasks for Maven artifact org.apache.maven.plugins:maven-javadoc-plugin:3.0.2-SNAPSHOT in source directory windows-jdk7-m3.3.x_build\src\main\java
[windows-jdk7-m3.3.x_build] [TASKS] Scanning folder 'f:\jenkins\jenkins-slave\workspace\javadoc-plugin_MJAVADOC-134-WD2D35IKVL5AMZLDC76FJ2W2EJ7GUMKGGBRPVZ3UA52MWCOJCPHA@3' for files matching the pattern 'windows-jdk7-m3.3.x_build\src\main\java\**\*' - excludes: null
[windows-jdk7-m3.3.x_build] [TASKS] Found 24 files to scan for tasks
[windows-jdk7-m3.3.x_build] [TASKS] Found 7 open tasks.
[windows-jdk7-m3.3.x_build] Skipping warnings blame since pipelines do not have an SCM link.%n
[Pipeline] [linux-jdk10-m3.5.x_build] }
[linux-jdk10-m3.5.x_build] [withMaven] artifactsPublisher - Archive artifact linux-jdk10-m3.5.x_build/pom.xml under org/apache/maven/plugins/maven-javadoc-plugin/3.0.2-SNAPSHOT/maven-javadoc-plugin-3.0.2-SNAPSHOT.pom
[linux-jdk10-m3.5.x_build] [withMaven] artifactsPublisher - Archive artifact linux-jdk10-m3.5.x_build/target/maven-javadoc-plugin-3.0.2-SNAPSHOT.jar under org/apache/maven/plugins/maven-javadoc-plugin/3.0.2-SNAPSHOT/maven-javadoc-plugin-3.0.2-SNAPSHOT.jar
[linux-jdk10-m3.5.x_build] [Fast Archiver] No prior successful build to compare, so performing full copy of artifacts
[linux-jdk10-m3.5.x_build] [withMaven] invokerPublisher - Archive invoker results for Maven artifact MavenArtifact{org.apache.maven.plugins:maven-javadoc-plugin::3.0.2-SNAPSHOT(version: 3.0.2-SNAPSHOT, snapshot:false) } generated by PluginInvocation{org.apache.maven.plugins:maven-invoker-plugin:3.1.0@integration-test integration-test}: linux-jdk10-m3.5.x_build/target/invoker-reports/*.xml
[linux-jdk10-m3.5.x_build] performing MavenInvokerRecorder, reportsFilenamePattern:'**/linux-jdk10-m3.5.x_build/target/invoker-reports/BUILD*.xml', invokerBuildDir:'**/linux-jdk10-m3.5.x_build/target/it'
[linux-jdk10-m3.5.x_build] Found reports:[/home/jenkins/jenkins-slave/workspace/javadoc-plugin_MJAVADOC-134-WD2D35IKVL5AMZLDC76FJ2W2EJ7GUMKGGBRPVZ3UA52MWCOJCPHA@2/linux-jdk10-m3.5.x_build/target/invoker-reports/BUILD-MJAVADOC-110.xml, /home/jenkins/jenkins-slave/workspace/javadoc-plugin_MJAVADOC-134-WD2D35IKVL5AMZLDC76FJ2W2EJ7GUMKGGBRPVZ3UA52MWCOJCPHA@2/linux-jdk10-m3.5.x_build/target/invoker-reports/BUILD-MJAVADOC-126.xml, /home/jenkins/jenkins-slave/workspace/javadoc-plugin_MJAVADOC-134-WD2D35IKVL5AMZLDC76FJ2W2EJ7GUMKGGBRPVZ3UA52MWCOJCPHA@2/linux-jdk10-m3.5.x_build/target/invoker-reports/BUILD-MJAVADOC-134_multiaggregate.xml, /home/jenkins/jenkins-slave/workspace/javadoc-plugin_MJAVADOC-134-WD2D35IKVL5AMZLDC76FJ2W2EJ7GUMKGGBRPVZ3UA52MWCOJCPHA@2/linux-jdk10-m3.5.x_build/target/invoker-reports/BUILD-MJAVADOC-137.xml, /home/jenkins/jenkins-slave/workspace/javadoc-plugin_MJAVADOC-134-WD2D35IKVL5AMZLDC76FJ2W2EJ7GUMKGGBRPVZ3UA52MWCOJCPHA@2/linux-jdk10-m3.5.x_build/target/invoker-reports/BUILD-MJAVADOC-172.xml, /home/jenkins/jenkins-slave/workspace/javadoc-plugin_MJAVADOC-134-WD2D35IKVL5AMZLDC76FJ2W2EJ7GUMKGGBRPVZ3UA52MWCOJCPHA@2/linux-jdk10-m3.5.x_build/target/invoker-reports/BUILD-MJAVADOC-180.xml, /home/jenkins/jenkins-slave/workspace/javadoc-plugin_MJAVADOC-134-WD2D35IKVL5AMZLDC76FJ2W2EJ7GUMKGGBRPVZ3UA52MWCOJCPHA@2/linux-jdk10-m3.5.x_build/target/invoker-reports/BUILD-MJAVADOC-194.xml, /home/jenkins/jenkins-slave/workspace/javadoc-plugin_MJAVADOC-134-WD2D35IKVL5AMZLDC76FJ2W2EJ7GUMKGGBRPVZ3UA52MWCOJCPHA@2/linux-jdk10-m3.5.x_build/target/invoker-reports/BUILD-MJAVADOC-250.xml, /home/jenkins/jenkins-slave/workspace/javadoc-plugin_MJAVADOC-134-WD2D35IKVL5AMZLDC76FJ2W2EJ7GUMKGGBRPVZ3UA52MWCOJCPHA@2/linux-jdk10-m3.5.x_build/target/invoker-reports/BUILD-MJAVADOC-257.xml, /home/jenkins/jenkins-slave/workspace/javadoc-plugin_MJAVADOC-134-WD2D35IKVL5AMZLDC76FJ2W2EJ7GUMKGGBRPVZ3UA52MWCOJCPHA@2/linux-jdk10-m3.5.x_build/target/invoker-reports/BUILD-MJAVADOC-259.xml, /home/jenkins/jenkins-slave/workspace/javadoc-plugin_MJAVADOC-134-WD2D35IKVL5AMZLDC76FJ2W2EJ7GUMKGGBRPVZ3UA52MWCOJCPHA@2/linux-jdk10-m3.5.x_build/target/invoker-reports/BUILD-MJAVADOC-262.xml, /home/jenkins/jenkins-slave/workspace/javadoc-plugin_MJAVADOC-134-WD2D35IKVL5AMZLDC76FJ2W2EJ7GUMKGGBRPVZ3UA52MWCOJCPHA@2/linux-jdk10-m3.5.x_build/target/invoker-reports/BUILD-MJAVADOC-275.xml, /home/jenkins/jenkins-slave/workspace/javadoc-plugin_MJAVADOC-134-WD2D35IKVL5AMZLDC76FJ2W2EJ7GUMKGGBRPVZ3UA52MWCOJCPHA@2/linux-jdk10-m3.5.x_build/target/invoker-reports/BUILD-MJAVADOC-278.xml, /home/jenkins/jenkins-slave/workspace/javadoc-plugin_MJAVADOC-134-WD2D35IKVL5AMZLDC76FJ2W2EJ7GUMKGGBRPVZ3UA52MWCOJCPHA@2/linux-jdk10-m3.5.x_build/target/invoker-reports/BUILD-MJAVADOC-320.xml, /home/jenkins/jenkins-slave/workspace/javadoc-plugin_MJAVADOC-134-WD2D35IKVL5AMZLDC76FJ2W2EJ7GUMKGGBRPVZ3UA52MWCOJCPHA@2/linux-jdk10-m3.5.x_build/target/invoker-reports/BUILD-MJAVADOC-325.xml, /home/jenkins/jenkins-slave/workspace/javadoc-plugin_MJAVADOC-134-WD2D35IKVL5AMZLDC76FJ2W2EJ7GUMKGGBRPVZ3UA52MWCOJCPHA@2/linux-jdk10-m3.5.x_build/target/invoker-reports/BUILD-MJAVADOC-365.xml, /home/jenkins/jenkins-slave/workspace/javadoc-plugin_MJAVADOC-134-WD2D35IKVL5AMZLDC76FJ2W2EJ7GUMKGGBRPVZ3UA52MWCOJCPHA@2/linux-jdk10-m3.5.x_build/target/invoker-reports/BUILD-MJAVADOC-369.xml, /home/jenkins/jenkins-slave/workspace/javadoc-plugin_MJAVADOC-134-WD2D35IKVL5AMZLDC76FJ2W2EJ7GUMKGGBRPVZ3UA52MWCOJCPHA@2/linux-jdk10-m3.5.x_build/target/invoker-reports/BUILD-MJAVADOC-384.xml, /home/jenkins/jenkins-slave/workspace/javadoc-plugin_MJAVADOC-134-WD2D35IKVL5AMZLDC76FJ2W2EJ7GUMKGGBRPVZ3UA52MWCOJCPHA@2/linux-jdk10-m3.5.x_build/target/invoker-reports/BUILD-MJAVADOC-407.xml, /home/jenkins/jenkins-slave/workspace/javadoc-plugin_MJAVADOC-134-WD2D35IKVL5AMZLDC76FJ2W2EJ7GUMKGGBRPVZ3UA52MWCOJCPHA@2/linux-jdk10-m3.5.x_build/target/invoker-reports/BUILD-MJAVADOC-414.xml, /home/jenkins/jenkins-slave/workspace/javadoc-plugin_MJAVADOC-134-WD2D35IKVL5AMZLDC76FJ2W2EJ7GUMKGGBRPVZ3UA52MWCOJCPHA@2/linux-jdk10-m3.5.x_build/target/invoker-reports/BUILD-MJAVADOC-420_fixparam.xml, /home/jenkins/jenkins-slave/workspace/javadoc-plugin_MJAVADOC-134-WD2D35IKVL5AMZLDC76FJ2W2EJ7GUMKGGBRPVZ3UA52MWCOJCPHA@2/linux-jdk10-m3.5.x_build/target/invoker-reports/BUILD-MJAVADOC-427.xml, /home/jenkins/jenkins-slave/workspace/javadoc-plugin_MJAVADOC-134-WD2D35IKVL5AMZLDC76FJ2W2EJ7GUMKGGBRPVZ3UA52MWCOJCPHA@2/linux-jdk10-m3.5.x_build/target/invoker-reports/BUILD-MJAVADOC-434_fixcompile.xml, /home/jenkins/jenkins-slave/workspace/javadoc-plugin_MJAVADOC-134-WD2D35IKVL5AMZLDC76FJ2W2EJ7GUMKGGBRPVZ3UA52MWCOJCPHA@2/linux-jdk10-m3.5.x_build/target/invoker-reports/BUILD-MJAVADOC-437.xml, /home/jenkins/jenkins-slave/workspace/javadoc-plugin_MJAVADOC-134-WD2D35IKVL5AMZLDC76FJ2W2EJ7GUMKGGBRPVZ3UA52MWCOJCPHA@2/linux-jdk10-m3.5.x_build/target/invoker-reports/BUILD-MJAVADOC-449_aggr_modulepath.xml, /home/jenkins/jenkins-slave/workspace/javadoc-plugin_MJAVADOC-134-WD2D35IKVL5AMZLDC76FJ2W2EJ7GUMKGGBRPVZ3UA52MWCOJCPHA@2/linux-jdk10-m3.5.x_build/target/invoker-reports/BUILD-MJAVADOC-494_aggregate-repositories.xml, /home/jenkins/jenkins-slave/workspace/javadoc-plugin_MJAVADOC-134-WD2D35IKVL5AMZLDC76FJ2W2EJ7GUMKGGBRPVZ3UA52MWCOJCPHA@2/linux-jdk10-m3.5.x_build/target/invoker-reports/BUILD-MJAVADOC-495_offline-filescheme.xml, /home/jenkins/jenkins-slave/workspace/javadoc-plugin_MJAVADOC-134-WD2D35IKVL5AMZLDC76FJ2W2EJ7GUMKGGBRPVZ3UA52MWCOJCPHA@2/linux-jdk10-m3.5.x_build/target/invoker-reports/BUILD-MJAVADOC-497.xml, /home/jenkins/jenkins-slave/workspace/javadoc-plugin_MJAVADOC-134-WD2D35IKVL5AMZLDC76FJ2W2EJ7GUMKGGBRPVZ3UA52MWCOJCPHA@2/linux-jdk10-m3.5.x_build/target/invoker-reports/BUILD-MJAVADOC-498_aggr_modulepath.xml, /home/jenkins/jenkins-slave/workspace/javadoc-plugin_MJAVADOC-134-WD2D35IKVL5AMZLDC76FJ2W2EJ7GUMKGGBRPVZ3UA52MWCOJCPHA@2/linux-jdk10-m3.5.x_build/target/invoker-reports/BUILD-MJAVADOC-498_mm_modulepath.xml, /home/jenkins/jenkins-slave/workspace/javadoc-plugin_MJAVADOC-134-WD2D35IKVL5AMZLDC76FJ2W2EJ7GUMKGGBRPVZ3UA52MWCOJCPHA@2/linux-jdk10-m3.5.x_build/target/invoker-reports/BUILD-MJAVADOC-498_modulepath.xml, /home/jenkins/jenkins-slave/workspace/javadoc-plugin_MJAVADOC-134-WD2D35IKVL5AMZLDC76FJ2W2EJ7GUMKGGBRPVZ3UA52MWCOJCPHA@2/linux-jdk10-m3.5.x_build/target/invoker-reports/BUILD-MJAVADOC-506_excl-module-info.xml, /home/jenkins/jenkins-slave/workspace/javadoc-plugin_MJAVADOC-134-WD2D35IKVL5AMZLDC76FJ2W2EJ7GUMKGGBRPVZ3UA52MWCOJCPHA@2/linux-jdk10-m3.5.x_build/target/invoker-reports/BUILD-MJAVADOC-508.xml, /home/jenkins/jenkins-slave/workspace/javadoc-plugin_MJAVADOC-134-WD2D35IKVL5AMZLDC76FJ2W2EJ7GUMKGGBRPVZ3UA52MWCOJCPHA@2/linux-jdk10-m3.5.x_build/target/invoker-reports/BUILD-MJAVADOC-514_3rdparty-doclettags.xml, /home/jenkins/jenkins-slave/workspace/javadoc-plugin_MJAVADOC-134-WD2D35IKVL5AMZLDC76FJ2W2EJ7GUMKGGBRPVZ3UA52MWCOJCPHA@2/linux-jdk10-m3.5.x_build/target/invoker-reports/BUILD-MJAVADOC-528.xml, /home/jenkins/jenkins-slave/workspace/javadoc-plugin_MJAVADOC-134-WD2D35IKVL5AMZLDC76FJ2W2EJ7GUMKGGBRPVZ3UA52MWCOJCPHA@2/linux-jdk10-m3.5.x_build/target/invoker-reports/BUILD-MJAVADOC-538.xml, /home/jenkins/jenkins-slave/workspace/javadoc-plugin_MJAVADOC-134-WD2D35IKVL5AMZLDC76FJ2W2EJ7GUMKGGBRPVZ3UA52MWCOJCPHA@2/linux-jdk10-m3.5.x_build/target/invoker-reports/BUILD-additional-dependencies-non-aggregate.xml, /home/jenkins/jenkins-slave/workspace/javadoc-plugin_MJAVADOC-134-WD2D35IKVL5AMZLDC76FJ2W2EJ7GUMKGGBRPVZ3UA52MWCOJCPHA@2/linux-jdk10-m3.5.x_build/target/invoker-reports/BUILD-additional-dependencies.xml, /home/jenkins/jenkins-slave/workspace/javadoc-plugin_MJAVADOC-134-WD2D35IKVL5AMZLDC76FJ2W2EJ7GUMKGGBRPVZ3UA52MWCOJCPHA@2/linux-jdk10-m3.5.x_build/target/invoker-reports/BUILD-dependencySource-1.xml, /home/jenkins/jenkins-slave/workspace/javadoc-plugin_MJAVADOC-134-WD2D35IKVL5AMZLDC76FJ2W2EJ7GUMKGGBRPVZ3UA52MWCOJCPHA@2/linux-jdk10-m3.5.x_build/target/invoker-reports/BUILD-dependencySource-2.xml, /home/jenkins/jenkins-slave/workspace/javadoc-plugin_MJAVADOC-134-WD2D35IKVL5AMZLDC76FJ2W2EJ7GUMKGGBRPVZ3UA52MWCOJCPHA@2/linux-jdk10-m3.5.x_build/target/invoker-reports/BUILD-dependencySource-3.xml, /home/jenkins/jenkins-slave/workspace/javadoc-plugin_MJAVADOC-134-WD2D35IKVL5AMZLDC76FJ2W2EJ7GUMKGGBRPVZ3UA52MWCOJCPHA@2/linux-jdk10-m3.5.x_build/target/invoker-reports/BUILD-dependencySource-4.xml, /home/jenkins/jenkins-slave/workspace/javadoc-plugin_MJAVADOC-134-WD2D35IKVL5AMZLDC76FJ2W2EJ7GUMKGGBRPVZ3UA52MWCOJCPHA@2/linux-jdk10-m3.5.x_build/target/invoker-reports/BUILD-detectLinks.xml, /home/jenkins/jenkins-slave/workspace/javadoc-plugin_MJAVADOC-134-WD2D35IKVL5AMZLDC76FJ2W2EJ7GUMKGGBRPVZ3UA52MWCOJCPHA@2/linux-jdk10-m3.5.x_build/target/invoker-reports/BUILD-javadoc-fix.xml, /home/jenkins/jenkins-slave/workspace/javadoc-plugin_MJAVADOC-134-WD2D35IKVL5AMZLDC76FJ2W2EJ7GUMKGGBRPVZ3UA52MWCOJCPHA@2/linux-jdk10-m3.5.x_build/target/invoker-reports/BUILD-site-failOnError.xml]
[linux-jdk10-m3.5.x_build] Found logs:[/home/jenkins/jenkins-slave/workspace/javadoc-plugin_MJAVADOC-134-WD2D35IKVL5AMZLDC76FJ2W2EJ7GUMKGGBRPVZ3UA52MWCOJCPHA@2/linux-jdk10-m3.5.x_build/target/it/MJAVADOC-110/build.log, /home/jenkins/jenkins-slave/workspace/javadoc-plugin_MJAVADOC-134-WD2D35IKVL5AMZLDC76FJ2W2EJ7GUMKGGBRPVZ3UA52MWCOJCPHA@2/linux-jdk10-m3.5.x_build/target/it/MJAVADOC-126/build.log, /home/jenkins/jenkins-slave/workspace/javadoc-plugin_MJAVADOC-134-WD2D35IKVL5AMZLDC76FJ2W2EJ7GUMKGGBRPVZ3UA52MWCOJCPHA@2/linux-jdk10-m3.5.x_build/target/it/MJAVADOC-134_multiaggregate/build.log, /home/jenkins/jenkins-slave/workspace/javadoc-plugin_MJAVADOC-134-WD2D35IKVL5AMZLDC76FJ2W2EJ7GUMKGGBRPVZ3UA52MWCOJCPHA@2/linux-jdk10-m3.5.x_build/target/it/MJAVADOC-137/build.log, /home/jenkins/jenkins-slave/workspace/javadoc-plugin_MJAVADOC-134-WD2D35IKVL5AMZLDC76FJ2W2EJ7GUMKGGBRPVZ3UA52MWCOJCPHA@2/linux-jdk10-m3.5.x_build/target/it/MJAVADOC-172/build.log, /home/jenkins/jenkins-slave/workspace/javadoc-plugin_MJAVADOC-134-WD2D35IKVL5AMZLDC76FJ2W2EJ7GUMKGGBRPVZ3UA52MWCOJCPHA@2/linux-jdk10-m3.5.x_build/target/it/MJAVADOC-180/build.log, /home/jenkins/jenkins-slave/workspace/javadoc-plugin_MJAVADOC-134-WD2D35IKVL5AMZLDC76FJ2W2EJ7GUMKGGBRPVZ3UA52MWCOJCPHA@2/linux-jdk10-m3.5.x_build/target/it/MJAVADOC-194/build.log, /home/jenkins/jenkins-slave/workspace/javadoc-plugin_MJAVADOC-134-WD2D35IKVL5AMZLDC76FJ2W2EJ7GUMKGGBRPVZ3UA52MWCOJCPHA@2/linux-jdk10-m3.5.x_build/target/it/MJAVADOC-250/build.log, /home/jenkins/jenkins-slave/workspace/javadoc-plugin_MJAVADOC-134-WD2D35IKVL5AMZLDC76FJ2W2EJ7GUMKGGBRPVZ3UA52MWCOJCPHA@2/linux-jdk10-m3.5.x_build/target/it/MJAVADOC-259/build.log, /home/jenkins/jenkins-slave/workspace/javadoc-plugin_MJAVADOC-134-WD2D35IKVL5AMZLDC76FJ2W2EJ7GUMKGGBRPVZ3UA52MWCOJCPHA@2/linux-jdk10-m3.5.x_build/target/it/MJAVADOC-262/build.log, /home/jenkins/jenkins-slave/workspace/javadoc-plugin_MJAVADOC-134-WD2D35IKVL5AMZLDC76FJ2W2EJ7GUMKGGBRPVZ3UA52MWCOJCPHA@2/linux-jdk10-m3.5.x_build/target/it/MJAVADOC-275/build.log, /home/jenkins/jenkins-slave/workspace/javadoc-plugin_MJAVADOC-134-WD2D35IKVL5AMZLDC76FJ2W2EJ7GUMKGGBRPVZ3UA52MWCOJCPHA@2/linux-jdk10-m3.5.x_build/target/it/MJAVADOC-278/build.log, /home/jenkins/jenkins-slave/workspace/javadoc-plugin_MJAVADOC-134-WD2D35IKVL5AMZLDC76FJ2W2EJ7GUMKGGBRPVZ3UA52MWCOJCPHA@2/linux-jdk10-m3.5.x_build/target/it/MJAVADOC-320/build.log, /home/jenkins/jenkins-slave/workspace/javadoc-plugin_MJAVADOC-134-WD2D35IKVL5AMZLDC76FJ2W2EJ7GUMKGGBRPVZ3UA52MWCOJCPHA@2/linux-jdk10-m3.5.x_build/target/it/MJAVADOC-325/build.log, /home/jenkins/jenkins-slave/workspace/javadoc-plugin_MJAVADOC-134-WD2D35IKVL5AMZLDC76FJ2W2EJ7GUMKGGBRPVZ3UA52MWCOJCPHA@2/linux-jdk10-m3.5.x_build/target/it/MJAVADOC-365/build.log, /home/jenkins/jenkins-slave/workspace/javadoc-plugin_MJAVADOC-134-WD2D35IKVL5AMZLDC76FJ2W2EJ7GUMKGGBRPVZ3UA52MWCOJCPHA@2/linux-jdk10-m3.5.x_build/target/it/MJAVADOC-369/build.log, /home/jenkins/jenkins-slave/workspace/javadoc-plugin_MJAVADOC-134-WD2D35IKVL5AMZLDC76FJ2W2EJ7GUMKGGBRPVZ3UA52MWCOJCPHA@2/linux-jdk10-m3.5.x_build/target/it/MJAVADOC-384/build.log, /home/jenkins/jenkins-slave/workspace/javadoc-plugin_MJAVADOC-134-WD2D35IKVL5AMZLDC76FJ2W2EJ7GUMKGGBRPVZ3UA52MWCOJCPHA@2/linux-jdk10-m3.5.x_build/target/it/MJAVADOC-407/build.log, /home/jenkins/jenkins-slave/workspace/javadoc-plugin_MJAVADOC-134-WD2D35IKVL5AMZLDC76FJ2W2EJ7GUMKGGBRPVZ3UA52MWCOJCPHA@2/linux-jdk10-m3.5.x_build/target/it/MJAVADOC-414/build.log, /home/jenkins/jenkins-slave/workspace/javadoc-plugin_MJAVADOC-134-WD2D35IKVL5AMZLDC76FJ2W2EJ7GUMKGGBRPVZ3UA52MWCOJCPHA@2/linux-jdk10-m3.5.x_build/target/it/MJAVADOC-420_fixparam/build.log, /home/jenkins/jenkins-slave/workspace/javadoc-plugin_MJAVADOC-134-WD2D35IKVL5AMZLDC76FJ2W2EJ7GUMKGGBRPVZ3UA52MWCOJCPHA@2/linux-jdk10-m3.5.x_build/target/it/MJAVADOC-427/build.log, /home/jenkins/jenkins-slave/workspace/javadoc-plugin_MJAVADOC-134-WD2D35IKVL5AMZLDC76FJ2W2EJ7GUMKGGBRPVZ3UA52MWCOJCPHA@2/linux-jdk10-m3.5.x_build/target/it/MJAVADOC-434_fixcompile/build.log, /home/jenkins/jenkins-slave/workspace/javadoc-plugin_MJAVADOC-134-WD2D35IKVL5AMZLDC76FJ2W2EJ7GUMKGGBRPVZ3UA52MWCOJCPHA@2/linux-jdk10-m3.5.x_build/target/it/MJAVADOC-437/build.log, /home/jenkins/jenkins-slave/workspace/javadoc-plugin_MJAVADOC-134-WD2D35IKVL5AMZLDC76FJ2W2EJ7GUMKGGBRPVZ3UA52MWCOJCPHA@2/linux-jdk10-m3.5.x_build/target/it/MJAVADOC-449_aggr_modulepath/build.log, /home/jenkins/jenkins-slave/workspace/javadoc-plugin_MJAVADOC-134-WD2D35IKVL5AMZLDC76FJ2W2EJ7GUMKGGBRPVZ3UA52MWCOJCPHA@2/linux-jdk10-m3.5.x_build/target/it/MJAVADOC-494_aggregate-repositories/build.log, /home/jenkins/jenkins-slave/workspace/javadoc-plugin_MJAVADOC-134-WD2D35IKVL5AMZLDC76FJ2W2EJ7GUMKGGBRPVZ3UA52MWCOJCPHA@2/linux-jdk10-m3.5.x_build/target/it/MJAVADOC-495_offline-filescheme/build.log, /home/jenkins/jenkins-slave/workspace/javadoc-plugin_MJAVADOC-134-WD2D35IKVL5AMZLDC76FJ2W2EJ7GUMKGGBRPVZ3UA52MWCOJCPHA@2/linux-jdk10-m3.5.x_build/target/it/MJAVADOC-497/build.log, /home/jenkins/jenkins-slave/workspace/javadoc-plugin_MJAVADOC-134-WD2D35IKVL5AMZLDC76FJ2W2EJ7GUMKGGBRPVZ3UA52MWCOJCPHA@2/linux-jdk10-m3.5.x_build/target/it/MJAVADOC-498_aggr_modulepath/build.log, /home/jenkins/jenkins-slave/workspace/javadoc-plugin_MJAVADOC-134-WD2D35IKVL5AMZLDC76FJ2W2EJ7GUMKGGBRPVZ3UA52MWCOJCPHA@2/linux-jdk10-m3.5.x_build/target/it/MJAVADOC-498_mm_modulepath/build.log, /home/jenkins/jenkins-slave/workspace/javadoc-plugin_MJAVADOC-134-WD2D35IKVL5AMZLDC76FJ2W2EJ7GUMKGGBRPVZ3UA52MWCOJCPHA@2/linux-jdk10-m3.5.x_build/target/it/MJAVADOC-498_modulepath/build.log, /home/jenkins/jenkins-slave/workspace/javadoc-plugin_MJAVADOC-134-WD2D35IKVL5AMZLDC76FJ2W2EJ7GUMKGGBRPVZ3UA52MWCOJCPHA@2/linux-jdk10-m3.5.x_build/target/it/MJAVADOC-506_excl-module-info/build.log, /home/jenkins/jenkins-slave/workspace/javadoc-plugin_MJAVADOC-134-WD2D35IKVL5AMZLDC76FJ2W2EJ7GUMKGGBRPVZ3UA52MWCOJCPHA@2/linux-jdk10-m3.5.x_build/target/it/MJAVADOC-508/build.log, /home/jenkins/jenkins-slave/workspace/javadoc-plugin_MJAVADOC-134-WD2D35IKVL5AMZLDC76FJ2W2EJ7GUMKGGBRPVZ3UA52MWCOJCPHA@2/linux-jdk10-m3.5.x_build/target/it/MJAVADOC-514_3rdparty-doclettags/build.log, /home/jenkins/jenkins-slave/workspace/javadoc-plugin_MJAVADOC-134-WD2D35IKVL5AMZLDC76FJ2W2EJ7GUMKGGBRPVZ3UA52MWCOJCPHA@2/linux-jdk10-m3.5.x_build/target/it/MJAVADOC-528/build.log, /home/jenkins/jenkins-slave/workspace/javadoc-plugin_MJAVADOC-134-WD2D35IKVL5AMZLDC76FJ2W2EJ7GUMKGGBRPVZ3UA52MWCOJCPHA@2/linux-jdk10-m3.5.x_build/target/it/MJAVADOC-538/build.log, /home/jenkins/jenkins-slave/workspace/javadoc-plugin_MJAVADOC-134-WD2D35IKVL5AMZLDC76FJ2W2EJ7GUMKGGBRPVZ3UA52MWCOJCPHA@2/linux-jdk10-m3.5.x_build/target/it/additional-dependencies-non-aggregate/build.log, /home/jenkins/jenkins-slave/workspace/javadoc-plugin_MJAVADOC-134-WD2D35IKVL5AMZLDC76FJ2W2EJ7GUMKGGBRPVZ3UA52MWCOJCPHA@2/linux-jdk10-m3.5.x_build/target/it/additional-dependencies/build.log, /home/jenkins/jenkins-slave/workspace/javadoc-plugin_MJAVADOC-134-WD2D35IKVL5AMZLDC76FJ2W2EJ7GUMKGGBRPVZ3UA52MWCOJCPHA@2/linux-jdk10-m3.5.x_build/target/it/dependencySource-1/build.log, /home/jenkins/jenkins-slave/workspace/javadoc-plugin_MJAVADOC-134-WD2D35IKVL5AMZLDC76FJ2W2EJ7GUMKGGBRPVZ3UA52MWCOJCPHA@2/linux-jdk10-m3.5.x_build/target/it/dependencySource-2/build.log, /home/jenkins/jenkins-slave/workspace/javadoc-plugin_MJAVADOC-134-WD2D35IKVL5AMZLDC76FJ2W2EJ7GUMKGGBRPVZ3UA52MWCOJCPHA@2/linux-jdk10-m3.5.x_build/target/it/dependencySource-3/build.log, /home/jenkins/jenkins-slave/workspace/javadoc-plugin_MJAVADOC-134-WD2D35IKVL5AMZLDC76FJ2W2EJ7GUMKGGBRPVZ3UA52MWCOJCPHA@2/linux-jdk10-m3.5.x_build/target/it/dependencySource-4/build.log, /home/jenkins/jenkins-slave/workspace/javadoc-plugin_MJAVADOC-134-WD2D35IKVL5AMZLDC76FJ2W2EJ7GUMKGGBRPVZ3UA52MWCOJCPHA@2/linux-jdk10-m3.5.x_build/target/it/detectLinks/build.log, /home/jenkins/jenkins-slave/workspace/javadoc-plugin_MJAVADOC-134-WD2D35IKVL5AMZLDC76FJ2W2EJ7GUMKGGBRPVZ3UA52MWCOJCPHA@2/linux-jdk10-m3.5.x_build/target/it/javadoc-fix/build.log, /home/jenkins/jenkins-slave/workspace/javadoc-plugin_MJAVADOC-134-WD2D35IKVL5AMZLDC76FJ2W2EJ7GUMKGGBRPVZ3UA52MWCOJCPHA@2/linux-jdk10-m3.5.x_build/target/it/site-failOnError/build.log]
[linux-jdk10-m3.5.x_build] Finished parsing Maven Invoker results (found 45)
[linux-jdk10-m3.5.x_build] [withMaven] junitPublisher - Archive test results for Maven artifact org.apache.maven.plugins:maven-javadoc-plugin:3.0.2-SNAPSHOT generated by maven-surefire-plugin:test (default-test): linux-jdk10-m3.5.x_build/target/surefire-reports/*.xml
[linux-jdk10-m3.5.x_build] Recording test results
[linux-jdk10-m3.5.x_build] [withMaven] openTasksPublisher - Scan Tasks for Maven artifact org.apache.maven.plugins:maven-javadoc-plugin:3.0.2-SNAPSHOT in source directory linux-jdk10-m3.5.x_build/src/main/java
[linux-jdk10-m3.5.x_build] [TASKS] Scanning folder '/home/jenkins/jenkins-slave/workspace/javadoc-plugin_MJAVADOC-134-WD2D35IKVL5AMZLDC76FJ2W2EJ7GUMKGGBRPVZ3UA52MWCOJCPHA@2' for files matching the pattern 'linux-jdk10-m3.5.x_build/src/main/java/**/*' - excludes: null
[linux-jdk10-m3.5.x_build] [TASKS] Found 24 files to scan for tasks
[linux-jdk10-m3.5.x_build] [TASKS] Found 7 open tasks.
[linux-jdk10-m3.5.x_build] Skipping warnings blame since pipelines do not have an SCM link.%n
[Pipeline] [windows-jdk7-m3.5.x_build] }
[windows-jdk7-m3.5.x_build] [withMaven] artifactsPublisher - Archive artifact windows-jdk7-m3.5.x_build\pom.xml under org\apache\maven\plugins\maven-javadoc-plugin\3.0.2-SNAPSHOT\maven-javadoc-plugin-3.0.2-SNAPSHOT.pom
[windows-jdk7-m3.5.x_build] [withMaven] artifactsPublisher - Archive artifact windows-jdk7-m3.5.x_build\target\maven-javadoc-plugin-3.0.2-SNAPSHOT.jar under org\apache\maven\plugins\maven-javadoc-plugin\3.0.2-SNAPSHOT\maven-javadoc-plugin-3.0.2-SNAPSHOT.jar
[windows-jdk7-m3.5.x_build] [Fast Archiver] No prior successful build to compare, so performing full copy of artifacts
[windows-jdk7-m3.5.x_build] [withMaven] invokerPublisher - Archive invoker results for Maven artifact MavenArtifact{org.apache.maven.plugins:maven-javadoc-plugin::3.0.2-SNAPSHOT(version: 3.0.2-SNAPSHOT, snapshot:false) } generated by PluginInvocation{org.apache.maven.plugins:maven-invoker-plugin:3.1.0@integration-test integration-test}: windows-jdk7-m3.5.x_build\target\invoker-reports\*.xml
[windows-jdk7-m3.5.x_build] performing MavenInvokerRecorder, reportsFilenamePattern:'**/windows-jdk7-m3.5.x_build\target\invoker-reports/BUILD*.xml', invokerBuildDir:'**/windows-jdk7-m3.5.x_build\target\it'
[windows-jdk7-m3.5.x_build] Found reports:[f:\jenkins\jenkins-slave\workspace\javadoc-plugin_MJAVADOC-134-WD2D35IKVL5AMZLDC76FJ2W2EJ7GUMKGGBRPVZ3UA52MWCOJCPHA@2@2\windows-jdk7-m3.5.x_build\target\invoker-reports\BUILD-MJAVADOC-110.xml, f:\jenkins\jenkins-slave\workspace\javadoc-plugin_MJAVADOC-134-WD2D35IKVL5AMZLDC76FJ2W2EJ7GUMKGGBRPVZ3UA52MWCOJCPHA@2@2\windows-jdk7-m3.5.x_build\target\invoker-reports\BUILD-MJAVADOC-126.xml, f:\jenkins\jenkins-slave\workspace\javadoc-plugin_MJAVADOC-134-WD2D35IKVL5AMZLDC76FJ2W2EJ7GUMKGGBRPVZ3UA52MWCOJCPHA@2@2\windows-jdk7-m3.5.x_build\target\invoker-reports\BUILD-MJAVADOC-134_multiaggregate.xml, f:\jenkins\jenkins-slave\workspace\javadoc-plugin_MJAVADOC-134-WD2D35IKVL5AMZLDC76FJ2W2EJ7GUMKGGBRPVZ3UA52MWCOJCPHA@2@2\windows-jdk7-m3.5.x_build\target\invoker-reports\BUILD-MJAVADOC-137.xml, f:\jenkins\jenkins-slave\workspace\javadoc-plugin_MJAVADOC-134-WD2D35IKVL5AMZLDC76FJ2W2EJ7GUMKGGBRPVZ3UA52MWCOJCPHA@2@2\windows-jdk7-m3.5.x_build\target\invoker-reports\BUILD-MJAVADOC-172.xml, f:\jenkins\jenkins-slave\workspace\javadoc-plugin_MJAVADOC-134-WD2D35IKVL5AMZLDC76FJ2W2EJ7GUMKGGBRPVZ3UA52MWCOJCPHA@2@2\windows-jdk7-m3.5.x_build\target\invoker-reports\BUILD-MJAVADOC-180.xml, f:\jenkins\jenkins-slave\workspace\javadoc-plugin_MJAVADOC-134-WD2D35IKVL5AMZLDC76FJ2W2EJ7GUMKGGBRPVZ3UA52MWCOJCPHA@2@2\windows-jdk7-m3.5.x_build\target\invoker-reports\BUILD-MJAVADOC-194.xml, f:\jenkins\jenkins-slave\workspace\javadoc-plugin_MJAVADOC-134-WD2D35IKVL5AMZLDC76FJ2W2EJ7GUMKGGBRPVZ3UA52MWCOJCPHA@2@2\windows-jdk7-m3.5.x_build\target\invoker-reports\BUILD-MJAVADOC-250.xml, f:\jenkins\jenkins-slave\workspace\javadoc-plugin_MJAVADOC-134-WD2D35IKVL5AMZLDC76FJ2W2EJ7GUMKGGBRPVZ3UA52MWCOJCPHA@2@2\windows-jdk7-m3.5.x_build\target\invoker-reports\BUILD-MJAVADOC-257.xml, f:\jenkins\jenkins-slave\workspace\javadoc-plugin_MJAVADOC-134-WD2D35IKVL5AMZLDC76FJ2W2EJ7GUMKGGBRPVZ3UA52MWCOJCPHA@2@2\windows-jdk7-m3.5.x_build\target\invoker-reports\BUILD-MJAVADOC-259.xml, f:\jenkins\jenkins-slave\workspace\javadoc-plugin_MJAVADOC-134-WD2D35IKVL5AMZLDC76FJ2W2EJ7GUMKGGBRPVZ3UA52MWCOJCPHA@2@2\windows-jdk7-m3.5.x_build\target\invoker-reports\BUILD-MJAVADOC-262.xml, f:\jenkins\jenkins-slave\workspace\javadoc-plugin_MJAVADOC-134-WD2D35IKVL5AMZLDC76FJ2W2EJ7GUMKGGBRPVZ3UA52MWCOJCPHA@2@2\windows-jdk7-m3.5.x_build\target\invoker-reports\BUILD-MJAVADOC-275.xml, f:\jenkins\jenkins-slave\workspace\javadoc-plugin_MJAVADOC-134-WD2D35IKVL5AMZLDC76FJ2W2EJ7GUMKGGBRPVZ3UA52MWCOJCPHA@2@2\windows-jdk7-m3.5.x_build\target\invoker-reports\BUILD-MJAVADOC-278.xml, f:\jenkins\jenkins-slave\workspace\javadoc-plugin_MJAVADOC-134-WD2D35IKVL5AMZLDC76FJ2W2EJ7GUMKGGBRPVZ3UA52MWCOJCPHA@2@2\windows-jdk7-m3.5.x_build\target\invoker-reports\BUILD-MJAVADOC-320.xml, f:\jenkins\jenkins-slave\workspace\javadoc-plugin_MJAVADOC-134-WD2D35IKVL5AMZLDC76FJ2W2EJ7GUMKGGBRPVZ3UA52MWCOJCPHA@2@2\windows-jdk7-m3.5.x_build\target\invoker-reports\BUILD-MJAVADOC-325.xml, f:\jenkins\jenkins-slave\workspace\javadoc-plugin_MJAVADOC-134-WD2D35IKVL5AMZLDC76FJ2W2EJ7GUMKGGBRPVZ3UA52MWCOJCPHA@2@2\windows-jdk7-m3.5.x_build\target\invoker-reports\BUILD-MJAVADOC-365.xml, f:\jenkins\jenkins-slave\workspace\javadoc-plugin_MJAVADOC-134-WD2D35IKVL5AMZLDC76FJ2W2EJ7GUMKGGBRPVZ3UA52MWCOJCPHA@2@2\windows-jdk7-m3.5.x_build\target\invoker-reports\BUILD-MJAVADOC-369.xml, f:\jenkins\jenkins-slave\workspace\javadoc-plugin_MJAVADOC-134-WD2D35IKVL5AMZLDC76FJ2W2EJ7GUMKGGBRPVZ3UA52MWCOJCPHA@2@2\windows-jdk7-m3.5.x_build\target\invoker-reports\BUILD-MJAVADOC-384.xml, f:\jenkins\jenkins-slave\workspace\javadoc-plugin_MJAVADOC-134-WD2D35IKVL5AMZLDC76FJ2W2EJ7GUMKGGBRPVZ3UA52MWCOJCPHA@2@2\windows-jdk7-m3.5.x_build\target\invoker-reports\BUILD-MJAVADOC-407.xml, f:\jenkins\jenkins-slave\workspace\javadoc-plugin_MJAVADOC-134-WD2D35IKVL5AMZLDC76FJ2W2EJ7GUMKGGBRPVZ3UA52MWCOJCPHA@2@2\windows-jdk7-m3.5.x_build\target\invoker-reports\BUILD-MJAVADOC-414.xml, f:\jenkins\jenkins-slave\workspace\javadoc-plugin_MJAVADOC-134-WD2D35IKVL5AMZLDC76FJ2W2EJ7GUMKGGBRPVZ3UA52MWCOJCPHA@2@2\windows-jdk7-m3.5.x_build\target\invoker-reports\BUILD-MJAVADOC-420_fixparam.xml, f:\jenkins\jenkins-slave\workspace\javadoc-plugin_MJAVADOC-134-WD2D35IKVL5AMZLDC76FJ2W2EJ7GUMKGGBRPVZ3UA52MWCOJCPHA@2@2\windows-jdk7-m3.5.x_build\target\invoker-reports\BUILD-MJAVADOC-427.xml, f:\jenkins\jenkins-slave\workspace\javadoc-plugin_MJAVADOC-134-WD2D35IKVL5AMZLDC76FJ2W2EJ7GUMKGGBRPVZ3UA52MWCOJCPHA@2@2\windows-jdk7-m3.5.x_build\target\invoker-reports\BUILD-MJAVADOC-434_fixcompile.xml, f:\jenkins\jenkins-slave\workspace\javadoc-plugin_MJAVADOC-134-WD2D35IKVL5AMZLDC76FJ2W2EJ7GUMKGGBRPVZ3UA52MWCOJCPHA@2@2\windows-jdk7-m3.5.x_build\target\invoker-reports\BUILD-MJAVADOC-437.xml, f:\jenkins\jenkins-slave\workspace\javadoc-plugin_MJAVADOC-134-WD2D35IKVL5AMZLDC76FJ2W2EJ7GUMKGGBRPVZ3UA52MWCOJCPHA@2@2\windows-jdk7-m3.5.x_build\target\invoker-reports\BUILD-MJAVADOC-449_aggr_modulepath.xml, f:\jenkins\jenkins-slave\workspace\javadoc-plugin_MJAVADOC-134-WD2D35IKVL5AMZLDC76FJ2W2EJ7GUMKGGBRPVZ3UA52MWCOJCPHA@2@2\windows-jdk7-m3.5.x_build\target\invoker-reports\BUILD-MJAVADOC-494_aggregate-repositories.xml, f:\jenkins\jenkins-slave\workspace\javadoc-plugin_MJAVADOC-134-WD2D35IKVL5AMZLDC76FJ2W2EJ7GUMKGGBRPVZ3UA52MWCOJCPHA@2@2\windows-jdk7-m3.5.x_build\target\invoker-reports\BUILD-MJAVADOC-495_offline-filescheme.xml, f:\jenkins\jenkins-slave\workspace\javadoc-plugin_MJAVADOC-134-WD2D35IKVL5AMZLDC76FJ2W2EJ7GUMKGGBRPVZ3UA52MWCOJCPHA@2@2\windows-jdk7-m3.5.x_build\target\invoker-reports\BUILD-MJAVADOC-497.xml, f:\jenkins\jenkins-slave\workspace\javadoc-plugin_MJAVADOC-134-WD2D35IKVL5AMZLDC76FJ2W2EJ7GUMKGGBRPVZ3UA52MWCOJCPHA@2@2\windows-jdk7-m3.5.x_build\target\invoker-reports\BUILD-MJAVADOC-498_aggr_modulepath.xml, f:\jenkins\jenkins-slave\workspace\javadoc-plugin_MJAVADOC-134-WD2D35IKVL5AMZLDC76FJ2W2EJ7GUMKGGBRPVZ3UA52MWCOJCPHA@2@2\windows-jdk7-m3.5.x_build\target\invoker-reports\BUILD-MJAVADOC-498_mm_modulepath.xml, f:\jenkins\jenkins-slave\workspace\javadoc-plugin_MJAVADOC-134-WD2D35IKVL5AMZLDC76FJ2W2EJ7GUMKGGBRPVZ3UA52MWCOJCPHA@2@2\windows-jdk7-m3.5.x_build\target\invoker-reports\BUILD-MJAVADOC-498_modulepath.xml, f:\jenkins\jenkins-slave\workspace\javadoc-plugin_MJAVADOC-134-WD2D35IKVL5AMZLDC76FJ2W2EJ7GUMKGGBRPVZ3UA52MWCOJCPHA@2@2\windows-jdk7-m3.5.x_build\target\invoker-reports\BUILD-MJAVADOC-506_excl-module-info.xml, f:\jenkins\jenkins-slave\workspace\javadoc-plugin_MJAVADOC-134-WD2D35IKVL5AMZLDC76FJ2W2EJ7GUMKGGBRPVZ3UA52MWCOJCPHA@2@2\windows-jdk7-m3.5.x_build\target\invoker-reports\BUILD-MJAVADOC-508.xml, f:\jenkins\jenkins-slave\workspace\javadoc-plugin_MJAVADOC-134-WD2D35IKVL5AMZLDC76FJ2W2EJ7GUMKGGBRPVZ3UA52MWCOJCPHA@2@2\windows-jdk7-m3.5.x_build\target\invoker-reports\BUILD-MJAVADOC-514_3rdparty-doclettags.xml, f:\jenkins\jenkins-slave\workspace\javadoc-plugin_MJAVADOC-134-WD2D35IKVL5AMZLDC76FJ2W2EJ7GUMKGGBRPVZ3UA52MWCOJCPHA@2@2\windows-jdk7-m3.5.x_build\target\invoker-reports\BUILD-MJAVADOC-528.xml, f:\jenkins\jenkins-slave\workspace\javadoc-plugin_MJAVADOC-134-WD2D35IKVL5AMZLDC76FJ2W2EJ7GUMKGGBRPVZ3UA52MWCOJCPHA@2@2\windows-jdk7-m3.5.x_build\target\invoker-reports\BUILD-MJAVADOC-538.xml, f:\jenkins\jenkins-slave\workspace\javadoc-plugin_MJAVADOC-134-WD2D35IKVL5AMZLDC76FJ2W2EJ7GUMKGGBRPVZ3UA52MWCOJCPHA@2@2\windows-jdk7-m3.5.x_build\target\invoker-reports\BUILD-additional-dependencies-non-aggregate.xml, f:\jenkins\jenkins-slave\workspace\javadoc-plugin_MJAVADOC-134-WD2D35IKVL5AMZLDC76FJ2W2EJ7GUMKGGBRPVZ3UA52MWCOJCPHA@2@2\windows-jdk7-m3.5.x_build\target\invoker-reports\BUILD-additional-dependencies.xml, f:\jenkins\jenkins-slave\workspace\javadoc-plugin_MJAVADOC-134-WD2D35IKVL5AMZLDC76FJ2W2EJ7GUMKGGBRPVZ3UA52MWCOJCPHA@2@2\windows-jdk7-m3.5.x_build\target\invoker-reports\BUILD-dependencySource-1.xml, f:\jenkins\jenkins-slave\workspace\javadoc-plugin_MJAVADOC-134-WD2D35IKVL5AMZLDC76FJ2W2EJ7GUMKGGBRPVZ3UA52MWCOJCPHA@2@2\windows-jdk7-m3.5.x_build\target\invoker-reports\BUILD-dependencySource-2.xml, f:\jenkins\jenkins-slave\workspace\javadoc-plugin_MJAVADOC-134-WD2D35IKVL5AMZLDC76FJ2W2EJ7GUMKGGBRPVZ3UA52MWCOJCPHA@2@2\windows-jdk7-m3.5.x_build\target\invoker-reports\BUILD-dependencySource-3.xml, f:\jenkins\jenkins-slave\workspace\javadoc-plugin_MJAVADOC-134-WD2D35IKVL5AMZLDC76FJ2W2EJ7GUMKGGBRPVZ3UA52MWCOJCPHA@2@2\windows-jdk7-m3.5.x_build\target\invoker-reports\BUILD-dependencySource-4.xml, f:\jenkins\jenkins-slave\workspace\javadoc-plugin_MJAVADOC-134-WD2D35IKVL5AMZLDC76FJ2W2EJ7GUMKGGBRPVZ3UA52MWCOJCPHA@2@2\windows-jdk7-m3.5.x_build\target\invoker-reports\BUILD-detectLinks.xml, f:\jenkins\jenkins-slave\workspace\javadoc-plugin_MJAVADOC-134-WD2D35IKVL5AMZLDC76FJ2W2EJ7GUMKGGBRPVZ3UA52MWCOJCPHA@2@2\windows-jdk7-m3.5.x_build\target\invoker-reports\BUILD-javadoc-fix.xml, f:\jenkins\jenkins-slave\workspace\javadoc-plugin_MJAVADOC-134-WD2D35IKVL5AMZLDC76FJ2W2EJ7GUMKGGBRPVZ3UA52MWCOJCPHA@2@2\windows-jdk7-m3.5.x_build\target\invoker-reports\BUILD-site-failOnError.xml]
[windows-jdk7-m3.5.x_build] Found logs:[f:\jenkins\jenkins-slave\workspace\javadoc-plugin_MJAVADOC-134-WD2D35IKVL5AMZLDC76FJ2W2EJ7GUMKGGBRPVZ3UA52MWCOJCPHA@2@2\windows-jdk7-m3.5.x_build\target\it\MJAVADOC-110\build.log, f:\jenkins\jenkins-slave\workspace\javadoc-plugin_MJAVADOC-134-WD2D35IKVL5AMZLDC76FJ2W2EJ7GUMKGGBRPVZ3UA52MWCOJCPHA@2@2\windows-jdk7-m3.5.x_build\target\it\MJAVADOC-126\build.log, f:\jenkins\jenkins-slave\workspace\javadoc-plugin_MJAVADOC-134-WD2D35IKVL5AMZLDC76FJ2W2EJ7GUMKGGBRPVZ3UA52MWCOJCPHA@2@2\windows-jdk7-m3.5.x_build\target\it\MJAVADOC-134_multiaggregate\build.log, f:\jenkins\jenkins-slave\workspace\javadoc-plugin_MJAVADOC-134-WD2D35IKVL5AMZLDC76FJ2W2EJ7GUMKGGBRPVZ3UA52MWCOJCPHA@2@2\windows-jdk7-m3.5.x_build\target\it\MJAVADOC-137\build.log, f:\jenkins\jenkins-slave\workspace\javadoc-plugin_MJAVADOC-134-WD2D35IKVL5AMZLDC76FJ2W2EJ7GUMKGGBRPVZ3UA52MWCOJCPHA@2@2\windows-jdk7-m3.5.x_build\target\it\MJAVADOC-172\build.log, f:\jenkins\jenkins-slave\workspace\javadoc-plugin_MJAVADOC-134-WD2D35IKVL5AMZLDC76FJ2W2EJ7GUMKGGBRPVZ3UA52MWCOJCPHA@2@2\windows-jdk7-m3.5.x_build\target\it\MJAVADOC-180\build.log, f:\jenkins\jenkins-slave\workspace\javadoc-plugin_MJAVADOC-134-WD2D35IKVL5AMZLDC76FJ2W2EJ7GUMKGGBRPVZ3UA52MWCOJCPHA@2@2\windows-jdk7-m3.5.x_build\target\it\MJAVADOC-194\build.log, f:\jenkins\jenkins-slave\workspace\javadoc-plugin_MJAVADOC-134-WD2D35IKVL5AMZLDC76FJ2W2EJ7GUMKGGBRPVZ3UA52MWCOJCPHA@2@2\windows-jdk7-m3.5.x_build\target\it\MJAVADOC-250\build.log, f:\jenkins\jenkins-slave\workspace\javadoc-plugin_MJAVADOC-134-WD2D35IKVL5AMZLDC76FJ2W2EJ7GUMKGGBRPVZ3UA52MWCOJCPHA@2@2\windows-jdk7-m3.5.x_build\target\it\MJAVADOC-257\build.log, f:\jenkins\jenkins-slave\workspace\javadoc-plugin_MJAVADOC-134-WD2D35IKVL5AMZLDC76FJ2W2EJ7GUMKGGBRPVZ3UA52MWCOJCPHA@2@2\windows-jdk7-m3.5.x_build\target\it\MJAVADOC-259\build.log, f:\jenkins\jenkins-slave\workspace\javadoc-plugin_MJAVADOC-134-WD2D35IKVL5AMZLDC76FJ2W2EJ7GUMKGGBRPVZ3UA52MWCOJCPHA@2@2\windows-jdk7-m3.5.x_build\target\it\MJAVADOC-262\build.log, f:\jenkins\jenkins-slave\workspace\javadoc-plugin_MJAVADOC-134-WD2D35IKVL5AMZLDC76FJ2W2EJ7GUMKGGBRPVZ3UA52MWCOJCPHA@2@2\windows-jdk7-m3.5.x_build\target\it\MJAVADOC-275\build.log, f:\jenkins\jenkins-slave\workspace\javadoc-plugin_MJAVADOC-134-WD2D35IKVL5AMZLDC76FJ2W2EJ7GUMKGGBRPVZ3UA52MWCOJCPHA@2@2\windows-jdk7-m3.5.x_build\target\it\MJAVADOC-278\build.log, f:\jenkins\jenkins-slave\workspace\javadoc-plugin_MJAVADOC-134-WD2D35IKVL5AMZLDC76FJ2W2EJ7GUMKGGBRPVZ3UA52MWCOJCPHA@2@2\windows-jdk7-m3.5.x_build\target\it\MJAVADOC-320\build.log, f:\jenkins\jenkins-slave\workspace\javadoc-plugin_MJAVADOC-134-WD2D35IKVL5AMZLDC76FJ2W2EJ7GUMKGGBRPVZ3UA52MWCOJCPHA@2@2\windows-jdk7-m3.5.x_build\target\it\MJAVADOC-325\build.log, f:\jenkins\jenkins-slave\workspace\javadoc-plugin_MJAVADOC-134-WD2D35IKVL5AMZLDC76FJ2W2EJ7GUMKGGBRPVZ3UA52MWCOJCPHA@2@2\windows-jdk7-m3.5.x_build\target\it\MJAVADOC-365\build.log, f:\jenkins\jenkins-slave\workspace\javadoc-plugin_MJAVADOC-134-WD2D35IKVL5AMZLDC76FJ2W2EJ7GUMKGGBRPVZ3UA52MWCOJCPHA@2@2\windows-jdk7-m3.5.x_build\target\it\MJAVADOC-369\build.log, f:\jenkins\jenkins-slave\workspace\javadoc-plugin_MJAVADOC-134-WD2D35IKVL5AMZLDC76FJ2W2EJ7GUMKGGBRPVZ3UA52MWCOJCPHA@2@2\windows-jdk7-m3.5.x_build\target\it\MJAVADOC-384\build.log, f:\jenkins\jenkins-slave\workspace\javadoc-plugin_MJAVADOC-134-WD2D35IKVL5AMZLDC76FJ2W2EJ7GUMKGGBRPVZ3UA52MWCOJCPHA@2@2\windows-jdk7-m3.5.x_build\target\it\MJAVADOC-407\build.log, f:\jenkins\jenkins-slave\workspace\javadoc-plugin_MJAVADOC-134-WD2D35IKVL5AMZLDC76FJ2W2EJ7GUMKGGBRPVZ3UA52MWCOJCPHA@2@2\windows-jdk7-m3.5.x_build\target\it\MJAVADOC-414\build.log, f:\jenkins\jenkins-slave\workspace\javadoc-plugin_MJAVADOC-134-WD2D35IKVL5AMZLDC76FJ2W2EJ7GUMKGGBRPVZ3UA52MWCOJCPHA@2@2\windows-jdk7-m3.5.x_build\target\it\MJAVADOC-420_fixparam\build.log, f:\jenkins\jenkins-slave\workspace\javadoc-plugin_MJAVADOC-134-WD2D35IKVL5AMZLDC76FJ2W2EJ7GUMKGGBRPVZ3UA52MWCOJCPHA@2@2\windows-jdk7-m3.5.x_build\target\it\MJAVADOC-434_fixcompile\build.log, f:\jenkins\jenkins-slave\workspace\javadoc-plugin_MJAVADOC-134-WD2D35IKVL5AMZLDC76FJ2W2EJ7GUMKGGBRPVZ3UA52MWCOJCPHA@2@2\windows-jdk7-m3.5.x_build\target\it\MJAVADOC-437\build.log, f:\jenkins\jenkins-slave\workspace\javadoc-plugin_MJAVADOC-134-WD2D35IKVL5AMZLDC76FJ2W2EJ7GUMKGGBRPVZ3UA52MWCOJCPHA@2@2\windows-jdk7-m3.5.x_build\target\it\MJAVADOC-494_aggregate-repositories\build.log, f:\jenkins\jenkins-slave\workspace\javadoc-plugin_MJAVADOC-134-WD2D35IKVL5AMZLDC76FJ2W2EJ7GUMKGGBRPVZ3UA52MWCOJCPHA@2@2\windows-jdk7-m3.5.x_build\target\it\MJAVADOC-495_offline-filescheme\build.log, f:\jenkins\jenkins-slave\workspace\javadoc-plugin_MJAVADOC-134-WD2D35IKVL5AMZLDC76FJ2W2EJ7GUMKGGBRPVZ3UA52MWCOJCPHA@2@2\windows-jdk7-m3.5.x_build\target\it\MJAVADOC-497\build.log, f:\jenkins\jenkins-slave\workspace\javadoc-plugin_MJAVADOC-134-WD2D35IKVL5AMZLDC76FJ2W2EJ7GUMKGGBRPVZ3UA52MWCOJCPHA@2@2\windows-jdk7-m3.5.x_build\target\it\MJAVADOC-506_excl-module-info\build.log, f:\jenkins\jenkins-slave\workspace\javadoc-plugin_MJAVADOC-134-WD2D35IKVL5AMZLDC76FJ2W2EJ7GUMKGGBRPVZ3UA52MWCOJCPHA@2@2\windows-jdk7-m3.5.x_build\target\it\MJAVADOC-508\build.log, f:\jenkins\jenkins-slave\workspace\javadoc-plugin_MJAVADOC-134-WD2D35IKVL5AMZLDC76FJ2W2EJ7GUMKGGBRPVZ3UA52MWCOJCPHA@2@2\windows-jdk7-m3.5.x_build\target\it\MJAVADOC-514_3rdparty-doclettags\build.log, f:\jenkins\jenkins-slave\workspace\javadoc-plugin_MJAVADOC-134-WD2D35IKVL5AMZLDC76FJ2W2EJ7GUMKGGBRPVZ3UA52MWCOJCPHA@2@2\windows-jdk7-m3.5.x_build\target\it\MJAVADOC-528\build.log, f:\jenkins\jenkins-slave\workspace\javadoc-plugin_MJAVADOC-134-WD2D35IKVL5AMZLDC76FJ2W2EJ7GUMKGGBRPVZ3UA52MWCOJCPHA@2@2\windows-jdk7-m3.5.x_build\target\it\MJAVADOC-538\build.log, f:\jenkins\jenkins-slave\workspace\javadoc-plugin_MJAVADOC-134-WD2D35IKVL5AMZLDC76FJ2W2EJ7GUMKGGBRPVZ3UA52MWCOJCPHA@2@2\windows-jdk7-m3.5.x_build\target\it\additional-dependencies-non-aggregate\build.log, f:\jenkins\jenkins-slave\workspace\javadoc-plugin_MJAVADOC-134-WD2D35IKVL5AMZLDC76FJ2W2EJ7GUMKGGBRPVZ3UA52MWCOJCPHA@2@2\windows-jdk7-m3.5.x_build\target\it\additional-dependencies\build.log, f:\jenkins\jenkins-slave\workspace\javadoc-plugin_MJAVADOC-134-WD2D35IKVL5AMZLDC76FJ2W2EJ7GUMKGGBRPVZ3UA52MWCOJCPHA@2@2\windows-jdk7-m3.5.x_build\target\it\dependencySource-1\build.log, f:\jenkins\jenkins-slave\workspace\javadoc-plugin_MJAVADOC-134-WD2D35IKVL5AMZLDC76FJ2W2EJ7GUMKGGBRPVZ3UA52MWCOJCPHA@2@2\windows-jdk7-m3.5.x_build\target\it\dependencySource-2\build.log, f:\jenkins\jenkins-slave\workspace\javadoc-plugin_MJAVADOC-134-WD2D35IKVL5AMZLDC76FJ2W2EJ7GUMKGGBRPVZ3UA52MWCOJCPHA@2@2\windows-jdk7-m3.5.x_build\target\it\dependencySource-3\build.log, f:\jenkins\jenkins-slave\workspace\javadoc-plugin_MJAVADOC-134-WD2D35IKVL5AMZLDC76FJ2W2EJ7GUMKGGBRPVZ3UA52MWCOJCPHA@2@2\windows-jdk7-m3.5.x_build\target\it\dependencySource-4\build.log, f:\jenkins\jenkins-slave\workspace\javadoc-plugin_MJAVADOC-134-WD2D35IKVL5AMZLDC76FJ2W2EJ7GUMKGGBRPVZ3UA52MWCOJCPHA@2@2\windows-jdk7-m3.5.x_build\target\it\detectLinks\build.log, f:\jenkins\jenkins-slave\workspace\javadoc-plugin_MJAVADOC-134-WD2D35IKVL5AMZLDC76FJ2W2EJ7GUMKGGBRPVZ3UA52MWCOJCPHA@2@2\windows-jdk7-m3.5.x_build\target\it\javadoc-fix\build.log, f:\jenkins\jenkins-slave\workspace\javadoc-plugin_MJAVADOC-134-WD2D35IKVL5AMZLDC76FJ2W2EJ7GUMKGGBRPVZ3UA52MWCOJCPHA@2@2\windows-jdk7-m3.5.x_build\target\it\site-failOnError\build.log]
[windows-jdk7-m3.5.x_build] Finished parsing Maven Invoker results (found 45)
[windows-jdk7-m3.5.x_build] [withMaven] junitPublisher - Archive test results for Maven artifact org.apache.maven.plugins:maven-javadoc-plugin:3.0.2-SNAPSHOT generated by maven-surefire-plugin:test (default-test): windows-jdk7-m3.5.x_build\target\surefire-reports\*.xml
[windows-jdk7-m3.5.x_build] Recording test results
[windows-jdk7-m3.5.x_build] [withMaven] openTasksPublisher - Scan Tasks for Maven artifact org.apache.maven.plugins:maven-javadoc-plugin:3.0.2-SNAPSHOT in source directory windows-jdk7-m3.5.x_build\src\main\java
[windows-jdk7-m3.5.x_build] [TASKS] Scanning folder 'f:\jenkins\jenkins-slave\workspace\javadoc-plugin_MJAVADOC-134-WD2D35IKVL5AMZLDC76FJ2W2EJ7GUMKGGBRPVZ3UA52MWCOJCPHA@2@2' for files matching the pattern 'windows-jdk7-m3.5.x_build\src\main\java\**\*' - excludes: null
[windows-jdk7-m3.5.x_build] [TASKS] Found 24 files to scan for tasks
[windows-jdk7-m3.5.x_build] [TASKS] Found 7 open tasks.
[windows-jdk7-m3.5.x_build] Skipping warnings blame since pipelines do not have an SCM link.%n
[Pipeline] [windows-jdk8-m3.5.x_build] }
[windows-jdk8-m3.5.x_build] [withMaven] artifactsPublisher - Archive artifact windows-jdk8-m3.5.x_build\pom.xml under org\apache\maven\plugins\maven-javadoc-plugin\3.0.2-SNAPSHOT\maven-javadoc-plugin-3.0.2-SNAPSHOT.pom
[windows-jdk8-m3.5.x_build] [withMaven] artifactsPublisher - Archive artifact windows-jdk8-m3.5.x_build\target\maven-javadoc-plugin-3.0.2-SNAPSHOT.jar under org\apache\maven\plugins\maven-javadoc-plugin\3.0.2-SNAPSHOT\maven-javadoc-plugin-3.0.2-SNAPSHOT.jar
[windows-jdk8-m3.5.x_build] [Fast Archiver] No prior successful build to compare, so performing full copy of artifacts
[windows-jdk8-m3.5.x_build] [withMaven] invokerPublisher - Archive invoker results for Maven artifact MavenArtifact{org.apache.maven.plugins:maven-javadoc-plugin::3.0.2-SNAPSHOT(version: 3.0.2-SNAPSHOT, snapshot:false) } generated by PluginInvocation{org.apache.maven.plugins:maven-invoker-plugin:3.1.0@integration-test integration-test}: windows-jdk8-m3.5.x_build\target\invoker-reports\*.xml
[windows-jdk8-m3.5.x_build] performing MavenInvokerRecorder, reportsFilenamePattern:'**/windows-jdk8-m3.5.x_build\target\invoker-reports/BUILD*.xml', invokerBuildDir:'**/windows-jdk8-m3.5.x_build\target\it'
[windows-jdk8-m3.5.x_build] Found reports:[f:\jenkins\jenkins-slave\workspace\javadoc-plugin_MJAVADOC-134-WD2D35IKVL5AMZLDC76FJ2W2EJ7GUMKGGBRPVZ3UA52MWCOJCPHA@3\windows-jdk8-m3.5.x_build\target\invoker-reports\BUILD-MJAVADOC-110.xml, f:\jenkins\jenkins-slave\workspace\javadoc-plugin_MJAVADOC-134-WD2D35IKVL5AMZLDC76FJ2W2EJ7GUMKGGBRPVZ3UA52MWCOJCPHA@3\windows-jdk8-m3.5.x_build\target\invoker-reports\BUILD-MJAVADOC-126.xml, f:\jenkins\jenkins-slave\workspace\javadoc-plugin_MJAVADOC-134-WD2D35IKVL5AMZLDC76FJ2W2EJ7GUMKGGBRPVZ3UA52MWCOJCPHA@3\windows-jdk8-m3.5.x_build\target\invoker-reports\BUILD-MJAVADOC-134_multiaggregate.xml, f:\jenkins\jenkins-slave\workspace\javadoc-plugin_MJAVADOC-134-WD2D35IKVL5AMZLDC76FJ2W2EJ7GUMKGGBRPVZ3UA52MWCOJCPHA@3\windows-jdk8-m3.5.x_build\target\invoker-reports\BUILD-MJAVADOC-137.xml, f:\jenkins\jenkins-slave\workspace\javadoc-plugin_MJAVADOC-134-WD2D35IKVL5AMZLDC76FJ2W2EJ7GUMKGGBRPVZ3UA52MWCOJCPHA@3\windows-jdk8-m3.5.x_build\target\invoker-reports\BUILD-MJAVADOC-172.xml, f:\jenkins\jenkins-slave\workspace\javadoc-plugin_MJAVADOC-134-WD2D35IKVL5AMZLDC76FJ2W2EJ7GUMKGGBRPVZ3UA52MWCOJCPHA@3\windows-jdk8-m3.5.x_build\target\invoker-reports\BUILD-MJAVADOC-180.xml, f:\jenkins\jenkins-slave\workspace\javadoc-plugin_MJAVADOC-134-WD2D35IKVL5AMZLDC76FJ2W2EJ7GUMKGGBRPVZ3UA52MWCOJCPHA@3\windows-jdk8-m3.5.x_build\target\invoker-reports\BUILD-MJAVADOC-194.xml, f:\jenkins\jenkins-slave\workspace\javadoc-plugin_MJAVADOC-134-WD2D35IKVL5AMZLDC76FJ2W2EJ7GUMKGGBRPVZ3UA52MWCOJCPHA@3\windows-jdk8-m3.5.x_build\target\invoker-reports\BUILD-MJAVADOC-250.xml, f:\jenkins\jenkins-slave\workspace\javadoc-plugin_MJAVADOC-134-WD2D35IKVL5AMZLDC76FJ2W2EJ7GUMKGGBRPVZ3UA52MWCOJCPHA@3\windows-jdk8-m3.5.x_build\target\invoker-reports\BUILD-MJAVADOC-257.xml, f:\jenkins\jenkins-slave\workspace\javadoc-plugin_MJAVADOC-134-WD2D35IKVL5AMZLDC76FJ2W2EJ7GUMKGGBRPVZ3UA52MWCOJCPHA@3\windows-jdk8-m3.5.x_build\target\invoker-reports\BUILD-MJAVADOC-259.xml, f:\jenkins\jenkins-slave\workspace\javadoc-plugin_MJAVADOC-134-WD2D35IKVL5AMZLDC76FJ2W2EJ7GUMKGGBRPVZ3UA52MWCOJCPHA@3\windows-jdk8-m3.5.x_build\target\invoker-reports\BUILD-MJAVADOC-262.xml, f:\jenkins\jenkins-slave\workspace\javadoc-plugin_MJAVADOC-134-WD2D35IKVL5AMZLDC76FJ2W2EJ7GUMKGGBRPVZ3UA52MWCOJCPHA@3\windows-jdk8-m3.5.x_build\target\invoker-reports\BUILD-MJAVADOC-275.xml, f:\jenkins\jenkins-slave\workspace\javadoc-plugin_MJAVADOC-134-WD2D35IKVL5AMZLDC76FJ2W2EJ7GUMKGGBRPVZ3UA52MWCOJCPHA@3\windows-jdk8-m3.5.x_build\target\invoker-reports\BUILD-MJAVADOC-278.xml, f:\jenkins\jenkins-slave\workspace\javadoc-plugin_MJAVADOC-134-WD2D35IKVL5AMZLDC76FJ2W2EJ7GUMKGGBRPVZ3UA52MWCOJCPHA@3\windows-jdk8-m3.5.x_build\target\invoker-reports\BUILD-MJAVADOC-320.xml, f:\jenkins\jenkins-slave\workspace\javadoc-plugin_MJAVADOC-134-WD2D35IKVL5AMZLDC76FJ2W2EJ7GUMKGGBRPVZ3UA52MWCOJCPHA@3\windows-jdk8-m3.5.x_build\target\invoker-reports\BUILD-MJAVADOC-325.xml, f:\jenkins\jenkins-slave\workspace\javadoc-plugin_MJAVADOC-134-WD2D35IKVL5AMZLDC76FJ2W2EJ7GUMKGGBRPVZ3UA52MWCOJCPHA@3\windows-jdk8-m3.5.x_build\target\invoker-reports\BUILD-MJAVADOC-365.xml, f:\jenkins\jenkins-slave\workspace\javadoc-plugin_MJAVADOC-134-WD2D35IKVL5AMZLDC76FJ2W2EJ7GUMKGGBRPVZ3UA52MWCOJCPHA@3\windows-jdk8-m3.5.x_build\target\invoker-reports\BUILD-MJAVADOC-369.xml, f:\jenkins\jenkins-slave\workspace\javadoc-plugin_MJAVADOC-134-WD2D35IKVL5AMZLDC76FJ2W2EJ7GUMKGGBRPVZ3UA52MWCOJCPHA@3\windows-jdk8-m3.5.x_build\target\invoker-reports\BUILD-MJAVADOC-384.xml, f:\jenkins\jenkins-slave\workspace\javadoc-plugin_MJAVADOC-134-WD2D35IKVL5AMZLDC76FJ2W2EJ7GUMKGGBRPVZ3UA52MWCOJCPHA@3\windows-jdk8-m3.5.x_build\target\invoker-reports\BUILD-MJAVADOC-407.xml, f:\jenkins\jenkins-slave\workspace\javadoc-plugin_MJAVADOC-134-WD2D35IKVL5AMZLDC76FJ2W2EJ7GUMKGGBRPVZ3UA52MWCOJCPHA@3\windows-jdk8-m3.5.x_build\target\invoker-reports\BUILD-MJAVADOC-414.xml, f:\jenkins\jenkins-slave\workspace\javadoc-plugin_MJAVADOC-134-WD2D35IKVL5AMZLDC76FJ2W2EJ7GUMKGGBRPVZ3UA52MWCOJCPHA@3\windows-jdk8-m3.5.x_build\target\invoker-reports\BUILD-MJAVADOC-420_fixparam.xml, f:\jenkins\jenkins-slave\workspace\javadoc-plugin_MJAVADOC-134-WD2D35IKVL5AMZLDC76FJ2W2EJ7GUMKGGBRPVZ3UA52MWCOJCPHA@3\windows-jdk8-m3.5.x_build\target\invoker-reports\BUILD-MJAVADOC-427.xml, f:\jenkins\jenkins-slave\workspace\javadoc-plugin_MJAVADOC-134-WD2D35IKVL5AMZLDC76FJ2W2EJ7GUMKGGBRPVZ3UA52MWCOJCPHA@3\windows-jdk8-m3.5.x_build\target\invoker-reports\BUILD-MJAVADOC-434_fixcompile.xml, f:\jenkins\jenkins-slave\workspace\javadoc-plugin_MJAVADOC-134-WD2D35IKVL5AMZLDC76FJ2W2EJ7GUMKGGBRPVZ3UA52MWCOJCPHA@3\windows-jdk8-m3.5.x_build\target\invoker-reports\BUILD-MJAVADOC-437.xml, f:\jenkins\jenkins-slave\workspace\javadoc-plugin_MJAVADOC-134-WD2D35IKVL5AMZLDC76FJ2W2EJ7GUMKGGBRPVZ3UA52MWCOJCPHA@3\windows-jdk8-m3.5.x_build\target\invoker-reports\BUILD-MJAVADOC-449_aggr_modulepath.xml, f:\jenkins\jenkins-slave\workspace\javadoc-plugin_MJAVADOC-134-WD2D35IKVL5AMZLDC76FJ2W2EJ7GUMKGGBRPVZ3UA52MWCOJCPHA@3\windows-jdk8-m3.5.x_build\target\invoker-reports\BUILD-MJAVADOC-494_aggregate-repositories.xml, f:\jenkins\jenkins-slave\workspace\javadoc-plugin_MJAVADOC-134-WD2D35IKVL5AMZLDC76FJ2W2EJ7GUMKGGBRPVZ3UA52MWCOJCPHA@3\windows-jdk8-m3.5.x_build\target\invoker-reports\BUILD-MJAVADOC-495_offline-filescheme.xml, f:\jenkins\jenkins-slave\workspace\javadoc-plugin_MJAVADOC-134-WD2D35IKVL5AMZLDC76FJ2W2EJ7GUMKGGBRPVZ3UA52MWCOJCPHA@3\windows-jdk8-m3.5.x_build\target\invoker-reports\BUILD-MJAVADOC-497.xml, f:\jenkins\jenkins-slave\workspace\javadoc-plugin_MJAVADOC-134-WD2D35IKVL5AMZLDC76FJ2W2EJ7GUMKGGBRPVZ3UA52MWCOJCPHA@3\windows-jdk8-m3.5.x_build\target\invoker-reports\BUILD-MJAVADOC-498_aggr_modulepath.xml, f:\jenkins\jenkins-slave\workspace\javadoc-plugin_MJAVADOC-134-WD2D35IKVL5AMZLDC76FJ2W2EJ7GUMKGGBRPVZ3UA52MWCOJCPHA@3\windows-jdk8-m3.5.x_build\target\invoker-reports\BUILD-MJAVADOC-498_mm_modulepath.xml, f:\jenkins\jenkins-slave\workspace\javadoc-plugin_MJAVADOC-134-WD2D35IKVL5AMZLDC76FJ2W2EJ7GUMKGGBRPVZ3UA52MWCOJCPHA@3\windows-jdk8-m3.5.x_build\target\invoker-reports\BUILD-MJAVADOC-498_modulepath.xml, f:\jenkins\jenkins-slave\workspace\javadoc-plugin_MJAVADOC-134-WD2D35IKVL5AMZLDC76FJ2W2EJ7GUMKGGBRPVZ3UA52MWCOJCPHA@3\windows-jdk8-m3.5.x_build\target\invoker-reports\BUILD-MJAVADOC-506_excl-module-info.xml, f:\jenkins\jenkins-slave\workspace\javadoc-plugin_MJAVADOC-134-WD2D35IKVL5AMZLDC76FJ2W2EJ7GUMKGGBRPVZ3UA52MWCOJCPHA@3\windows-jdk8-m3.5.x_build\target\invoker-reports\BUILD-MJAVADOC-508.xml, f:\jenkins\jenkins-slave\workspace\javadoc-plugin_MJAVADOC-134-WD2D35IKVL5AMZLDC76FJ2W2EJ7GUMKGGBRPVZ3UA52MWCOJCPHA@3\windows-jdk8-m3.5.x_build\target\invoker-reports\BUILD-MJAVADOC-514_3rdparty-doclettags.xml, f:\jenkins\jenkins-slave\workspace\javadoc-plugin_MJAVADOC-134-WD2D35IKVL5AMZLDC76FJ2W2EJ7GUMKGGBRPVZ3UA52MWCOJCPHA@3\windows-jdk8-m3.5.x_build\target\invoker-reports\BUILD-MJAVADOC-528.xml, f:\jenkins\jenkins-slave\workspace\javadoc-plugin_MJAVADOC-134-WD2D35IKVL5AMZLDC76FJ2W2EJ7GUMKGGBRPVZ3UA52MWCOJCPHA@3\windows-jdk8-m3.5.x_build\target\invoker-reports\BUILD-MJAVADOC-538.xml, f:\jenkins\jenkins-slave\workspace\javadoc-plugin_MJAVADOC-134-WD2D35IKVL5AMZLDC76FJ2W2EJ7GUMKGGBRPVZ3UA52MWCOJCPHA@3\windows-jdk8-m3.5.x_build\target\invoker-reports\BUILD-additional-dependencies-non-aggregate.xml, f:\jenkins\jenkins-slave\workspace\javadoc-plugin_MJAVADOC-134-WD2D35IKVL5AMZLDC76FJ2W2EJ7GUMKGGBRPVZ3UA52MWCOJCPHA@3\windows-jdk8-m3.5.x_build\target\invoker-reports\BUILD-additional-dependencies.xml, f:\jenkins\jenkins-slave\workspace\javadoc-plugin_MJAVADOC-134-WD2D35IKVL5AMZLDC76FJ2W2EJ7GUMKGGBRPVZ3UA52MWCOJCPHA@3\windows-jdk8-m3.5.x_build\target\invoker-reports\BUILD-dependencySource-1.xml, f:\jenkins\jenkins-slave\workspace\javadoc-plugin_MJAVADOC-134-WD2D35IKVL5AMZLDC76FJ2W2EJ7GUMKGGBRPVZ3UA52MWCOJCPHA@3\windows-jdk8-m3.5.x_build\target\invoker-reports\BUILD-dependencySource-2.xml, f:\jenkins\jenkins-slave\workspace\javadoc-plugin_MJAVADOC-134-WD2D35IKVL5AMZLDC76FJ2W2EJ7GUMKGGBRPVZ3UA52MWCOJCPHA@3\windows-jdk8-m3.5.x_build\target\invoker-reports\BUILD-dependencySource-3.xml, f:\jenkins\jenkins-slave\workspace\javadoc-plugin_MJAVADOC-134-WD2D35IKVL5AMZLDC76FJ2W2EJ7GUMKGGBRPVZ3UA52MWCOJCPHA@3\windows-jdk8-m3.5.x_build\target\invoker-reports\BUILD-dependencySource-4.xml, f:\jenkins\jenkins-slave\workspace\javadoc-plugin_MJAVADOC-134-WD2D35IKVL5AMZLDC76FJ2W2EJ7GUMKGGBRPVZ3UA52MWCOJCPHA@3\windows-jdk8-m3.5.x_build\target\invoker-reports\BUILD-detectLinks.xml, f:\jenkins\jenkins-slave\workspace\javadoc-plugin_MJAVADOC-134-WD2D35IKVL5AMZLDC76FJ2W2EJ7GUMKGGBRPVZ3UA52MWCOJCPHA@3\windows-jdk8-m3.5.x_build\target\invoker-reports\BUILD-javadoc-fix.xml, f:\jenkins\jenkins-slave\workspace\javadoc-plugin_MJAVADOC-134-WD2D35IKVL5AMZLDC76FJ2W2EJ7GUMKGGBRPVZ3UA52MWCOJCPHA@3\windows-jdk8-m3.5.x_build\target\invoker-reports\BUILD-site-failOnError.xml]
[windows-jdk8-m3.5.x_build] Found logs:[f:\jenkins\jenkins-slave\workspace\javadoc-plugin_MJAVADOC-134-WD2D35IKVL5AMZLDC76FJ2W2EJ7GUMKGGBRPVZ3UA52MWCOJCPHA@3\windows-jdk8-m3.5.x_build\target\it\MJAVADOC-110\build.log, f:\jenkins\jenkins-slave\workspace\javadoc-plugin_MJAVADOC-134-WD2D35IKVL5AMZLDC76FJ2W2EJ7GUMKGGBRPVZ3UA52MWCOJCPHA@3\windows-jdk8-m3.5.x_build\target\it\MJAVADOC-126\build.log, f:\jenkins\jenkins-slave\workspace\javadoc-plugin_MJAVADOC-134-WD2D35IKVL5AMZLDC76FJ2W2EJ7GUMKGGBRPVZ3UA52MWCOJCPHA@3\windows-jdk8-m3.5.x_build\target\it\MJAVADOC-134_multiaggregate\build.log, f:\jenkins\jenkins-slave\workspace\javadoc-plugin_MJAVADOC-134-WD2D35IKVL5AMZLDC76FJ2W2EJ7GUMKGGBRPVZ3UA52MWCOJCPHA@3\windows-jdk8-m3.5.x_build\target\it\MJAVADOC-137\build.log, f:\jenkins\jenkins-slave\workspace\javadoc-plugin_MJAVADOC-134-WD2D35IKVL5AMZLDC76FJ2W2EJ7GUMKGGBRPVZ3UA52MWCOJCPHA@3\windows-jdk8-m3.5.x_build\target\it\MJAVADOC-172\build.log, f:\jenkins\jenkins-slave\workspace\javadoc-plugin_MJAVADOC-134-WD2D35IKVL5AMZLDC76FJ2W2EJ7GUMKGGBRPVZ3UA52MWCOJCPHA@3\windows-jdk8-m3.5.x_build\target\it\MJAVADOC-180\build.log, f:\jenkins\jenkins-slave\workspace\javadoc-plugin_MJAVADOC-134-WD2D35IKVL5AMZLDC76FJ2W2EJ7GUMKGGBRPVZ3UA52MWCOJCPHA@3\windows-jdk8-m3.5.x_build\target\it\MJAVADOC-194\build.log, f:\jenkins\jenkins-slave\workspace\javadoc-plugin_MJAVADOC-134-WD2D35IKVL5AMZLDC76FJ2W2EJ7GUMKGGBRPVZ3UA52MWCOJCPHA@3\windows-jdk8-m3.5.x_build\target\it\MJAVADOC-250\build.log, f:\jenkins\jenkins-slave\workspace\javadoc-plugin_MJAVADOC-134-WD2D35IKVL5AMZLDC76FJ2W2EJ7GUMKGGBRPVZ3UA52MWCOJCPHA@3\windows-jdk8-m3.5.x_build\target\it\MJAVADOC-257\build.log, f:\jenkins\jenkins-slave\workspace\javadoc-plugin_MJAVADOC-134-WD2D35IKVL5AMZLDC76FJ2W2EJ7GUMKGGBRPVZ3UA52MWCOJCPHA@3\windows-jdk8-m3.5.x_build\target\it\MJAVADOC-259\build.log, f:\jenkins\jenkins-slave\workspace\javadoc-plugin_MJAVADOC-134-WD2D35IKVL5AMZLDC76FJ2W2EJ7GUMKGGBRPVZ3UA52MWCOJCPHA@3\windows-jdk8-m3.5.x_build\target\it\MJAVADOC-262\build.log, f:\jenkins\jenkins-slave\workspace\javadoc-plugin_MJAVADOC-134-WD2D35IKVL5AMZLDC76FJ2W2EJ7GUMKGGBRPVZ3UA52MWCOJCPHA@3\windows-jdk8-m3.5.x_build\target\it\MJAVADOC-275\build.log, f:\jenkins\jenkins-slave\workspace\javadoc-plugin_MJAVADOC-134-WD2D35IKVL5AMZLDC76FJ2W2EJ7GUMKGGBRPVZ3UA52MWCOJCPHA@3\windows-jdk8-m3.5.x_build\target\it\MJAVADOC-278\build.log, f:\jenkins\jenkins-slave\workspace\javadoc-plugin_MJAVADOC-134-WD2D35IKVL5AMZLDC76FJ2W2EJ7GUMKGGBRPVZ3UA52MWCOJCPHA@3\windows-jdk8-m3.5.x_build\target\it\MJAVADOC-320\build.log, f:\jenkins\jenkins-slave\workspace\javadoc-plugin_MJAVADOC-134-WD2D35IKVL5AMZLDC76FJ2W2EJ7GUMKGGBRPVZ3UA52MWCOJCPHA@3\windows-jdk8-m3.5.x_build\target\it\MJAVADOC-325\build.log, f:\jenkins\jenkins-slave\workspace\javadoc-plugin_MJAVADOC-134-WD2D35IKVL5AMZLDC76FJ2W2EJ7GUMKGGBRPVZ3UA52MWCOJCPHA@3\windows-jdk8-m3.5.x_build\target\it\MJAVADOC-365\build.log, f:\jenkins\jenkins-slave\workspace\javadoc-plugin_MJAVADOC-134-WD2D35IKVL5AMZLDC76FJ2W2EJ7GUMKGGBRPVZ3UA52MWCOJCPHA@3\windows-jdk8-m3.5.x_build\target\it\MJAVADOC-369\build.log, f:\jenkins\jenkins-slave\workspace\javadoc-plugin_MJAVADOC-134-WD2D35IKVL5AMZLDC76FJ2W2EJ7GUMKGGBRPVZ3UA52MWCOJCPHA@3\windows-jdk8-m3.5.x_build\target\it\MJAVADOC-384\build.log, f:\jenkins\jenkins-slave\workspace\javadoc-plugin_MJAVADOC-134-WD2D35IKVL5AMZLDC76FJ2W2EJ7GUMKGGBRPVZ3UA52MWCOJCPHA@3\windows-jdk8-m3.5.x_build\target\it\MJAVADOC-407\build.log, f:\jenkins\jenkins-slave\workspace\javadoc-plugin_MJAVADOC-134-WD2D35IKVL5AMZLDC76FJ2W2EJ7GUMKGGBRPVZ3UA52MWCOJCPHA@3\windows-jdk8-m3.5.x_build\target\it\MJAVADOC-414\build.log, f:\jenkins\jenkins-slave\workspace\javadoc-plugin_MJAVADOC-134-WD2D35IKVL5AMZLDC76FJ2W2EJ7GUMKGGBRPVZ3UA52MWCOJCPHA@3\windows-jdk8-m3.5.x_build\target\it\MJAVADOC-420_fixparam\build.log, f:\jenkins\jenkins-slave\workspace\javadoc-plugin_MJAVADOC-134-WD2D35IKVL5AMZLDC76FJ2W2EJ7GUMKGGBRPVZ3UA52MWCOJCPHA@3\windows-jdk8-m3.5.x_build\target\it\MJAVADOC-427\build.log, f:\jenkins\jenkins-slave\workspace\javadoc-plugin_MJAVADOC-134-WD2D35IKVL5AMZLDC76FJ2W2EJ7GUMKGGBRPVZ3UA52MWCOJCPHA@3\windows-jdk8-m3.5.x_build\target\it\MJAVADOC-434_fixcompile\build.log, f:\jenkins\jenkins-slave\workspace\javadoc-plugin_MJAVADOC-134-WD2D35IKVL5AMZLDC76FJ2W2EJ7GUMKGGBRPVZ3UA52MWCOJCPHA@3\windows-jdk8-m3.5.x_build\target\it\MJAVADOC-437\build.log, f:\jenkins\jenkins-slave\workspace\javadoc-plugin_MJAVADOC-134-WD2D35IKVL5AMZLDC76FJ2W2EJ7GUMKGGBRPVZ3UA52MWCOJCPHA@3\windows-jdk8-m3.5.x_build\target\it\MJAVADOC-494_aggregate-repositories\build.log, f:\jenkins\jenkins-slave\workspace\javadoc-plugin_MJAVADOC-134-WD2D35IKVL5AMZLDC76FJ2W2EJ7GUMKGGBRPVZ3UA52MWCOJCPHA@3\windows-jdk8-m3.5.x_build\target\it\MJAVADOC-495_offline-filescheme\build.log, f:\jenkins\jenkins-slave\workspace\javadoc-plugin_MJAVADOC-134-WD2D35IKVL5AMZLDC76FJ2W2EJ7GUMKGGBRPVZ3UA52MWCOJCPHA@3\windows-jdk8-m3.5.x_build\target\it\MJAVADOC-497\build.log, f:\jenkins\jenkins-slave\workspace\javadoc-plugin_MJAVADOC-134-WD2D35IKVL5AMZLDC76FJ2W2EJ7GUMKGGBRPVZ3UA52MWCOJCPHA@3\windows-jdk8-m3.5.x_build\target\it\MJAVADOC-506_excl-module-info\build.log, f:\jenkins\jenkins-slave\workspace\javadoc-plugin_MJAVADOC-134-WD2D35IKVL5AMZLDC76FJ2W2EJ7GUMKGGBRPVZ3UA52MWCOJCPHA@3\windows-jdk8-m3.5.x_build\target\it\MJAVADOC-508\build.log, f:\jenkins\jenkins-slave\workspace\javadoc-plugin_MJAVADOC-134-WD2D35IKVL5AMZLDC76FJ2W2EJ7GUMKGGBRPVZ3UA52MWCOJCPHA@3\windows-jdk8-m3.5.x_build\target\it\MJAVADOC-514_3rdparty-doclettags\build.log, f:\jenkins\jenkins-slave\workspace\javadoc-plugin_MJAVADOC-134-WD2D35IKVL5AMZLDC76FJ2W2EJ7GUMKGGBRPVZ3UA52MWCOJCPHA@3\windows-jdk8-m3.5.x_build\target\it\MJAVADOC-528\build.log, f:\jenkins\jenkins-slave\workspace\javadoc-plugin_MJAVADOC-134-WD2D35IKVL5AMZLDC76FJ2W2EJ7GUMKGGBRPVZ3UA52MWCOJCPHA@3\windows-jdk8-m3.5.x_build\target\it\MJAVADOC-538\build.log, f:\jenkins\jenkins-slave\workspace\javadoc-plugin_MJAVADOC-134-WD2D35IKVL5AMZLDC76FJ2W2EJ7GUMKGGBRPVZ3UA52MWCOJCPHA@3\windows-jdk8-m3.5.x_build\target\it\additional-dependencies-non-aggregate\build.log, f:\jenkins\jenkins-slave\workspace\javadoc-plugin_MJAVADOC-134-WD2D35IKVL5AMZLDC76FJ2W2EJ7GUMKGGBRPVZ3UA52MWCOJCPHA@3\windows-jdk8-m3.5.x_build\target\it\additional-dependencies\build.log, f:\jenkins\jenkins-slave\workspace\javadoc-plugin_MJAVADOC-134-WD2D35IKVL5AMZLDC76FJ2W2EJ7GUMKGGBRPVZ3UA52MWCOJCPHA@3\windows-jdk8-m3.5.x_build\target\it\dependencySource-1\build.log, f:\jenkins\jenkins-slave\workspace\javadoc-plugin_MJAVADOC-134-WD2D35IKVL5AMZLDC76FJ2W2EJ7GUMKGGBRPVZ3UA52MWCOJCPHA@3\windows-jdk8-m3.5.x_build\target\it\dependencySource-2\build.log, f:\jenkins\jenkins-slave\workspace\javadoc-plugin_MJAVADOC-134-WD2D35IKVL5AMZLDC76FJ2W2EJ7GUMKGGBRPVZ3UA52MWCOJCPHA@3\windows-jdk8-m3.5.x_build\target\it\dependencySource-3\build.log, f:\jenkins\jenkins-slave\workspace\javadoc-plugin_MJAVADOC-134-WD2D35IKVL5AMZLDC76FJ2W2EJ7GUMKGGBRPVZ3UA52MWCOJCPHA@3\windows-jdk8-m3.5.x_build\target\it\dependencySource-4\build.log, f:\jenkins\jenkins-slave\workspace\javadoc-plugin_MJAVADOC-134-WD2D35IKVL5AMZLDC76FJ2W2EJ7GUMKGGBRPVZ3UA52MWCOJCPHA@3\windows-jdk8-m3.5.x_build\target\it\detectLinks\build.log, f:\jenkins\jenkins-slave\workspace\javadoc-plugin_MJAVADOC-134-WD2D35IKVL5AMZLDC76FJ2W2EJ7GUMKGGBRPVZ3UA52MWCOJCPHA@3\windows-jdk8-m3.5.x_build\target\it\javadoc-fix\build.log, f:\jenkins\jenkins-slave\workspace\javadoc-plugin_MJAVADOC-134-WD2D35IKVL5AMZLDC76FJ2W2EJ7GUMKGGBRPVZ3UA52MWCOJCPHA@3\windows-jdk8-m3.5.x_build\target\it\site-failOnError\build.log]
[windows-jdk8-m3.5.x_build] Finished parsing Maven Invoker results (found 45)
[windows-jdk8-m3.5.x_build] [withMaven] junitPublisher - Archive test results for Maven artifact org.apache.maven.plugins:maven-javadoc-plugin:3.0.2-SNAPSHOT generated by maven-surefire-plugin:test (default-test): windows-jdk8-m3.5.x_build\target\surefire-reports\*.xml
[windows-jdk8-m3.5.x_build] Recording test results
[windows-jdk8-m3.5.x_build] [withMaven] openTasksPublisher - Scan Tasks for Maven artifact org.apache.maven.plugins:maven-javadoc-plugin:3.0.2-SNAPSHOT in source directory windows-jdk8-m3.5.x_build\src\main\java
[windows-jdk8-m3.5.x_build] [TASKS] Scanning folder 'f:\jenkins\jenkins-slave\workspace\javadoc-plugin_MJAVADOC-134-WD2D35IKVL5AMZLDC76FJ2W2EJ7GUMKGGBRPVZ3UA52MWCOJCPHA@3' for files matching the pattern 'windows-jdk8-m3.5.x_build\src\main\java\**\*' - excludes: null
[windows-jdk8-m3.5.x_build] [TASKS] Found 24 files to scan for tasks
[windows-jdk8-m3.5.x_build] [TASKS] Found 7 open tasks.
[windows-jdk8-m3.5.x_build] Skipping warnings blame since pipelines do not have an SCM link.%n
[Pipeline] [windows-jdk10-m3.5.x_build] }
[windows-jdk10-m3.5.x_build] [withMaven] artifactsPublisher - Archive artifact windows-jdk10-m3.5.x_build\pom.xml under org\apache\maven\plugins\maven-javadoc-plugin\3.0.2-SNAPSHOT\maven-javadoc-plugin-3.0.2-SNAPSHOT.pom
[windows-jdk10-m3.5.x_build] [withMaven] artifactsPublisher - Archive artifact windows-jdk10-m3.5.x_build\target\maven-javadoc-plugin-3.0.2-SNAPSHOT.jar under org\apache\maven\plugins\maven-javadoc-plugin\3.0.2-SNAPSHOT\maven-javadoc-plugin-3.0.2-SNAPSHOT.jar
[windows-jdk10-m3.5.x_build] [Fast Archiver] No prior successful build to compare, so performing full copy of artifacts
[windows-jdk10-m3.5.x_build] [withMaven] invokerPublisher - Archive invoker results for Maven artifact MavenArtifact{org.apache.maven.plugins:maven-javadoc-plugin::3.0.2-SNAPSHOT(version: 3.0.2-SNAPSHOT, snapshot:false) } generated by PluginInvocation{org.apache.maven.plugins:maven-invoker-plugin:3.1.0@integration-test integration-test}: windows-jdk10-m3.5.x_build\target\invoker-reports\*.xml
[windows-jdk10-m3.5.x_build] performing MavenInvokerRecorder, reportsFilenamePattern:'**/windows-jdk10-m3.5.x_build\target\invoker-reports/BUILD*.xml', invokerBuildDir:'**/windows-jdk10-m3.5.x_build\target\it'
[windows-jdk10-m3.5.x_build] Found reports:[f:\jenkins\jenkins-slave\workspace\javadoc-plugin_MJAVADOC-134-WD2D35IKVL5AMZLDC76FJ2W2EJ7GUMKGGBRPVZ3UA52MWCOJCPHA@2@2\windows-jdk10-m3.5.x_build\target\invoker-reports\BUILD-MJAVADOC-110.xml, f:\jenkins\jenkins-slave\workspace\javadoc-plugin_MJAVADOC-134-WD2D35IKVL5AMZLDC76FJ2W2EJ7GUMKGGBRPVZ3UA52MWCOJCPHA@2@2\windows-jdk10-m3.5.x_build\target\invoker-reports\BUILD-MJAVADOC-126.xml, f:\jenkins\jenkins-slave\workspace\javadoc-plugin_MJAVADOC-134-WD2D35IKVL5AMZLDC76FJ2W2EJ7GUMKGGBRPVZ3UA52MWCOJCPHA@2@2\windows-jdk10-m3.5.x_build\target\invoker-reports\BUILD-MJAVADOC-134_multiaggregate.xml, f:\jenkins\jenkins-slave\workspace\javadoc-plugin_MJAVADOC-134-WD2D35IKVL5AMZLDC76FJ2W2EJ7GUMKGGBRPVZ3UA52MWCOJCPHA@2@2\windows-jdk10-m3.5.x_build\target\invoker-reports\BUILD-MJAVADOC-137.xml, f:\jenkins\jenkins-slave\workspace\javadoc-plugin_MJAVADOC-134-WD2D35IKVL5AMZLDC76FJ2W2EJ7GUMKGGBRPVZ3UA52MWCOJCPHA@2@2\windows-jdk10-m3.5.x_build\target\invoker-reports\BUILD-MJAVADOC-172.xml, f:\jenkins\jenkins-slave\workspace\javadoc-plugin_MJAVADOC-134-WD2D35IKVL5AMZLDC76FJ2W2EJ7GUMKGGBRPVZ3UA52MWCOJCPHA@2@2\windows-jdk10-m3.5.x_build\target\invoker-reports\BUILD-MJAVADOC-180.xml, f:\jenkins\jenkins-slave\workspace\javadoc-plugin_MJAVADOC-134-WD2D35IKVL5AMZLDC76FJ2W2EJ7GUMKGGBRPVZ3UA52MWCOJCPHA@2@2\windows-jdk10-m3.5.x_build\target\invoker-reports\BUILD-MJAVADOC-194.xml, f:\jenkins\jenkins-slave\workspace\javadoc-plugin_MJAVADOC-134-WD2D35IKVL5AMZLDC76FJ2W2EJ7GUMKGGBRPVZ3UA52MWCOJCPHA@2@2\windows-jdk10-m3.5.x_build\target\invoker-reports\BUILD-MJAVADOC-250.xml, f:\jenkins\jenkins-slave\workspace\javadoc-plugin_MJAVADOC-134-WD2D35IKVL5AMZLDC76FJ2W2EJ7GUMKGGBRPVZ3UA52MWCOJCPHA@2@2\windows-jdk10-m3.5.x_build\target\invoker-reports\BUILD-MJAVADOC-257.xml, f:\jenkins\jenkins-slave\workspace\javadoc-plugin_MJAVADOC-134-WD2D35IKVL5AMZLDC76FJ2W2EJ7GUMKGGBRPVZ3UA52MWCOJCPHA@2@2\windows-jdk10-m3.5.x_build\target\invoker-reports\BUILD-MJAVADOC-259.xml, f:\jenkins\jenkins-slave\workspace\javadoc-plugin_MJAVADOC-134-WD2D35IKVL5AMZLDC76FJ2W2EJ7GUMKGGBRPVZ3UA52MWCOJCPHA@2@2\windows-jdk10-m3.5.x_build\target\invoker-reports\BUILD-MJAVADOC-262.xml, f:\jenkins\jenkins-slave\workspace\javadoc-plugin_MJAVADOC-134-WD2D35IKVL5AMZLDC76FJ2W2EJ7GUMKGGBRPVZ3UA52MWCOJCPHA@2@2\windows-jdk10-m3.5.x_build\target\invoker-reports\BUILD-MJAVADOC-275.xml, f:\jenkins\jenkins-slave\workspace\javadoc-plugin_MJAVADOC-134-WD2D35IKVL5AMZLDC76FJ2W2EJ7GUMKGGBRPVZ3UA52MWCOJCPHA@2@2\windows-jdk10-m3.5.x_build\target\invoker-reports\BUILD-MJAVADOC-278.xml, f:\jenkins\jenkins-slave\workspace\javadoc-plugin_MJAVADOC-134-WD2D35IKVL5AMZLDC76FJ2W2EJ7GUMKGGBRPVZ3UA52MWCOJCPHA@2@2\windows-jdk10-m3.5.x_build\target\invoker-reports\BUILD-MJAVADOC-320.xml, f:\jenkins\jenkins-slave\workspace\javadoc-plugin_MJAVADOC-134-WD2D35IKVL5AMZLDC76FJ2W2EJ7GUMKGGBRPVZ3UA52MWCOJCPHA@2@2\windows-jdk10-m3.5.x_build\target\invoker-reports\BUILD-MJAVADOC-325.xml, f:\jenkins\jenkins-slave\workspace\javadoc-plugin_MJAVADOC-134-WD2D35IKVL5AMZLDC76FJ2W2EJ7GUMKGGBRPVZ3UA52MWCOJCPHA@2@2\windows-jdk10-m3.5.x_build\target\invoker-reports\BUILD-MJAVADOC-365.xml, f:\jenkins\jenkins-slave\workspace\javadoc-plugin_MJAVADOC-134-WD2D35IKVL5AMZLDC76FJ2W2EJ7GUMKGGBRPVZ3UA52MWCOJCPHA@2@2\windows-jdk10-m3.5.x_build\target\invoker-reports\BUILD-MJAVADOC-369.xml, f:\jenkins\jenkins-slave\workspace\javadoc-plugin_MJAVADOC-134-WD2D35IKVL5AMZLDC76FJ2W2EJ7GUMKGGBRPVZ3UA52MWCOJCPHA@2@2\windows-jdk10-m3.5.x_build\target\invoker-reports\BUILD-MJAVADOC-384.xml, f:\jenkins\jenkins-slave\workspace\javadoc-plugin_MJAVADOC-134-WD2D35IKVL5AMZLDC76FJ2W2EJ7GUMKGGBRPVZ3UA52MWCOJCPHA@2@2\windows-jdk10-m3.5.x_build\target\invoker-reports\BUILD-MJAVADOC-407.xml, f:\jenkins\jenkins-slave\workspace\javadoc-plugin_MJAVADOC-134-WD2D35IKVL5AMZLDC76FJ2W2EJ7GUMKGGBRPVZ3UA52MWCOJCPHA@2@2\windows-jdk10-m3.5.x_build\target\invoker-reports\BUILD-MJAVADOC-414.xml, f:\jenkins\jenkins-slave\workspace\javadoc-plugin_MJAVADOC-134-WD2D35IKVL5AMZLDC76FJ2W2EJ7GUMKGGBRPVZ3UA52MWCOJCPHA@2@2\windows-jdk10-m3.5.x_build\target\invoker-reports\BUILD-MJAVADOC-420_fixparam.xml, f:\jenkins\jenkins-slave\workspace\javadoc-plugin_MJAVADOC-134-WD2D35IKVL5AMZLDC76FJ2W2EJ7GUMKGGBRPVZ3UA52MWCOJCPHA@2@2\windows-jdk10-m3.5.x_build\target\invoker-reports\BUILD-MJAVADOC-427.xml, f:\jenkins\jenkins-slave\workspace\javadoc-plugin_MJAVADOC-134-WD2D35IKVL5AMZLDC76FJ2W2EJ7GUMKGGBRPVZ3UA52MWCOJCPHA@2@2\windows-jdk10-m3.5.x_build\target\invoker-reports\BUILD-MJAVADOC-434_fixcompile.xml, f:\jenkins\jenkins-slave\workspace\javadoc-plugin_MJAVADOC-134-WD2D35IKVL5AMZLDC76FJ2W2EJ7GUMKGGBRPVZ3UA52MWCOJCPHA@2@2\windows-jdk10-m3.5.x_build\target\invoker-reports\BUILD-MJAVADOC-437.xml, f:\jenkins\jenkins-slave\workspace\javadoc-plugin_MJAVADOC-134-WD2D35IKVL5AMZLDC76FJ2W2EJ7GUMKGGBRPVZ3UA52MWCOJCPHA@2@2\windows-jdk10-m3.5.x_build\target\invoker-reports\BUILD-MJAVADOC-449_aggr_modulepath.xml, f:\jenkins\jenkins-slave\workspace\javadoc-plugin_MJAVADOC-134-WD2D35IKVL5AMZLDC76FJ2W2EJ7GUMKGGBRPVZ3UA52MWCOJCPHA@2@2\windows-jdk10-m3.5.x_build\target\invoker-reports\BUILD-MJAVADOC-494_aggregate-repositories.xml, f:\jenkins\jenkins-slave\workspace\javadoc-plugin_MJAVADOC-134-WD2D35IKVL5AMZLDC76FJ2W2EJ7GUMKGGBRPVZ3UA52MWCOJCPHA@2@2\windows-jdk10-m3.5.x_build\target\invoker-reports\BUILD-MJAVADOC-495_offline-filescheme.xml, f:\jenkins\jenkins-slave\workspace\javadoc-plugin_MJAVADOC-134-WD2D35IKVL5AMZLDC76FJ2W2EJ7GUMKGGBRPVZ3UA52MWCOJCPHA@2@2\windows-jdk10-m3.5.x_build\target\invoker-reports\BUILD-MJAVADOC-497.xml, f:\jenkins\jenkins-slave\workspace\javadoc-plugin_MJAVADOC-134-WD2D35IKVL5AMZLDC76FJ2W2EJ7GUMKGGBRPVZ3UA52MWCOJCPHA@2@2\windows-jdk10-m3.5.x_build\target\invoker-reports\BUILD-MJAVADOC-498_aggr_modulepath.xml, f:\jenkins\jenkins-slave\workspace\javadoc-plugin_MJAVADOC-134-WD2D35IKVL5AMZLDC76FJ2W2EJ7GUMKGGBRPVZ3UA52MWCOJCPHA@2@2\windows-jdk10-m3.5.x_build\target\invoker-reports\BUILD-MJAVADOC-498_mm_modulepath.xml, f:\jenkins\jenkins-slave\workspace\javadoc-plugin_MJAVADOC-134-WD2D35IKVL5AMZLDC76FJ2W2EJ7GUMKGGBRPVZ3UA52MWCOJCPHA@2@2\windows-jdk10-m3.5.x_build\target\invoker-reports\BUILD-MJAVADOC-498_modulepath.xml, f:\jenkins\jenkins-slave\workspace\javadoc-plugin_MJAVADOC-134-WD2D35IKVL5AMZLDC76FJ2W2EJ7GUMKGGBRPVZ3UA52MWCOJCPHA@2@2\windows-jdk10-m3.5.x_build\target\invoker-reports\BUILD-MJAVADOC-506_excl-module-info.xml, f:\jenkins\jenkins-slave\workspace\javadoc-plugin_MJAVADOC-134-WD2D35IKVL5AMZLDC76FJ2W2EJ7GUMKGGBRPVZ3UA52MWCOJCPHA@2@2\windows-jdk10-m3.5.x_build\target\invoker-reports\BUILD-MJAVADOC-508.xml, f:\jenkins\jenkins-slave\workspace\javadoc-plugin_MJAVADOC-134-WD2D35IKVL5AMZLDC76FJ2W2EJ7GUMKGGBRPVZ3UA52MWCOJCPHA@2@2\windows-jdk10-m3.5.x_build\target\invoker-reports\BUILD-MJAVADOC-514_3rdparty-doclettags.xml, f:\jenkins\jenkins-slave\workspace\javadoc-plugin_MJAVADOC-134-WD2D35IKVL5AMZLDC76FJ2W2EJ7GUMKGGBRPVZ3UA52MWCOJCPHA@2@2\windows-jdk10-m3.5.x_build\target\invoker-reports\BUILD-MJAVADOC-528.xml, f:\jenkins\jenkins-slave\workspace\javadoc-plugin_MJAVADOC-134-WD2D35IKVL5AMZLDC76FJ2W2EJ7GUMKGGBRPVZ3UA52MWCOJCPHA@2@2\windows-jdk10-m3.5.x_build\target\invoker-reports\BUILD-MJAVADOC-538.xml, f:\jenkins\jenkins-slave\workspace\javadoc-plugin_MJAVADOC-134-WD2D35IKVL5AMZLDC76FJ2W2EJ7GUMKGGBRPVZ3UA52MWCOJCPHA@2@2\windows-jdk10-m3.5.x_build\target\invoker-reports\BUILD-additional-dependencies-non-aggregate.xml, f:\jenkins\jenkins-slave\workspace\javadoc-plugin_MJAVADOC-134-WD2D35IKVL5AMZLDC76FJ2W2EJ7GUMKGGBRPVZ3UA52MWCOJCPHA@2@2\windows-jdk10-m3.5.x_build\target\invoker-reports\BUILD-additional-dependencies.xml, f:\jenkins\jenkins-slave\workspace\javadoc-plugin_MJAVADOC-134-WD2D35IKVL5AMZLDC76FJ2W2EJ7GUMKGGBRPVZ3UA52MWCOJCPHA@2@2\windows-jdk10-m3.5.x_build\target\invoker-reports\BUILD-dependencySource-1.xml, f:\jenkins\jenkins-slave\workspace\javadoc-plugin_MJAVADOC-134-WD2D35IKVL5AMZLDC76FJ2W2EJ7GUMKGGBRPVZ3UA52MWCOJCPHA@2@2\windows-jdk10-m3.5.x_build\target\invoker-reports\BUILD-dependencySource-2.xml, f:\jenkins\jenkins-slave\workspace\javadoc-plugin_MJAVADOC-134-WD2D35IKVL5AMZLDC76FJ2W2EJ7GUMKGGBRPVZ3UA52MWCOJCPHA@2@2\windows-jdk10-m3.5.x_build\target\invoker-reports\BUILD-dependencySource-3.xml, f:\jenkins\jenkins-slave\workspace\javadoc-plugin_MJAVADOC-134-WD2D35IKVL5AMZLDC76FJ2W2EJ7GUMKGGBRPVZ3UA52MWCOJCPHA@2@2\windows-jdk10-m3.5.x_build\target\invoker-reports\BUILD-dependencySource-4.xml, f:\jenkins\jenkins-slave\workspace\javadoc-plugin_MJAVADOC-134-WD2D35IKVL5AMZLDC76FJ2W2EJ7GUMKGGBRPVZ3UA52MWCOJCPHA@2@2\windows-jdk10-m3.5.x_build\target\invoker-reports\BUILD-detectLinks.xml, f:\jenkins\jenkins-slave\workspace\javadoc-plugin_MJAVADOC-134-WD2D35IKVL5AMZLDC76FJ2W2EJ7GUMKGGBRPVZ3UA52MWCOJCPHA@2@2\windows-jdk10-m3.5.x_build\target\invoker-reports\BUILD-javadoc-fix.xml, f:\jenkins\jenkins-slave\workspace\javadoc-plugin_MJAVADOC-134-WD2D35IKVL5AMZLDC76FJ2W2EJ7GUMKGGBRPVZ3UA52MWCOJCPHA@2@2\windows-jdk10-m3.5.x_build\target\invoker-reports\BUILD-site-failOnError.xml]
[windows-jdk10-m3.5.x_build] Found logs:[f:\jenkins\jenkins-slave\workspace\javadoc-plugin_MJAVADOC-134-WD2D35IKVL5AMZLDC76FJ2W2EJ7GUMKGGBRPVZ3UA52MWCOJCPHA@2@2\windows-jdk10-m3.5.x_build\target\it\MJAVADOC-110\build.log, f:\jenkins\jenkins-slave\workspace\javadoc-plugin_MJAVADOC-134-WD2D35IKVL5AMZLDC76FJ2W2EJ7GUMKGGBRPVZ3UA52MWCOJCPHA@2@2\windows-jdk10-m3.5.x_build\target\it\MJAVADOC-126\build.log, f:\jenkins\jenkins-slave\workspace\javadoc-plugin_MJAVADOC-134-WD2D35IKVL5AMZLDC76FJ2W2EJ7GUMKGGBRPVZ3UA52MWCOJCPHA@2@2\windows-jdk10-m3.5.x_build\target\it\MJAVADOC-134_multiaggregate\build.log, f:\jenkins\jenkins-slave\workspace\javadoc-plugin_MJAVADOC-134-WD2D35IKVL5AMZLDC76FJ2W2EJ7GUMKGGBRPVZ3UA52MWCOJCPHA@2@2\windows-jdk10-m3.5.x_build\target\it\MJAVADOC-137\build.log, f:\jenkins\jenkins-slave\workspace\javadoc-plugin_MJAVADOC-134-WD2D35IKVL5AMZLDC76FJ2W2EJ7GUMKGGBRPVZ3UA52MWCOJCPHA@2@2\windows-jdk10-m3.5.x_build\target\it\MJAVADOC-172\build.log, f:\jenkins\jenkins-slave\workspace\javadoc-plugin_MJAVADOC-134-WD2D35IKVL5AMZLDC76FJ2W2EJ7GUMKGGBRPVZ3UA52MWCOJCPHA@2@2\windows-jdk10-m3.5.x_build\target\it\MJAVADOC-180\build.log, f:\jenkins\jenkins-slave\workspace\javadoc-plugin_MJAVADOC-134-WD2D35IKVL5AMZLDC76FJ2W2EJ7GUMKGGBRPVZ3UA52MWCOJCPHA@2@2\windows-jdk10-m3.5.x_build\target\it\MJAVADOC-194\build.log, f:\jenkins\jenkins-slave\workspace\javadoc-plugin_MJAVADOC-134-WD2D35IKVL5AMZLDC76FJ2W2EJ7GUMKGGBRPVZ3UA52MWCOJCPHA@2@2\windows-jdk10-m3.5.x_build\target\it\MJAVADOC-250\build.log, f:\jenkins\jenkins-slave\workspace\javadoc-plugin_MJAVADOC-134-WD2D35IKVL5AMZLDC76FJ2W2EJ7GUMKGGBRPVZ3UA52MWCOJCPHA@2@2\windows-jdk10-m3.5.x_build\target\it\MJAVADOC-259\build.log, f:\jenkins\jenkins-slave\workspace\javadoc-plugin_MJAVADOC-134-WD2D35IKVL5AMZLDC76FJ2W2EJ7GUMKGGBRPVZ3UA52MWCOJCPHA@2@2\windows-jdk10-m3.5.x_build\target\it\MJAVADOC-262\build.log, f:\jenkins\jenkins-slave\workspace\javadoc-plugin_MJAVADOC-134-WD2D35IKVL5AMZLDC76FJ2W2EJ7GUMKGGBRPVZ3UA52MWCOJCPHA@2@2\windows-jdk10-m3.5.x_build\target\it\MJAVADOC-275\build.log, f:\jenkins\jenkins-slave\workspace\javadoc-plugin_MJAVADOC-134-WD2D35IKVL5AMZLDC76FJ2W2EJ7GUMKGGBRPVZ3UA52MWCOJCPHA@2@2\windows-jdk10-m3.5.x_build\target\it\MJAVADOC-278\build.log, f:\jenkins\jenkins-slave\workspace\javadoc-plugin_MJAVADOC-134-WD2D35IKVL5AMZLDC76FJ2W2EJ7GUMKGGBRPVZ3UA52MWCOJCPHA@2@2\windows-jdk10-m3.5.x_build\target\it\MJAVADOC-320\build.log, f:\jenkins\jenkins-slave\workspace\javadoc-plugin_MJAVADOC-134-WD2D35IKVL5AMZLDC76FJ2W2EJ7GUMKGGBRPVZ3UA52MWCOJCPHA@2@2\windows-jdk10-m3.5.x_build\target\it\MJAVADOC-325\build.log, f:\jenkins\jenkins-slave\workspace\javadoc-plugin_MJAVADOC-134-WD2D35IKVL5AMZLDC76FJ2W2EJ7GUMKGGBRPVZ3UA52MWCOJCPHA@2@2\windows-jdk10-m3.5.x_build\target\it\MJAVADOC-365\build.log, f:\jenkins\jenkins-slave\workspace\javadoc-plugin_MJAVADOC-134-WD2D35IKVL5AMZLDC76FJ2W2EJ7GUMKGGBRPVZ3UA52MWCOJCPHA@2@2\windows-jdk10-m3.5.x_build\target\it\MJAVADOC-369\build.log, f:\jenkins\jenkins-slave\workspace\javadoc-plugin_MJAVADOC-134-WD2D35IKVL5AMZLDC76FJ2W2EJ7GUMKGGBRPVZ3UA52MWCOJCPHA@2@2\windows-jdk10-m3.5.x_build\target\it\MJAVADOC-384\build.log, f:\jenkins\jenkins-slave\workspace\javadoc-plugin_MJAVADOC-134-WD2D35IKVL5AMZLDC76FJ2W2EJ7GUMKGGBRPVZ3UA52MWCOJCPHA@2@2\windows-jdk10-m3.5.x_build\target\it\MJAVADOC-407\build.log, f:\jenkins\jenkins-slave\workspace\javadoc-plugin_MJAVADOC-134-WD2D35IKVL5AMZLDC76FJ2W2EJ7GUMKGGBRPVZ3UA52MWCOJCPHA@2@2\windows-jdk10-m3.5.x_build\target\it\MJAVADOC-414\build.log, f:\jenkins\jenkins-slave\workspace\javadoc-plugin_MJAVADOC-134-WD2D35IKVL5AMZLDC76FJ2W2EJ7GUMKGGBRPVZ3UA52MWCOJCPHA@2@2\windows-jdk10-m3.5.x_build\target\it\MJAVADOC-420_fixparam\build.log, f:\jenkins\jenkins-slave\workspace\javadoc-plugin_MJAVADOC-134-WD2D35IKVL5AMZLDC76FJ2W2EJ7GUMKGGBRPVZ3UA52MWCOJCPHA@2@2\windows-jdk10-m3.5.x_build\target\it\MJAVADOC-427\build.log, f:\jenkins\jenkins-slave\workspace\javadoc-plugin_MJAVADOC-134-WD2D35IKVL5AMZLDC76FJ2W2EJ7GUMKGGBRPVZ3UA52MWCOJCPHA@2@2\windows-jdk10-m3.5.x_build\target\it\MJAVADOC-434_fixcompile\build.log, f:\jenkins\jenkins-slave\workspace\javadoc-plugin_MJAVADOC-134-WD2D35IKVL5AMZLDC76FJ2W2EJ7GUMKGGBRPVZ3UA52MWCOJCPHA@2@2\windows-jdk10-m3.5.x_build\target\it\MJAVADOC-437\build.log, f:\jenkins\jenkins-slave\workspace\javadoc-plugin_MJAVADOC-134-WD2D35IKVL5AMZLDC76FJ2W2EJ7GUMKGGBRPVZ3UA52MWCOJCPHA@2@2\windows-jdk10-m3.5.x_build\target\it\MJAVADOC-449_aggr_modulepath\build.log, f:\jenkins\jenkins-slave\workspace\javadoc-plugin_MJAVADOC-134-WD2D35IKVL5AMZLDC76FJ2W2EJ7GUMKGGBRPVZ3UA52MWCOJCPHA@2@2\windows-jdk10-m3.5.x_build\target\it\MJAVADOC-494_aggregate-repositories\build.log, f:\jenkins\jenkins-slave\workspace\javadoc-plugin_MJAVADOC-134-WD2D35IKVL5AMZLDC76FJ2W2EJ7GUMKGGBRPVZ3UA52MWCOJCPHA@2@2\windows-jdk10-m3.5.x_build\target\it\MJAVADOC-495_offline-filescheme\build.log, f:\jenkins\jenkins-slave\workspace\javadoc-plugin_MJAVADOC-134-WD2D35IKVL5AMZLDC76FJ2W2EJ7GUMKGGBRPVZ3UA52MWCOJCPHA@2@2\windows-jdk10-m3.5.x_build\target\it\MJAVADOC-497\build.log, f:\jenkins\jenkins-slave\workspace\javadoc-plugin_MJAVADOC-134-WD2D35IKVL5AMZLDC76FJ2W2EJ7GUMKGGBRPVZ3UA52MWCOJCPHA@2@2\windows-jdk10-m3.5.x_build\target\it\MJAVADOC-498_aggr_modulepath\build.log, f:\jenkins\jenkins-slave\workspace\javadoc-plugin_MJAVADOC-134-WD2D35IKVL5AMZLDC76FJ2W2EJ7GUMKGGBRPVZ3UA52MWCOJCPHA@2@2\windows-jdk10-m3.5.x_build\target\it\MJAVADOC-498_mm_modulepath\build.log, f:\jenkins\jenkins-slave\workspace\javadoc-plugin_MJAVADOC-134-WD2D35IKVL5AMZLDC76FJ2W2EJ7GUMKGGBRPVZ3UA52MWCOJCPHA@2@2\windows-jdk10-m3.5.x_build\target\it\MJAVADOC-498_modulepath\build.log, f:\jenkins\jenkins-slave\workspace\javadoc-plugin_MJAVADOC-134-WD2D35IKVL5AMZLDC76FJ2W2EJ7GUMKGGBRPVZ3UA52MWCOJCPHA@2@2\windows-jdk10-m3.5.x_build\target\it\MJAVADOC-506_excl-module-info\build.log, f:\jenkins\jenkins-slave\workspace\javadoc-plugin_MJAVADOC-134-WD2D35IKVL5AMZLDC76FJ2W2EJ7GUMKGGBRPVZ3UA52MWCOJCPHA@2@2\windows-jdk10-m3.5.x_build\target\it\MJAVADOC-508\build.log, f:\jenkins\jenkins-slave\workspace\javadoc-plugin_MJAVADOC-134-WD2D35IKVL5AMZLDC76FJ2W2EJ7GUMKGGBRPVZ3UA52MWCOJCPHA@2@2\windows-jdk10-m3.5.x_build\target\it\MJAVADOC-514_3rdparty-doclettags\build.log, f:\jenkins\jenkins-slave\workspace\javadoc-plugin_MJAVADOC-134-WD2D35IKVL5AMZLDC76FJ2W2EJ7GUMKGGBRPVZ3UA52MWCOJCPHA@2@2\windows-jdk10-m3.5.x_build\target\it\MJAVADOC-528\build.log, f:\jenkins\jenkins-slave\workspace\javadoc-plugin_MJAVADOC-134-WD2D35IKVL5AMZLDC76FJ2W2EJ7GUMKGGBRPVZ3UA52MWCOJCPHA@2@2\windows-jdk10-m3.5.x_build\target\it\MJAVADOC-538\build.log, f:\jenkins\jenkins-slave\workspace\javadoc-plugin_MJAVADOC-134-WD2D35IKVL5AMZLDC76FJ2W2EJ7GUMKGGBRPVZ3UA52MWCOJCPHA@2@2\windows-jdk10-m3.5.x_build\target\it\additional-dependencies-non-aggregate\build.log, f:\jenkins\jenkins-slave\workspace\javadoc-plugin_MJAVADOC-134-WD2D35IKVL5AMZLDC76FJ2W2EJ7GUMKGGBRPVZ3UA52MWCOJCPHA@2@2\windows-jdk10-m3.5.x_build\target\it\additional-dependencies\build.log, f:\jenkins\jenkins-slave\workspace\javadoc-plugin_MJAVADOC-134-WD2D35IKVL5AMZLDC76FJ2W2EJ7GUMKGGBRPVZ3UA52MWCOJCPHA@2@2\windows-jdk10-m3.5.x_build\target\it\dependencySource-1\build.log, f:\jenkins\jenkins-slave\workspace\javadoc-plugin_MJAVADOC-134-WD2D35IKVL5AMZLDC76FJ2W2EJ7GUMKGGBRPVZ3UA52MWCOJCPHA@2@2\windows-jdk10-m3.5.x_build\target\it\dependencySource-2\build.log, f:\jenkins\jenkins-slave\workspace\javadoc-plugin_MJAVADOC-134-WD2D35IKVL5AMZLDC76FJ2W2EJ7GUMKGGBRPVZ3UA52MWCOJCPHA@2@2\windows-jdk10-m3.5.x_build\target\it\dependencySource-3\build.log, f:\jenkins\jenkins-slave\workspace\javadoc-plugin_MJAVADOC-134-WD2D35IKVL5AMZLDC76FJ2W2EJ7GUMKGGBRPVZ3UA52MWCOJCPHA@2@2\windows-jdk10-m3.5.x_build\target\it\dependencySource-4\build.log, f:\jenkins\jenkins-slave\workspace\javadoc-plugin_MJAVADOC-134-WD2D35IKVL5AMZLDC76FJ2W2EJ7GUMKGGBRPVZ3UA52MWCOJCPHA@2@2\windows-jdk10-m3.5.x_build\target\it\detectLinks\build.log, f:\jenkins\jenkins-slave\workspace\javadoc-plugin_MJAVADOC-134-WD2D35IKVL5AMZLDC76FJ2W2EJ7GUMKGGBRPVZ3UA52MWCOJCPHA@2@2\windows-jdk10-m3.5.x_build\target\it\javadoc-fix\build.log, f:\jenkins\jenkins-slave\workspace\javadoc-plugin_MJAVADOC-134-WD2D35IKVL5AMZLDC76FJ2W2EJ7GUMKGGBRPVZ3UA52MWCOJCPHA@2@2\windows-jdk10-m3.5.x_build\target\it\site-failOnError\build.log]
[windows-jdk10-m3.5.x_build] Finished parsing Maven Invoker results (found 45)
[windows-jdk10-m3.5.x_build] [withMaven] junitPublisher - Archive test results for Maven artifact org.apache.maven.plugins:maven-javadoc-plugin:3.0.2-SNAPSHOT generated by maven-surefire-plugin:test (default-test): windows-jdk10-m3.5.x_build\target\surefire-reports\*.xml
[windows-jdk10-m3.5.x_build] Recording test results
[windows-jdk10-m3.5.x_build] [withMaven] openTasksPublisher - Scan Tasks for Maven artifact org.apache.maven.plugins:maven-javadoc-plugin:3.0.2-SNAPSHOT in source directory windows-jdk10-m3.5.x_build\src\main\java
[windows-jdk10-m3.5.x_build] [TASKS] Scanning folder 'f:\jenkins\jenkins-slave\workspace\javadoc-plugin_MJAVADOC-134-WD2D35IKVL5AMZLDC76FJ2W2EJ7GUMKGGBRPVZ3UA52MWCOJCPHA@2@2' for files matching the pattern 'windows-jdk10-m3.5.x_build\src\main\java\**\*' - excludes: null
[windows-jdk10-m3.5.x_build] [TASKS] Found 24 files to scan for tasks
[windows-jdk10-m3.5.x_build] [TASKS] Found 7 open tasks.
[windows-jdk10-m3.5.x_build] Skipping warnings blame since pipelines do not have an SCM link.%n
[Pipeline] [windows-jdk7-m3.2.x_build] }
[windows-jdk7-m3.2.x_build] [withMaven] artifactsPublisher - Archive artifact windows-jdk7-m3.2.x_build\pom.xml under org\apache\maven\plugins\maven-javadoc-plugin\3.0.2-SNAPSHOT\maven-javadoc-plugin-3.0.2-SNAPSHOT.pom
[windows-jdk7-m3.2.x_build] [withMaven] artifactsPublisher - Archive artifact windows-jdk7-m3.2.x_build\target\maven-javadoc-plugin-3.0.2-SNAPSHOT.jar under org\apache\maven\plugins\maven-javadoc-plugin\3.0.2-SNAPSHOT\maven-javadoc-plugin-3.0.2-SNAPSHOT.jar
[windows-jdk7-m3.2.x_build] [Fast Archiver] No prior successful build to compare, so performing full copy of artifacts
[windows-jdk7-m3.2.x_build] [withMaven] invokerPublisher - Archive invoker results for Maven artifact MavenArtifact{org.apache.maven.plugins:maven-javadoc-plugin::3.0.2-SNAPSHOT(version: 3.0.2-SNAPSHOT, snapshot:false) } generated by PluginInvocation{org.apache.maven.plugins:maven-invoker-plugin:3.1.0@integration-test integration-test}: windows-jdk7-m3.2.x_build\target\invoker-reports\*.xml
[windows-jdk7-m3.2.x_build] performing MavenInvokerRecorder, reportsFilenamePattern:'**/windows-jdk7-m3.2.x_build\target\invoker-reports/BUILD*.xml', invokerBuildDir:'**/windows-jdk7-m3.2.x_build\target\it'
[windows-jdk7-m3.2.x_build] Found reports:[f:\jenkins\jenkins-slave\workspace\javadoc-plugin_MJAVADOC-134-WD2D35IKVL5AMZLDC76FJ2W2EJ7GUMKGGBRPVZ3UA52MWCOJCPHA@2\windows-jdk7-m3.2.x_build\target\invoker-reports\BUILD-MJAVADOC-110.xml, f:\jenkins\jenkins-slave\workspace\javadoc-plugin_MJAVADOC-134-WD2D35IKVL5AMZLDC76FJ2W2EJ7GUMKGGBRPVZ3UA52MWCOJCPHA@2\windows-jdk7-m3.2.x_build\target\invoker-reports\BUILD-MJAVADOC-126.xml, f:\jenkins\jenkins-slave\workspace\javadoc-plugin_MJAVADOC-134-WD2D35IKVL5AMZLDC76FJ2W2EJ7GUMKGGBRPVZ3UA52MWCOJCPHA@2\windows-jdk7-m3.2.x_build\target\invoker-reports\BUILD-MJAVADOC-134_multiaggregate.xml, f:\jenkins\jenkins-slave\workspace\javadoc-plugin_MJAVADOC-134-WD2D35IKVL5AMZLDC76FJ2W2EJ7GUMKGGBRPVZ3UA52MWCOJCPHA@2\windows-jdk7-m3.2.x_build\target\invoker-reports\BUILD-MJAVADOC-137.xml, f:\jenkins\jenkins-slave\workspace\javadoc-plugin_MJAVADOC-134-WD2D35IKVL5AMZLDC76FJ2W2EJ7GUMKGGBRPVZ3UA52MWCOJCPHA@2\windows-jdk7-m3.2.x_build\target\invoker-reports\BUILD-MJAVADOC-172.xml, f:\jenkins\jenkins-slave\workspace\javadoc-plugin_MJAVADOC-134-WD2D35IKVL5AMZLDC76FJ2W2EJ7GUMKGGBRPVZ3UA52MWCOJCPHA@2\windows-jdk7-m3.2.x_build\target\invoker-reports\BUILD-MJAVADOC-180.xml, f:\jenkins\jenkins-slave\workspace\javadoc-plugin_MJAVADOC-134-WD2D35IKVL5AMZLDC76FJ2W2EJ7GUMKGGBRPVZ3UA52MWCOJCPHA@2\windows-jdk7-m3.2.x_build\target\invoker-reports\BUILD-MJAVADOC-194.xml, f:\jenkins\jenkins-slave\workspace\javadoc-plugin_MJAVADOC-134-WD2D35IKVL5AMZLDC76FJ2W2EJ7GUMKGGBRPVZ3UA52MWCOJCPHA@2\windows-jdk7-m3.2.x_build\target\invoker-reports\BUILD-MJAVADOC-250.xml, f:\jenkins\jenkins-slave\workspace\javadoc-plugin_MJAVADOC-134-WD2D35IKVL5AMZLDC76FJ2W2EJ7GUMKGGBRPVZ3UA52MWCOJCPHA@2\windows-jdk7-m3.2.x_build\target\invoker-reports\BUILD-MJAVADOC-257.xml, f:\jenkins\jenkins-slave\workspace\javadoc-plugin_MJAVADOC-134-WD2D35IKVL5AMZLDC76FJ2W2EJ7GUMKGGBRPVZ3UA52MWCOJCPHA@2\windows-jdk7-m3.2.x_build\target\invoker-reports\BUILD-MJAVADOC-259.xml, f:\jenkins\jenkins-slave\workspace\javadoc-plugin_MJAVADOC-134-WD2D35IKVL5AMZLDC76FJ2W2EJ7GUMKGGBRPVZ3UA52MWCOJCPHA@2\windows-jdk7-m3.2.x_build\target\invoker-reports\BUILD-MJAVADOC-262.xml, f:\jenkins\jenkins-slave\workspace\javadoc-plugin_MJAVADOC-134-WD2D35IKVL5AMZLDC76FJ2W2EJ7GUMKGGBRPVZ3UA52MWCOJCPHA@2\windows-jdk7-m3.2.x_build\target\invoker-reports\BUILD-MJAVADOC-275.xml, f:\jenkins\jenkins-slave\workspace\javadoc-plugin_MJAVADOC-134-WD2D35IKVL5AMZLDC76FJ2W2EJ7GUMKGGBRPVZ3UA52MWCOJCPHA@2\windows-jdk7-m3.2.x_build\target\invoker-reports\BUILD-MJAVADOC-278.xml, f:\jenkins\jenkins-slave\workspace\javadoc-plugin_MJAVADOC-134-WD2D35IKVL5AMZLDC76FJ2W2EJ7GUMKGGBRPVZ3UA52MWCOJCPHA@2\windows-jdk7-m3.2.x_build\target\invoker-reports\BUILD-MJAVADOC-320.xml, f:\jenkins\jenkins-slave\workspace\javadoc-plugin_MJAVADOC-134-WD2D35IKVL5AMZLDC76FJ2W2EJ7GUMKGGBRPVZ3UA52MWCOJCPHA@2\windows-jdk7-m3.2.x_build\target\invoker-reports\BUILD-MJAVADOC-325.xml, f:\jenkins\jenkins-slave\workspace\javadoc-plugin_MJAVADOC-134-WD2D35IKVL5AMZLDC76FJ2W2EJ7GUMKGGBRPVZ3UA52MWCOJCPHA@2\windows-jdk7-m3.2.x_build\target\invoker-reports\BUILD-MJAVADOC-365.xml, f:\jenkins\jenkins-slave\workspace\javadoc-plugin_MJAVADOC-134-WD2D35IKVL5AMZLDC76FJ2W2EJ7GUMKGGBRPVZ3UA52MWCOJCPHA@2\windows-jdk7-m3.2.x_build\target\invoker-reports\BUILD-MJAVADOC-369.xml, f:\jenkins\jenkins-slave\workspace\javadoc-plugin_MJAVADOC-134-WD2D35IKVL5AMZLDC76FJ2W2EJ7GUMKGGBRPVZ3UA52MWCOJCPHA@2\windows-jdk7-m3.2.x_build\target\invoker-reports\BUILD-MJAVADOC-384.xml, f:\jenkins\jenkins-slave\workspace\javadoc-plugin_MJAVADOC-134-WD2D35IKVL5AMZLDC76FJ2W2EJ7GUMKGGBRPVZ3UA52MWCOJCPHA@2\windows-jdk7-m3.2.x_build\target\invoker-reports\BUILD-MJAVADOC-407.xml, f:\jenkins\jenkins-slave\workspace\javadoc-plugin_MJAVADOC-134-WD2D35IKVL5AMZLDC76FJ2W2EJ7GUMKGGBRPVZ3UA52MWCOJCPHA@2\windows-jdk7-m3.2.x_build\target\invoker-reports\BUILD-MJAVADOC-414.xml, f:\jenkins\jenkins-slave\workspace\javadoc-plugin_MJAVADOC-134-WD2D35IKVL5AMZLDC76FJ2W2EJ7GUMKGGBRPVZ3UA52MWCOJCPHA@2\windows-jdk7-m3.2.x_build\target\invoker-reports\BUILD-MJAVADOC-420_fixparam.xml, f:\jenkins\jenkins-slave\workspace\javadoc-plugin_MJAVADOC-134-WD2D35IKVL5AMZLDC76FJ2W2EJ7GUMKGGBRPVZ3UA52MWCOJCPHA@2\windows-jdk7-m3.2.x_build\target\invoker-reports\BUILD-MJAVADOC-427.xml, f:\jenkins\jenkins-slave\workspace\javadoc-plugin_MJAVADOC-134-WD2D35IKVL5AMZLDC76FJ2W2EJ7GUMKGGBRPVZ3UA52MWCOJCPHA@2\windows-jdk7-m3.2.x_build\target\invoker-reports\BUILD-MJAVADOC-434_fixcompile.xml, f:\jenkins\jenkins-slave\workspace\javadoc-plugin_MJAVADOC-134-WD2D35IKVL5AMZLDC76FJ2W2EJ7GUMKGGBRPVZ3UA52MWCOJCPHA@2\windows-jdk7-m3.2.x_build\target\invoker-reports\BUILD-MJAVADOC-437.xml, f:\jenkins\jenkins-slave\workspace\javadoc-plugin_MJAVADOC-134-WD2D35IKVL5AMZLDC76FJ2W2EJ7GUMKGGBRPVZ3UA52MWCOJCPHA@2\windows-jdk7-m3.2.x_build\target\invoker-reports\BUILD-MJAVADOC-449_aggr_modulepath.xml, f:\jenkins\jenkins-slave\workspace\javadoc-plugin_MJAVADOC-134-WD2D35IKVL5AMZLDC76FJ2W2EJ7GUMKGGBRPVZ3UA52MWCOJCPHA@2\windows-jdk7-m3.2.x_build\target\invoker-reports\BUILD-MJAVADOC-494_aggregate-repositories.xml, f:\jenkins\jenkins-slave\workspace\javadoc-plugin_MJAVADOC-134-WD2D35IKVL5AMZLDC76FJ2W2EJ7GUMKGGBRPVZ3UA52MWCOJCPHA@2\windows-jdk7-m3.2.x_build\target\invoker-reports\BUILD-MJAVADOC-495_offline-filescheme.xml, f:\jenkins\jenkins-slave\workspace\javadoc-plugin_MJAVADOC-134-WD2D35IKVL5AMZLDC76FJ2W2EJ7GUMKGGBRPVZ3UA52MWCOJCPHA@2\windows-jdk7-m3.2.x_build\target\invoker-reports\BUILD-MJAVADOC-497.xml, f:\jenkins\jenkins-slave\workspace\javadoc-plugin_MJAVADOC-134-WD2D35IKVL5AMZLDC76FJ2W2EJ7GUMKGGBRPVZ3UA52MWCOJCPHA@2\windows-jdk7-m3.2.x_build\target\invoker-reports\BUILD-MJAVADOC-498_aggr_modulepath.xml, f:\jenkins\jenkins-slave\workspace\javadoc-plugin_MJAVADOC-134-WD2D35IKVL5AMZLDC76FJ2W2EJ7GUMKGGBRPVZ3UA52MWCOJCPHA@2\windows-jdk7-m3.2.x_build\target\invoker-reports\BUILD-MJAVADOC-498_mm_modulepath.xml, f:\jenkins\jenkins-slave\workspace\javadoc-plugin_MJAVADOC-134-WD2D35IKVL5AMZLDC76FJ2W2EJ7GUMKGGBRPVZ3UA52MWCOJCPHA@2\windows-jdk7-m3.2.x_build\target\invoker-reports\BUILD-MJAVADOC-498_modulepath.xml, f:\jenkins\jenkins-slave\workspace\javadoc-plugin_MJAVADOC-134-WD2D35IKVL5AMZLDC76FJ2W2EJ7GUMKGGBRPVZ3UA52MWCOJCPHA@2\windows-jdk7-m3.2.x_build\target\invoker-reports\BUILD-MJAVADOC-506_excl-module-info.xml, f:\jenkins\jenkins-slave\workspace\javadoc-plugin_MJAVADOC-134-WD2D35IKVL5AMZLDC76FJ2W2EJ7GUMKGGBRPVZ3UA52MWCOJCPHA@2\windows-jdk7-m3.2.x_build\target\invoker-reports\BUILD-MJAVADOC-508.xml, f:\jenkins\jenkins-slave\workspace\javadoc-plugin_MJAVADOC-134-WD2D35IKVL5AMZLDC76FJ2W2EJ7GUMKGGBRPVZ3UA52MWCOJCPHA@2\windows-jdk7-m3.2.x_build\target\invoker-reports\BUILD-MJAVADOC-514_3rdparty-doclettags.xml, f:\jenkins\jenkins-slave\workspace\javadoc-plugin_MJAVADOC-134-WD2D35IKVL5AMZLDC76FJ2W2EJ7GUMKGGBRPVZ3UA52MWCOJCPHA@2\windows-jdk7-m3.2.x_build\target\invoker-reports\BUILD-MJAVADOC-528.xml, f:\jenkins\jenkins-slave\workspace\javadoc-plugin_MJAVADOC-134-WD2D35IKVL5AMZLDC76FJ2W2EJ7GUMKGGBRPVZ3UA52MWCOJCPHA@2\windows-jdk7-m3.2.x_build\target\invoker-reports\BUILD-MJAVADOC-538.xml, f:\jenkins\jenkins-slave\workspace\javadoc-plugin_MJAVADOC-134-WD2D35IKVL5AMZLDC76FJ2W2EJ7GUMKGGBRPVZ3UA52MWCOJCPHA@2\windows-jdk7-m3.2.x_build\target\invoker-reports\BUILD-additional-dependencies-non-aggregate.xml, f:\jenkins\jenkins-slave\workspace\javadoc-plugin_MJAVADOC-134-WD2D35IKVL5AMZLDC76FJ2W2EJ7GUMKGGBRPVZ3UA52MWCOJCPHA@2\windows-jdk7-m3.2.x_build\target\invoker-reports\BUILD-additional-dependencies.xml, f:\jenkins\jenkins-slave\workspace\javadoc-plugin_MJAVADOC-134-WD2D35IKVL5AMZLDC76FJ2W2EJ7GUMKGGBRPVZ3UA52MWCOJCPHA@2\windows-jdk7-m3.2.x_build\target\invoker-reports\BUILD-dependencySource-1.xml, f:\jenkins\jenkins-slave\workspace\javadoc-plugin_MJAVADOC-134-WD2D35IKVL5AMZLDC76FJ2W2EJ7GUMKGGBRPVZ3UA52MWCOJCPHA@2\windows-jdk7-m3.2.x_build\target\invoker-reports\BUILD-dependencySource-2.xml, f:\jenkins\jenkins-slave\workspace\javadoc-plugin_MJAVADOC-134-WD2D35IKVL5AMZLDC76FJ2W2EJ7GUMKGGBRPVZ3UA52MWCOJCPHA@2\windows-jdk7-m3.2.x_build\target\invoker-reports\BUILD-dependencySource-3.xml, f:\jenkins\jenkins-slave\workspace\javadoc-plugin_MJAVADOC-134-WD2D35IKVL5AMZLDC76FJ2W2EJ7GUMKGGBRPVZ3UA52MWCOJCPHA@2\windows-jdk7-m3.2.x_build\target\invoker-reports\BUILD-dependencySource-4.xml, f:\jenkins\jenkins-slave\workspace\javadoc-plugin_MJAVADOC-134-WD2D35IKVL5AMZLDC76FJ2W2EJ7GUMKGGBRPVZ3UA52MWCOJCPHA@2\windows-jdk7-m3.2.x_build\target\invoker-reports\BUILD-detectLinks.xml, f:\jenkins\jenkins-slave\workspace\javadoc-plugin_MJAVADOC-134-WD2D35IKVL5AMZLDC76FJ2W2EJ7GUMKGGBRPVZ3UA52MWCOJCPHA@2\windows-jdk7-m3.2.x_build\target\invoker-reports\BUILD-javadoc-fix.xml, f:\jenkins\jenkins-slave\workspace\javadoc-plugin_MJAVADOC-134-WD2D35IKVL5AMZLDC76FJ2W2EJ7GUMKGGBRPVZ3UA52MWCOJCPHA@2\windows-jdk7-m3.2.x_build\target\invoker-reports\BUILD-site-failOnError.xml]
[windows-jdk7-m3.2.x_build] Found logs:[f:\jenkins\jenkins-slave\workspace\javadoc-plugin_MJAVADOC-134-WD2D35IKVL5AMZLDC76FJ2W2EJ7GUMKGGBRPVZ3UA52MWCOJCPHA@2\windows-jdk7-m3.2.x_build\target\it\MJAVADOC-110\build.log, f:\jenkins\jenkins-slave\workspace\javadoc-plugin_MJAVADOC-134-WD2D35IKVL5AMZLDC76FJ2W2EJ7GUMKGGBRPVZ3UA52MWCOJCPHA@2\windows-jdk7-m3.2.x_build\target\it\MJAVADOC-126\build.log, f:\jenkins\jenkins-slave\workspace\javadoc-plugin_MJAVADOC-134-WD2D35IKVL5AMZLDC76FJ2W2EJ7GUMKGGBRPVZ3UA52MWCOJCPHA@2\windows-jdk7-m3.2.x_build\target\it\MJAVADOC-134_multiaggregate\build.log, f:\jenkins\jenkins-slave\workspace\javadoc-plugin_MJAVADOC-134-WD2D35IKVL5AMZLDC76FJ2W2EJ7GUMKGGBRPVZ3UA52MWCOJCPHA@2\windows-jdk7-m3.2.x_build\target\it\MJAVADOC-137\build.log, f:\jenkins\jenkins-slave\workspace\javadoc-plugin_MJAVADOC-134-WD2D35IKVL5AMZLDC76FJ2W2EJ7GUMKGGBRPVZ3UA52MWCOJCPHA@2\windows-jdk7-m3.2.x_build\target\it\MJAVADOC-172\build.log, f:\jenkins\jenkins-slave\workspace\javadoc-plugin_MJAVADOC-134-WD2D35IKVL5AMZLDC76FJ2W2EJ7GUMKGGBRPVZ3UA52MWCOJCPHA@2\windows-jdk7-m3.2.x_build\target\it\MJAVADOC-180\build.log, f:\jenkins\jenkins-slave\workspace\javadoc-plugin_MJAVADOC-134-WD2D35IKVL5AMZLDC76FJ2W2EJ7GUMKGGBRPVZ3UA52MWCOJCPHA@2\windows-jdk7-m3.2.x_build\target\it\MJAVADOC-194\build.log, f:\jenkins\jenkins-slave\workspace\javadoc-plugin_MJAVADOC-134-WD2D35IKVL5AMZLDC76FJ2W2EJ7GUMKGGBRPVZ3UA52MWCOJCPHA@2\windows-jdk7-m3.2.x_build\target\it\MJAVADOC-250\build.log, f:\jenkins\jenkins-slave\workspace\javadoc-plugin_MJAVADOC-134-WD2D35IKVL5AMZLDC76FJ2W2EJ7GUMKGGBRPVZ3UA52MWCOJCPHA@2\windows-jdk7-m3.2.x_build\target\it\MJAVADOC-257\build.log, f:\jenkins\jenkins-slave\workspace\javadoc-plugin_MJAVADOC-134-WD2D35IKVL5AMZLDC76FJ2W2EJ7GUMKGGBRPVZ3UA52MWCOJCPHA@2\windows-jdk7-m3.2.x_build\target\it\MJAVADOC-259\build.log, f:\jenkins\jenkins-slave\workspace\javadoc-plugin_MJAVADOC-134-WD2D35IKVL5AMZLDC76FJ2W2EJ7GUMKGGBRPVZ3UA52MWCOJCPHA@2\windows-jdk7-m3.2.x_build\target\it\MJAVADOC-262\build.log, f:\jenkins\jenkins-slave\workspace\javadoc-plugin_MJAVADOC-134-WD2D35IKVL5AMZLDC76FJ2W2EJ7GUMKGGBRPVZ3UA52MWCOJCPHA@2\windows-jdk7-m3.2.x_build\target\it\MJAVADOC-275\build.log, f:\jenkins\jenkins-slave\workspace\javadoc-plugin_MJAVADOC-134-WD2D35IKVL5AMZLDC76FJ2W2EJ7GUMKGGBRPVZ3UA52MWCOJCPHA@2\windows-jdk7-m3.2.x_build\target\it\MJAVADOC-278\build.log, f:\jenkins\jenkins-slave\workspace\javadoc-plugin_MJAVADOC-134-WD2D35IKVL5AMZLDC76FJ2W2EJ7GUMKGGBRPVZ3UA52MWCOJCPHA@2\windows-jdk7-m3.2.x_build\target\it\MJAVADOC-320\build.log, f:\jenkins\jenkins-slave\workspace\javadoc-plugin_MJAVADOC-134-WD2D35IKVL5AMZLDC76FJ2W2EJ7GUMKGGBRPVZ3UA52MWCOJCPHA@2\windows-jdk7-m3.2.x_build\target\it\MJAVADOC-325\build.log, f:\jenkins\jenkins-slave\workspace\javadoc-plugin_MJAVADOC-134-WD2D35IKVL5AMZLDC76FJ2W2EJ7GUMKGGBRPVZ3UA52MWCOJCPHA@2\windows-jdk7-m3.2.x_build\target\it\MJAVADOC-365\build.log, f:\jenkins\jenkins-slave\workspace\javadoc-plugin_MJAVADOC-134-WD2D35IKVL5AMZLDC76FJ2W2EJ7GUMKGGBRPVZ3UA52MWCOJCPHA@2\windows-jdk7-m3.2.x_build\target\it\MJAVADOC-369\build.log, f:\jenkins\jenkins-slave\workspace\javadoc-plugin_MJAVADOC-134-WD2D35IKVL5AMZLDC76FJ2W2EJ7GUMKGGBRPVZ3UA52MWCOJCPHA@2\windows-jdk7-m3.2.x_build\target\it\MJAVADOC-384\build.log, f:\jenkins\jenkins-slave\workspace\javadoc-plugin_MJAVADOC-134-WD2D35IKVL5AMZLDC76FJ2W2EJ7GUMKGGBRPVZ3UA52MWCOJCPHA@2\windows-jdk7-m3.2.x_build\target\it\MJAVADOC-407\build.log, f:\jenkins\jenkins-slave\workspace\javadoc-plugin_MJAVADOC-134-WD2D35IKVL5AMZLDC76FJ2W2EJ7GUMKGGBRPVZ3UA52MWCOJCPHA@2\windows-jdk7-m3.2.x_build\target\it\MJAVADOC-414\build.log, f:\jenkins\jenkins-slave\workspace\javadoc-plugin_MJAVADOC-134-WD2D35IKVL5AMZLDC76FJ2W2EJ7GUMKGGBRPVZ3UA52MWCOJCPHA@2\windows-jdk7-m3.2.x_build\target\it\MJAVADOC-420_fixparam\build.log, f:\jenkins\jenkins-slave\workspace\javadoc-plugin_MJAVADOC-134-WD2D35IKVL5AMZLDC76FJ2W2EJ7GUMKGGBRPVZ3UA52MWCOJCPHA@2\windows-jdk7-m3.2.x_build\target\it\MJAVADOC-434_fixcompile\build.log, f:\jenkins\jenkins-slave\workspace\javadoc-plugin_MJAVADOC-134-WD2D35IKVL5AMZLDC76FJ2W2EJ7GUMKGGBRPVZ3UA52MWCOJCPHA@2\windows-jdk7-m3.2.x_build\target\it\MJAVADOC-437\build.log, f:\jenkins\jenkins-slave\workspace\javadoc-plugin_MJAVADOC-134-WD2D35IKVL5AMZLDC76FJ2W2EJ7GUMKGGBRPVZ3UA52MWCOJCPHA@2\windows-jdk7-m3.2.x_build\target\it\MJAVADOC-494_aggregate-repositories\build.log, f:\jenkins\jenkins-slave\workspace\javadoc-plugin_MJAVADOC-134-WD2D35IKVL5AMZLDC76FJ2W2EJ7GUMKGGBRPVZ3UA52MWCOJCPHA@2\windows-jdk7-m3.2.x_build\target\it\MJAVADOC-495_offline-filescheme\build.log, f:\jenkins\jenkins-slave\workspace\javadoc-plugin_MJAVADOC-134-WD2D35IKVL5AMZLDC76FJ2W2EJ7GUMKGGBRPVZ3UA52MWCOJCPHA@2\windows-jdk7-m3.2.x_build\target\it\MJAVADOC-497\build.log, f:\jenkins\jenkins-slave\workspace\javadoc-plugin_MJAVADOC-134-WD2D35IKVL5AMZLDC76FJ2W2EJ7GUMKGGBRPVZ3UA52MWCOJCPHA@2\windows-jdk7-m3.2.x_build\target\it\MJAVADOC-506_excl-module-info\build.log, f:\jenkins\jenkins-slave\workspace\javadoc-plugin_MJAVADOC-134-WD2D35IKVL5AMZLDC76FJ2W2EJ7GUMKGGBRPVZ3UA52MWCOJCPHA@2\windows-jdk7-m3.2.x_build\target\it\MJAVADOC-508\build.log, f:\jenkins\jenkins-slave\workspace\javadoc-plugin_MJAVADOC-134-WD2D35IKVL5AMZLDC76FJ2W2EJ7GUMKGGBRPVZ3UA52MWCOJCPHA@2\windows-jdk7-m3.2.x_build\target\it\MJAVADOC-514_3rdparty-doclettags\build.log, f:\jenkins\jenkins-slave\workspace\javadoc-plugin_MJAVADOC-134-WD2D35IKVL5AMZLDC76FJ2W2EJ7GUMKGGBRPVZ3UA52MWCOJCPHA@2\windows-jdk7-m3.2.x_build\target\it\MJAVADOC-528\build.log, f:\jenkins\jenkins-slave\workspace\javadoc-plugin_MJAVADOC-134-WD2D35IKVL5AMZLDC76FJ2W2EJ7GUMKGGBRPVZ3UA52MWCOJCPHA@2\windows-jdk7-m3.2.x_build\target\it\MJAVADOC-538\build.log, f:\jenkins\jenkins-slave\workspace\javadoc-plugin_MJAVADOC-134-WD2D35IKVL5AMZLDC76FJ2W2EJ7GUMKGGBRPVZ3UA52MWCOJCPHA@2\windows-jdk7-m3.2.x_build\target\it\additional-dependencies-non-aggregate\build.log, f:\jenkins\jenkins-slave\workspace\javadoc-plugin_MJAVADOC-134-WD2D35IKVL5AMZLDC76FJ2W2EJ7GUMKGGBRPVZ3UA52MWCOJCPHA@2\windows-jdk7-m3.2.x_build\target\it\additional-dependencies\build.log, f:\jenkins\jenkins-slave\workspace\javadoc-plugin_MJAVADOC-134-WD2D35IKVL5AMZLDC76FJ2W2EJ7GUMKGGBRPVZ3UA52MWCOJCPHA@2\windows-jdk7-m3.2.x_build\target\it\dependencySource-1\build.log, f:\jenkins\jenkins-slave\workspace\javadoc-plugin_MJAVADOC-134-WD2D35IKVL5AMZLDC76FJ2W2EJ7GUMKGGBRPVZ3UA52MWCOJCPHA@2\windows-jdk7-m3.2.x_build\target\it\dependencySource-2\build.log, f:\jenkins\jenkins-slave\workspace\javadoc-plugin_MJAVADOC-134-WD2D35IKVL5AMZLDC76FJ2W2EJ7GUMKGGBRPVZ3UA52MWCOJCPHA@2\windows-jdk7-m3.2.x_build\target\it\dependencySource-3\build.log, f:\jenkins\jenkins-slave\workspace\javadoc-plugin_MJAVADOC-134-WD2D35IKVL5AMZLDC76FJ2W2EJ7GUMKGGBRPVZ3UA52MWCOJCPHA@2\windows-jdk7-m3.2.x_build\target\it\dependencySource-4\build.log, f:\jenkins\jenkins-slave\workspace\javadoc-plugin_MJAVADOC-134-WD2D35IKVL5AMZLDC76FJ2W2EJ7GUMKGGBRPVZ3UA52MWCOJCPHA@2\windows-jdk7-m3.2.x_build\target\it\detectLinks\build.log, f:\jenkins\jenkins-slave\workspace\javadoc-plugin_MJAVADOC-134-WD2D35IKVL5AMZLDC76FJ2W2EJ7GUMKGGBRPVZ3UA52MWCOJCPHA@2\windows-jdk7-m3.2.x_build\target\it\javadoc-fix\build.log, f:\jenkins\jenkins-slave\workspace\javadoc-plugin_MJAVADOC-134-WD2D35IKVL5AMZLDC76FJ2W2EJ7GUMKGGBRPVZ3UA52MWCOJCPHA@2\windows-jdk7-m3.2.x_build\target\it\site-failOnError\build.log]
[windows-jdk7-m3.2.x_build] Finished parsing Maven Invoker results (found 45)
[windows-jdk7-m3.2.x_build] [withMaven] junitPublisher - Archive test results for Maven artifact org.apache.maven.plugins:maven-javadoc-plugin:3.0.2-SNAPSHOT generated by maven-surefire-plugin:test (default-test): windows-jdk7-m3.2.x_build\target\surefire-reports\*.xml
[windows-jdk7-m3.2.x_build] Recording test results
[windows-jdk7-m3.2.x_build] [withMaven] openTasksPublisher - Scan Tasks for Maven artifact org.apache.maven.plugins:maven-javadoc-plugin:3.0.2-SNAPSHOT in source directory windows-jdk7-m3.2.x_build\src\main\java
[windows-jdk7-m3.2.x_build] [TASKS] Scanning folder 'f:\jenkins\jenkins-slave\workspace\javadoc-plugin_MJAVADOC-134-WD2D35IKVL5AMZLDC76FJ2W2EJ7GUMKGGBRPVZ3UA52MWCOJCPHA@2' for files matching the pattern 'windows-jdk7-m3.2.x_build\src\main\java\**\*' - excludes: null
[windows-jdk7-m3.2.x_build] [TASKS] Found 24 files to scan for tasks
[windows-jdk7-m3.2.x_build] [TASKS] Found 7 open tasks.
[windows-jdk7-m3.2.x_build] Skipping warnings blame since pipelines do not have an SCM link.%n
[Pipeline] [linux-jdk8-m3.5.x_build] // node
[Pipeline] [linux-jdk8-m3.5.x_build] }
[Pipeline] [linux-jdk7-m3.2.x_build] // node
[Pipeline] [linux-jdk7-m3.3.x_build] // ws
[Pipeline] [windows-jdk7-m3.3.x_build] // withMaven
[Pipeline] [linux-jdk10-m3.5.x_build] // withMaven
[Pipeline] [windows-jdk7-m3.5.x_build] // withMaven
[Pipeline] [windows-jdk8-m3.5.x_build] // withMaven
[Pipeline] [windows-jdk10-m3.5.x_build] // withMaven
[Pipeline] [windows-jdk7-m3.2.x_build] // withMaven
[Pipeline] [linux-jdk7-m3.2.x_build] }
[Pipeline] [linux-jdk7-m3.3.x_build] }
[Pipeline] [windows-jdk7-m3.3.x_build] cleanWs
[windows-jdk7-m3.3.x_build] [WS-CLEANUP] Deleting project workspace...[WS-CLEANUP] done
[Pipeline] [linux-jdk11-m3.5.x_build] }
[Pipeline] [linux-jdk7-m3.5.x_build] }
[Pipeline] [linux-jdk9-m3.5.x_build] }
[Pipeline] [linux-jdk10-m3.5.x_build] cleanWs
[Pipeline] [windows-jdk7-m3.5.x_build] cleanWs
[windows-jdk7-m3.5.x_build] [WS-CLEANUP] Deleting project workspace...[WS-CLEANUP] done
[Pipeline] [windows-jdk8-m3.5.x_build] cleanWs
[windows-jdk8-m3.5.x_build] [WS-CLEANUP] Deleting project workspace...[WS-CLEANUP] done
[Pipeline] [windows-jdk10-m3.5.x_build] cleanWs
[windows-jdk10-m3.5.x_build] [WS-CLEANUP] Deleting project workspace...[WS-CLEANUP] done
[Pipeline] [windows-jdk7-m3.2.x_build] cleanWs
[Pipeline] [windows-jdk9-m3.5.x_build] }
[Pipeline] [windows-jdk11-m3.5.x_build] }
[windows-jdk7-m3.2.x_build] [WS-CLEANUP] Deleting project workspace...[WS-CLEANUP] done
[Pipeline] [linux-jdk7-m3.3.x_build] // node
[linux-jdk10-m3.5.x_build] [WS-CLEANUP] Deleting project workspace...[WS-CLEANUP] done
[Pipeline] [linux-jdk11-m3.5.x_build] // stage
[Pipeline] [linux-jdk7-m3.5.x_build] // stage
[Pipeline] [linux-jdk9-m3.5.x_build] // stage
[Pipeline] [windows-jdk9-m3.5.x_build] // stage
[Pipeline] [windows-jdk11-m3.5.x_build] // dir
[Pipeline] [linux-jdk7-m3.3.x_build] }
[Pipeline] [linux-jdk7-m3.5.x_build] }
[Pipeline] [linux-jdk9-m3.5.x_build] }
[Pipeline] [linux-jdk11-m3.5.x_build] }
[Pipeline] [windows-jdk9-m3.5.x_build] }
[Pipeline] [windows-jdk7-m3.3.x_build] }
[Pipeline] [windows-jdk7-m3.5.x_build] }
[Pipeline] [windows-jdk8-m3.5.x_build] }
[Pipeline] [windows-jdk10-m3.5.x_build] }
[Pipeline] [windows-jdk7-m3.2.x_build] }
[Pipeline] [windows-jdk11-m3.5.x_build] }
[windows-jdk11-m3.5.x_build] [withMaven] artifactsPublisher - Archive artifact windows-jdk11-m3.5.x_build\pom.xml under org\apache\maven\plugins\maven-javadoc-plugin\3.0.2-SNAPSHOT\maven-javadoc-plugin-3.0.2-SNAPSHOT.pom
[windows-jdk11-m3.5.x_build] [withMaven] artifactsPublisher - Archive artifact windows-jdk11-m3.5.x_build\target\maven-javadoc-plugin-3.0.2-SNAPSHOT.jar under org\apache\maven\plugins\maven-javadoc-plugin\3.0.2-SNAPSHOT\maven-javadoc-plugin-3.0.2-SNAPSHOT.jar
[windows-jdk11-m3.5.x_build] [Fast Archiver] No prior successful build to compare, so performing full copy of artifacts
[windows-jdk11-m3.5.x_build] [withMaven] invokerPublisher - Archive invoker results for Maven artifact MavenArtifact{org.apache.maven.plugins:maven-javadoc-plugin::3.0.2-SNAPSHOT(version: 3.0.2-SNAPSHOT, snapshot:false) } generated by PluginInvocation{org.apache.maven.plugins:maven-invoker-plugin:3.1.0@integration-test integration-test}: windows-jdk11-m3.5.x_build\target\invoker-reports\*.xml
[windows-jdk11-m3.5.x_build] performing MavenInvokerRecorder, reportsFilenamePattern:'**/windows-jdk11-m3.5.x_build\target\invoker-reports/BUILD*.xml', invokerBuildDir:'**/windows-jdk11-m3.5.x_build\target\it'
[windows-jdk11-m3.5.x_build] Found reports:[f:\jenkins\jenkins-slave\workspace\javadoc-plugin_MJAVADOC-134-WD2D35IKVL5AMZLDC76FJ2W2EJ7GUMKGGBRPVZ3UA52MWCOJCPHA@2\windows-jdk11-m3.5.x_build\target\invoker-reports\BUILD-MJAVADOC-110.xml, f:\jenkins\jenkins-slave\workspace\javadoc-plugin_MJAVADOC-134-WD2D35IKVL5AMZLDC76FJ2W2EJ7GUMKGGBRPVZ3UA52MWCOJCPHA@2\windows-jdk11-m3.5.x_build\target\invoker-reports\BUILD-MJAVADOC-126.xml, f:\jenkins\jenkins-slave\workspace\javadoc-plugin_MJAVADOC-134-WD2D35IKVL5AMZLDC76FJ2W2EJ7GUMKGGBRPVZ3UA52MWCOJCPHA@2\windows-jdk11-m3.5.x_build\target\invoker-reports\BUILD-MJAVADOC-134_multiaggregate.xml, f:\jenkins\jenkins-slave\workspace\javadoc-plugin_MJAVADOC-134-WD2D35IKVL5AMZLDC76FJ2W2EJ7GUMKGGBRPVZ3UA52MWCOJCPHA@2\windows-jdk11-m3.5.x_build\target\invoker-reports\BUILD-MJAVADOC-137.xml, f:\jenkins\jenkins-slave\workspace\javadoc-plugin_MJAVADOC-134-WD2D35IKVL5AMZLDC76FJ2W2EJ7GUMKGGBRPVZ3UA52MWCOJCPHA@2\windows-jdk11-m3.5.x_build\target\invoker-reports\BUILD-MJAVADOC-172.xml, f:\jenkins\jenkins-slave\workspace\javadoc-plugin_MJAVADOC-134-WD2D35IKVL5AMZLDC76FJ2W2EJ7GUMKGGBRPVZ3UA52MWCOJCPHA@2\windows-jdk11-m3.5.x_build\target\invoker-reports\BUILD-MJAVADOC-180.xml, f:\jenkins\jenkins-slave\workspace\javadoc-plugin_MJAVADOC-134-WD2D35IKVL5AMZLDC76FJ2W2EJ7GUMKGGBRPVZ3UA52MWCOJCPHA@2\windows-jdk11-m3.5.x_build\target\invoker-reports\BUILD-MJAVADOC-194.xml, f:\jenkins\jenkins-slave\workspace\javadoc-plugin_MJAVADOC-134-WD2D35IKVL5AMZLDC76FJ2W2EJ7GUMKGGBRPVZ3UA52MWCOJCPHA@2\windows-jdk11-m3.5.x_build\target\invoker-reports\BUILD-MJAVADOC-250.xml, f:\jenkins\jenkins-slave\workspace\javadoc-plugin_MJAVADOC-134-WD2D35IKVL5AMZLDC76FJ2W2EJ7GUMKGGBRPVZ3UA52MWCOJCPHA@2\windows-jdk11-m3.5.x_build\target\invoker-reports\BUILD-MJAVADOC-257.xml, f:\jenkins\jenkins-slave\workspace\javadoc-plugin_MJAVADOC-134-WD2D35IKVL5AMZLDC76FJ2W2EJ7GUMKGGBRPVZ3UA52MWCOJCPHA@2\windows-jdk11-m3.5.x_build\target\invoker-reports\BUILD-MJAVADOC-259.xml, f:\jenkins\jenkins-slave\workspace\javadoc-plugin_MJAVADOC-134-WD2D35IKVL5AMZLDC76FJ2W2EJ7GUMKGGBRPVZ3UA52MWCOJCPHA@2\windows-jdk11-m3.5.x_build\target\invoker-reports\BUILD-MJAVADOC-262.xml, f:\jenkins\jenkins-slave\workspace\javadoc-plugin_MJAVADOC-134-WD2D35IKVL5AMZLDC76FJ2W2EJ7GUMKGGBRPVZ3UA52MWCOJCPHA@2\windows-jdk11-m3.5.x_build\target\invoker-reports\BUILD-MJAVADOC-275.xml, f:\jenkins\jenkins-slave\workspace\javadoc-plugin_MJAVADOC-134-WD2D35IKVL5AMZLDC76FJ2W2EJ7GUMKGGBRPVZ3UA52MWCOJCPHA@2\windows-jdk11-m3.5.x_build\target\invoker-reports\BUILD-MJAVADOC-278.xml, f:\jenkins\jenkins-slave\workspace\javadoc-plugin_MJAVADOC-134-WD2D35IKVL5AMZLDC76FJ2W2EJ7GUMKGGBRPVZ3UA52MWCOJCPHA@2\windows-jdk11-m3.5.x_build\target\invoker-reports\BUILD-MJAVADOC-320.xml, f:\jenkins\jenkins-slave\workspace\javadoc-plugin_MJAVADOC-134-WD2D35IKVL5AMZLDC76FJ2W2EJ7GUMKGGBRPVZ3UA52MWCOJCPHA@2\windows-jdk11-m3.5.x_build\target\invoker-reports\BUILD-MJAVADOC-325.xml, f:\jenkins\jenkins-slave\workspace\javadoc-plugin_MJAVADOC-134-WD2D35IKVL5AMZLDC76FJ2W2EJ7GUMKGGBRPVZ3UA52MWCOJCPHA@2\windows-jdk11-m3.5.x_build\target\invoker-reports\BUILD-MJAVADOC-365.xml, f:\jenkins\jenkins-slave\workspace\javadoc-plugin_MJAVADOC-134-WD2D35IKVL5AMZLDC76FJ2W2EJ7GUMKGGBRPVZ3UA52MWCOJCPHA@2\windows-jdk11-m3.5.x_build\target\invoker-reports\BUILD-MJAVADOC-369.xml, f:\jenkins\jenkins-slave\workspace\javadoc-plugin_MJAVADOC-134-WD2D35IKVL5AMZLDC76FJ2W2EJ7GUMKGGBRPVZ3UA52MWCOJCPHA@2\windows-jdk11-m3.5.x_build\target\invoker-reports\BUILD-MJAVADOC-384.xml, f:\jenkins\jenkins-slave\workspace\javadoc-plugin_MJAVADOC-134-WD2D35IKVL5AMZLDC76FJ2W2EJ7GUMKGGBRPVZ3UA52MWCOJCPHA@2\windows-jdk11-m3.5.x_build\target\invoker-reports\BUILD-MJAVADOC-407.xml, f:\jenkins\jenkins-slave\workspace\javadoc-plugin_MJAVADOC-134-WD2D35IKVL5AMZLDC76FJ2W2EJ7GUMKGGBRPVZ3UA52MWCOJCPHA@2\windows-jdk11-m3.5.x_build\target\invoker-reports\BUILD-MJAVADOC-414.xml, f:\jenkins\jenkins-slave\workspace\javadoc-plugin_MJAVADOC-134-WD2D35IKVL5AMZLDC76FJ2W2EJ7GUMKGGBRPVZ3UA52MWCOJCPHA@2\windows-jdk11-m3.5.x_build\target\invoker-reports\BUILD-MJAVADOC-420_fixparam.xml, f:\jenkins\jenkins-slave\workspace\javadoc-plugin_MJAVADOC-134-WD2D35IKVL5AMZLDC76FJ2W2EJ7GUMKGGBRPVZ3UA52MWCOJCPHA@2\windows-jdk11-m3.5.x_build\target\invoker-reports\BUILD-MJAVADOC-427.xml, f:\jenkins\jenkins-slave\workspace\javadoc-plugin_MJAVADOC-134-WD2D35IKVL5AMZLDC76FJ2W2EJ7GUMKGGBRPVZ3UA52MWCOJCPHA@2\windows-jdk11-m3.5.x_build\target\invoker-reports\BUILD-MJAVADOC-434_fixcompile.xml, f:\jenkins\jenkins-slave\workspace\javadoc-plugin_MJAVADOC-134-WD2D35IKVL5AMZLDC76FJ2W2EJ7GUMKGGBRPVZ3UA52MWCOJCPHA@2\windows-jdk11-m3.5.x_build\target\invoker-reports\BUILD-MJAVADOC-437.xml, f:\jenkins\jenkins-slave\workspace\javadoc-plugin_MJAVADOC-134-WD2D35IKVL5AMZLDC76FJ2W2EJ7GUMKGGBRPVZ3UA52MWCOJCPHA@2\windows-jdk11-m3.5.x_build\target\invoker-reports\BUILD-MJAVADOC-449_aggr_modulepath.xml, f:\jenkins\jenkins-slave\workspace\javadoc-plugin_MJAVADOC-134-WD2D35IKVL5AMZLDC76FJ2W2EJ7GUMKGGBRPVZ3UA52MWCOJCPHA@2\windows-jdk11-m3.5.x_build\target\invoker-reports\BUILD-MJAVADOC-494_aggregate-repositories.xml, f:\jenkins\jenkins-slave\workspace\javadoc-plugin_MJAVADOC-134-WD2D35IKVL5AMZLDC76FJ2W2EJ7GUMKGGBRPVZ3UA52MWCOJCPHA@2\windows-jdk11-m3.5.x_build\target\invoker-reports\BUILD-MJAVADOC-495_offline-filescheme.xml, f:\jenkins\jenkins-slave\workspace\javadoc-plugin_MJAVADOC-134-WD2D35IKVL5AMZLDC76FJ2W2EJ7GUMKGGBRPVZ3UA52MWCOJCPHA@2\windows-jdk11-m3.5.x_build\target\invoker-reports\BUILD-MJAVADOC-497.xml, f:\jenkins\jenkins-slave\workspace\javadoc-plugin_MJAVADOC-134-WD2D35IKVL5AMZLDC76FJ2W2EJ7GUMKGGBRPVZ3UA52MWCOJCPHA@2\windows-jdk11-m3.5.x_build\target\invoker-reports\BUILD-MJAVADOC-498_aggr_modulepath.xml, f:\jenkins\jenkins-slave\workspace\javadoc-plugin_MJAVADOC-134-WD2D35IKVL5AMZLDC76FJ2W2EJ7GUMKGGBRPVZ3UA52MWCOJCPHA@2\windows-jdk11-m3.5.x_build\target\invoker-reports\BUILD-MJAVADOC-498_mm_modulepath.xml, f:\jenkins\jenkins-slave\workspace\javadoc-plugin_MJAVADOC-134-WD2D35IKVL5AMZLDC76FJ2W2EJ7GUMKGGBRPVZ3UA52MWCOJCPHA@2\windows-jdk11-m3.5.x_build\target\invoker-reports\BUILD-MJAVADOC-498_modulepath.xml, f:\jenkins\jenkins-slave\workspace\javadoc-plugin_MJAVADOC-134-WD2D35IKVL5AMZLDC76FJ2W2EJ7GUMKGGBRPVZ3UA52MWCOJCPHA@2\windows-jdk11-m3.5.x_build\target\invoker-reports\BUILD-MJAVADOC-506_excl-module-info.xml, f:\jenkins\jenkins-slave\workspace\javadoc-plugin_MJAVADOC-134-WD2D35IKVL5AMZLDC76FJ2W2EJ7GUMKGGBRPVZ3UA52MWCOJCPHA@2\windows-jdk11-m3.5.x_build\target\invoker-reports\BUILD-MJAVADOC-508.xml, f:\jenkins\jenkins-slave\workspace\javadoc-plugin_MJAVADOC-134-WD2D35IKVL5AMZLDC76FJ2W2EJ7GUMKGGBRPVZ3UA52MWCOJCPHA@2\windows-jdk11-m3.5.x_build\target\invoker-reports\BUILD-MJAVADOC-514_3rdparty-doclettags.xml, f:\jenkins\jenkins-slave\workspace\javadoc-plugin_MJAVADOC-134-WD2D35IKVL5AMZLDC76FJ2W2EJ7GUMKGGBRPVZ3UA52MWCOJCPHA@2\windows-jdk11-m3.5.x_build\target\invoker-reports\BUILD-MJAVADOC-528.xml, f:\jenkins\jenkins-slave\workspace\javadoc-plugin_MJAVADOC-134-WD2D35IKVL5AMZLDC76FJ2W2EJ7GUMKGGBRPVZ3UA52MWCOJCPHA@2\windows-jdk11-m3.5.x_build\target\invoker-reports\BUILD-MJAVADOC-538.xml, f:\jenkins\jenkins-slave\workspace\javadoc-plugin_MJAVADOC-134-WD2D35IKVL5AMZLDC76FJ2W2EJ7GUMKGGBRPVZ3UA52MWCOJCPHA@2\windows-jdk11-m3.5.x_build\target\invoker-reports\BUILD-additional-dependencies-non-aggregate.xml, f:\jenkins\jenkins-slave\workspace\javadoc-plugin_MJAVADOC-134-WD2D35IKVL5AMZLDC76FJ2W2EJ7GUMKGGBRPVZ3UA52MWCOJCPHA@2\windows-jdk11-m3.5.x_build\target\invoker-reports\BUILD-additional-dependencies.xml, f:\jenkins\jenkins-slave\workspace\javadoc-plugin_MJAVADOC-134-WD2D35IKVL5AMZLDC76FJ2W2EJ7GUMKGGBRPVZ3UA52MWCOJCPHA@2\windows-jdk11-m3.5.x_build\target\invoker-reports\BUILD-dependencySource-1.xml, f:\jenkins\jenkins-slave\workspace\javadoc-plugin_MJAVADOC-134-WD2D35IKVL5AMZLDC76FJ2W2EJ7GUMKGGBRPVZ3UA52MWCOJCPHA@2\windows-jdk11-m3.5.x_build\target\invoker-reports\BUILD-dependencySource-2.xml, f:\jenkins\jenkins-slave\workspace\javadoc-plugin_MJAVADOC-134-WD2D35IKVL5AMZLDC76FJ2W2EJ7GUMKGGBRPVZ3UA52MWCOJCPHA@2\windows-jdk11-m3.5.x_build\target\invoker-reports\BUILD-dependencySource-3.xml, f:\jenkins\jenkins-slave\workspace\javadoc-plugin_MJAVADOC-134-WD2D35IKVL5AMZLDC76FJ2W2EJ7GUMKGGBRPVZ3UA52MWCOJCPHA@2\windows-jdk11-m3.5.x_build\target\invoker-reports\BUILD-dependencySource-4.xml, f:\jenkins\jenkins-slave\workspace\javadoc-plugin_MJAVADOC-134-WD2D35IKVL5AMZLDC76FJ2W2EJ7GUMKGGBRPVZ3UA52MWCOJCPHA@2\windows-jdk11-m3.5.x_build\target\invoker-reports\BUILD-detectLinks.xml, f:\jenkins\jenkins-slave\workspace\javadoc-plugin_MJAVADOC-134-WD2D35IKVL5AMZLDC76FJ2W2EJ7GUMKGGBRPVZ3UA52MWCOJCPHA@2\windows-jdk11-m3.5.x_build\target\invoker-reports\BUILD-javadoc-fix.xml, f:\jenkins\jenkins-slave\workspace\javadoc-plugin_MJAVADOC-134-WD2D35IKVL5AMZLDC76FJ2W2EJ7GUMKGGBRPVZ3UA52MWCOJCPHA@2\windows-jdk11-m3.5.x_build\target\invoker-reports\BUILD-site-failOnError.xml]
[windows-jdk11-m3.5.x_build] Found logs:[f:\jenkins\jenkins-slave\workspace\javadoc-plugin_MJAVADOC-134-WD2D35IKVL5AMZLDC76FJ2W2EJ7GUMKGGBRPVZ3UA52MWCOJCPHA@2\windows-jdk11-m3.5.x_build\target\it\MJAVADOC-110\build.log, f:\jenkins\jenkins-slave\workspace\javadoc-plugin_MJAVADOC-134-WD2D35IKVL5AMZLDC76FJ2W2EJ7GUMKGGBRPVZ3UA52MWCOJCPHA@2\windows-jdk11-m3.5.x_build\target\it\MJAVADOC-126\build.log, f:\jenkins\jenkins-slave\workspace\javadoc-plugin_MJAVADOC-134-WD2D35IKVL5AMZLDC76FJ2W2EJ7GUMKGGBRPVZ3UA52MWCOJCPHA@2\windows-jdk11-m3.5.x_build\target\it\MJAVADOC-134_multiaggregate\build.log, f:\jenkins\jenkins-slave\workspace\javadoc-plugin_MJAVADOC-134-WD2D35IKVL5AMZLDC76FJ2W2EJ7GUMKGGBRPVZ3UA52MWCOJCPHA@2\windows-jdk11-m3.5.x_build\target\it\MJAVADOC-137\build.log, f:\jenkins\jenkins-slave\workspace\javadoc-plugin_MJAVADOC-134-WD2D35IKVL5AMZLDC76FJ2W2EJ7GUMKGGBRPVZ3UA52MWCOJCPHA@2\windows-jdk11-m3.5.x_build\target\it\MJAVADOC-172\build.log, f:\jenkins\jenkins-slave\workspace\javadoc-plugin_MJAVADOC-134-WD2D35IKVL5AMZLDC76FJ2W2EJ7GUMKGGBRPVZ3UA52MWCOJCPHA@2\windows-jdk11-m3.5.x_build\target\it\MJAVADOC-180\build.log, f:\jenkins\jenkins-slave\workspace\javadoc-plugin_MJAVADOC-134-WD2D35IKVL5AMZLDC76FJ2W2EJ7GUMKGGBRPVZ3UA52MWCOJCPHA@2\windows-jdk11-m3.5.x_build\target\it\MJAVADOC-194\build.log, f:\jenkins\jenkins-slave\workspace\javadoc-plugin_MJAVADOC-134-WD2D35IKVL5AMZLDC76FJ2W2EJ7GUMKGGBRPVZ3UA52MWCOJCPHA@2\windows-jdk11-m3.5.x_build\target\it\MJAVADOC-250\build.log, f:\jenkins\jenkins-slave\workspace\javadoc-plugin_MJAVADOC-134-WD2D35IKVL5AMZLDC76FJ2W2EJ7GUMKGGBRPVZ3UA52MWCOJCPHA@2\windows-jdk11-m3.5.x_build\target\it\MJAVADOC-259\build.log, f:\jenkins\jenkins-slave\workspace\javadoc-plugin_MJAVADOC-134-WD2D35IKVL5AMZLDC76FJ2W2EJ7GUMKGGBRPVZ3UA52MWCOJCPHA@2\windows-jdk11-m3.5.x_build\target\it\MJAVADOC-262\build.log, f:\jenkins\jenkins-slave\workspace\javadoc-plugin_MJAVADOC-134-WD2D35IKVL5AMZLDC76FJ2W2EJ7GUMKGGBRPVZ3UA52MWCOJCPHA@2\windows-jdk11-m3.5.x_build\target\it\MJAVADOC-275\build.log, f:\jenkins\jenkins-slave\workspace\javadoc-plugin_MJAVADOC-134-WD2D35IKVL5AMZLDC76FJ2W2EJ7GUMKGGBRPVZ3UA52MWCOJCPHA@2\windows-jdk11-m3.5.x_build\target\it\MJAVADOC-278\build.log, f:\jenkins\jenkins-slave\workspace\javadoc-plugin_MJAVADOC-134-WD2D35IKVL5AMZLDC76FJ2W2EJ7GUMKGGBRPVZ3UA52MWCOJCPHA@2\windows-jdk11-m3.5.x_build\target\it\MJAVADOC-320\build.log, f:\jenkins\jenkins-slave\workspace\javadoc-plugin_MJAVADOC-134-WD2D35IKVL5AMZLDC76FJ2W2EJ7GUMKGGBRPVZ3UA52MWCOJCPHA@2\windows-jdk11-m3.5.x_build\target\it\MJAVADOC-325\build.log, f:\jenkins\jenkins-slave\workspace\javadoc-plugin_MJAVADOC-134-WD2D35IKVL5AMZLDC76FJ2W2EJ7GUMKGGBRPVZ3UA52MWCOJCPHA@2\windows-jdk11-m3.5.x_build\target\it\MJAVADOC-365\build.log, f:\jenkins\jenkins-slave\workspace\javadoc-plugin_MJAVADOC-134-WD2D35IKVL5AMZLDC76FJ2W2EJ7GUMKGGBRPVZ3UA52MWCOJCPHA@2\windows-jdk11-m3.5.x_build\target\it\MJAVADOC-369\build.log, f:\jenkins\jenkins-slave\workspace\javadoc-plugin_MJAVADOC-134-WD2D35IKVL5AMZLDC76FJ2W2EJ7GUMKGGBRPVZ3UA52MWCOJCPHA@2\windows-jdk11-m3.5.x_build\target\it\MJAVADOC-384\build.log, f:\jenkins\jenkins-slave\workspace\javadoc-plugin_MJAVADOC-134-WD2D35IKVL5AMZLDC76FJ2W2EJ7GUMKGGBRPVZ3UA52MWCOJCPHA@2\windows-jdk11-m3.5.x_build\target\it\MJAVADOC-407\build.log, f:\jenkins\jenkins-slave\workspace\javadoc-plugin_MJAVADOC-134-WD2D35IKVL5AMZLDC76FJ2W2EJ7GUMKGGBRPVZ3UA52MWCOJCPHA@2\windows-jdk11-m3.5.x_build\target\it\MJAVADOC-414\build.log, f:\jenkins\jenkins-slave\workspace\javadoc-plugin_MJAVADOC-134-WD2D35IKVL5AMZLDC76FJ2W2EJ7GUMKGGBRPVZ3UA52MWCOJCPHA@2\windows-jdk11-m3.5.x_build\target\it\MJAVADOC-420_fixparam\build.log, f:\jenkins\jenkins-slave\workspace\javadoc-plugin_MJAVADOC-134-WD2D35IKVL5AMZLDC76FJ2W2EJ7GUMKGGBRPVZ3UA52MWCOJCPHA@2\windows-jdk11-m3.5.x_build\target\it\MJAVADOC-427\build.log, f:\jenkins\jenkins-slave\workspace\javadoc-plugin_MJAVADOC-134-WD2D35IKVL5AMZLDC76FJ2W2EJ7GUMKGGBRPVZ3UA52MWCOJCPHA@2\windows-jdk11-m3.5.x_build\target\it\MJAVADOC-434_fixcompile\build.log, f:\jenkins\jenkins-slave\workspace\javadoc-plugin_MJAVADOC-134-WD2D35IKVL5AMZLDC76FJ2W2EJ7GUMKGGBRPVZ3UA52MWCOJCPHA@2\windows-jdk11-m3.5.x_build\target\it\MJAVADOC-437\build.log, f:\jenkins\jenkins-slave\workspace\javadoc-plugin_MJAVADOC-134-WD2D35IKVL5AMZLDC76FJ2W2EJ7GUMKGGBRPVZ3UA52MWCOJCPHA@2\windows-jdk11-m3.5.x_build\target\it\MJAVADOC-449_aggr_modulepath\build.log, f:\jenkins\jenkins-slave\workspace\javadoc-plugin_MJAVADOC-134-WD2D35IKVL5AMZLDC76FJ2W2EJ7GUMKGGBRPVZ3UA52MWCOJCPHA@2\windows-jdk11-m3.5.x_build\target\it\MJAVADOC-494_aggregate-repositories\build.log, f:\jenkins\jenkins-slave\workspace\javadoc-plugin_MJAVADOC-134-WD2D35IKVL5AMZLDC76FJ2W2EJ7GUMKGGBRPVZ3UA52MWCOJCPHA@2\windows-jdk11-m3.5.x_build\target\it\MJAVADOC-495_offline-filescheme\build.log, f:\jenkins\jenkins-slave\workspace\javadoc-plugin_MJAVADOC-134-WD2D35IKVL5AMZLDC76FJ2W2EJ7GUMKGGBRPVZ3UA52MWCOJCPHA@2\windows-jdk11-m3.5.x_build\target\it\MJAVADOC-497\build.log, f:\jenkins\jenkins-slave\workspace\javadoc-plugin_MJAVADOC-134-WD2D35IKVL5AMZLDC76FJ2W2EJ7GUMKGGBRPVZ3UA52MWCOJCPHA@2\windows-jdk11-m3.5.x_build\target\it\MJAVADOC-498_aggr_modulepath\build.log, f:\jenkins\jenkins-slave\workspace\javadoc-plugin_MJAVADOC-134-WD2D35IKVL5AMZLDC76FJ2W2EJ7GUMKGGBRPVZ3UA52MWCOJCPHA@2\windows-jdk11-m3.5.x_build\target\it\MJAVADOC-498_mm_modulepath\build.log, f:\jenkins\jenkins-slave\workspace\javadoc-plugin_MJAVADOC-134-WD2D35IKVL5AMZLDC76FJ2W2EJ7GUMKGGBRPVZ3UA52MWCOJCPHA@2\windows-jdk11-m3.5.x_build\target\it\MJAVADOC-498_modulepath\build.log, f:\jenkins\jenkins-slave\workspace\javadoc-plugin_MJAVADOC-134-WD2D35IKVL5AMZLDC76FJ2W2EJ7GUMKGGBRPVZ3UA52MWCOJCPHA@2\windows-jdk11-m3.5.x_build\target\it\MJAVADOC-506_excl-module-info\build.log, f:\jenkins\jenkins-slave\workspace\javadoc-plugin_MJAVADOC-134-WD2D35IKVL5AMZLDC76FJ2W2EJ7GUMKGGBRPVZ3UA52MWCOJCPHA@2\windows-jdk11-m3.5.x_build\target\it\MJAVADOC-508\build.log, f:\jenkins\jenkins-slave\workspace\javadoc-plugin_MJAVADOC-134-WD2D35IKVL5AMZLDC76FJ2W2EJ7GUMKGGBRPVZ3UA52MWCOJCPHA@2\windows-jdk11-m3.5.x_build\target\it\MJAVADOC-514_3rdparty-doclettags\build.log, f:\jenkins\jenkins-slave\workspace\javadoc-plugin_MJAVADOC-134-WD2D35IKVL5AMZLDC76FJ2W2EJ7GUMKGGBRPVZ3UA52MWCOJCPHA@2\windows-jdk11-m3.5.x_build\target\it\MJAVADOC-528\build.log, f:\jenkins\jenkins-slave\workspace\javadoc-plugin_MJAVADOC-134-WD2D35IKVL5AMZLDC76FJ2W2EJ7GUMKGGBRPVZ3UA52MWCOJCPHA@2\windows-jdk11-m3.5.x_build\target\it\MJAVADOC-538\build.log, f:\jenkins\jenkins-slave\workspace\javadoc-plugin_MJAVADOC-134-WD2D35IKVL5AMZLDC76FJ2W2EJ7GUMKGGBRPVZ3UA52MWCOJCPHA@2\windows-jdk11-m3.5.x_build\target\it\additional-dependencies-non-aggregate\build.log, f:\jenkins\jenkins-slave\workspace\javadoc-plugin_MJAVADOC-134-WD2D35IKVL5AMZLDC76FJ2W2EJ7GUMKGGBRPVZ3UA52MWCOJCPHA@2\windows-jdk11-m3.5.x_build\target\it\additional-dependencies\build.log, f:\jenkins\jenkins-slave\workspace\javadoc-plugin_MJAVADOC-134-WD2D35IKVL5AMZLDC76FJ2W2EJ7GUMKGGBRPVZ3UA52MWCOJCPHA@2\windows-jdk11-m3.5.x_build\target\it\dependencySource-1\build.log, f:\jenkins\jenkins-slave\workspace\javadoc-plugin_MJAVADOC-134-WD2D35IKVL5AMZLDC76FJ2W2EJ7GUMKGGBRPVZ3UA52MWCOJCPHA@2\windows-jdk11-m3.5.x_build\target\it\dependencySource-2\build.log, f:\jenkins\jenkins-slave\workspace\javadoc-plugin_MJAVADOC-134-WD2D35IKVL5AMZLDC76FJ2W2EJ7GUMKGGBRPVZ3UA52MWCOJCPHA@2\windows-jdk11-m3.5.x_build\target\it\dependencySource-3\build.log, f:\jenkins\jenkins-slave\workspace\javadoc-plugin_MJAVADOC-134-WD2D35IKVL5AMZLDC76FJ2W2EJ7GUMKGGBRPVZ3UA52MWCOJCPHA@2\windows-jdk11-m3.5.x_build\target\it\dependencySource-4\build.log, f:\jenkins\jenkins-slave\workspace\javadoc-plugin_MJAVADOC-134-WD2D35IKVL5AMZLDC76FJ2W2EJ7GUMKGGBRPVZ3UA52MWCOJCPHA@2\windows-jdk11-m3.5.x_build\target\it\detectLinks\build.log, f:\jenkins\jenkins-slave\workspace\javadoc-plugin_MJAVADOC-134-WD2D35IKVL5AMZLDC76FJ2W2EJ7GUMKGGBRPVZ3UA52MWCOJCPHA@2\windows-jdk11-m3.5.x_build\target\it\javadoc-fix\build.log, f:\jenkins\jenkins-slave\workspace\javadoc-plugin_MJAVADOC-134-WD2D35IKVL5AMZLDC76FJ2W2EJ7GUMKGGBRPVZ3UA52MWCOJCPHA@2\windows-jdk11-m3.5.x_build\target\it\site-failOnError\build.log]
[windows-jdk11-m3.5.x_build] Finished parsing Maven Invoker results (found 45)
[windows-jdk11-m3.5.x_build] [withMaven] junitPublisher - Archive test results for Maven artifact org.apache.maven.plugins:maven-javadoc-plugin:3.0.2-SNAPSHOT generated by maven-surefire-plugin:test (default-test): windows-jdk11-m3.5.x_build\target\surefire-reports\*.xml
[windows-jdk11-m3.5.x_build] Recording test results
[windows-jdk11-m3.5.x_build] [withMaven] openTasksPublisher - Scan Tasks for Maven artifact org.apache.maven.plugins:maven-javadoc-plugin:3.0.2-SNAPSHOT in source directory windows-jdk11-m3.5.x_build\src\main\java
[windows-jdk11-m3.5.x_build] [TASKS] Scanning folder 'f:\jenkins\jenkins-slave\workspace\javadoc-plugin_MJAVADOC-134-WD2D35IKVL5AMZLDC76FJ2W2EJ7GUMKGGBRPVZ3UA52MWCOJCPHA@2' for files matching the pattern 'windows-jdk11-m3.5.x_build\src\main\java\**\*' - excludes: null
[windows-jdk11-m3.5.x_build] [TASKS] Found 24 files to scan for tasks
[windows-jdk11-m3.5.x_build] [TASKS] Found 7 open tasks.
[windows-jdk11-m3.5.x_build] Skipping warnings blame since pipelines do not have an SCM link.%n
[Pipeline] [linux-jdk10-m3.5.x_build] }
[Pipeline] [linux-jdk7-m3.5.x_build] // ws
[Pipeline] [linux-jdk9-m3.5.x_build] // ws
[Pipeline] [linux-jdk11-m3.5.x_build] // ws
[Pipeline] [windows-jdk9-m3.5.x_build] // ws
[Pipeline] [windows-jdk7-m3.3.x_build] // stage
[Pipeline] [windows-jdk7-m3.5.x_build] // stage
[Pipeline] [windows-jdk8-m3.5.x_build] // stage
[Pipeline] [windows-jdk10-m3.5.x_build] // stage
[Pipeline] [windows-jdk7-m3.2.x_build] // stage
[Pipeline] [windows-jdk11-m3.5.x_build] // withMaven
[Pipeline] [linux-jdk7-m3.5.x_build] }
[Pipeline] [linux-jdk9-m3.5.x_build] }
[Pipeline] [linux-jdk11-m3.5.x_build] }
[Pipeline] [windows-jdk9-m3.5.x_build] }
[Pipeline] [windows-jdk7-m3.2.x_build] }
[Pipeline] [windows-jdk7-m3.3.x_build] }
[Pipeline] [windows-jdk7-m3.5.x_build] }
[Pipeline] [windows-jdk8-m3.5.x_build] }
[Pipeline] [windows-jdk10-m3.5.x_build] }
[Pipeline] [windows-jdk11-m3.5.x_build] cleanWs
[Pipeline] [linux-jdk10-m3.5.x_build] // stage
[Pipeline] [linux-jdk10-m3.5.x_build] }
[windows-jdk11-m3.5.x_build] [WS-CLEANUP] Deleting project workspace...[WS-CLEANUP] done
[Pipeline] [linux-jdk7-m3.5.x_build] // node
[Pipeline] [linux-jdk9-m3.5.x_build] // node
[Pipeline] [linux-jdk11-m3.5.x_build] // node
[Pipeline] [windows-jdk9-m3.5.x_build] // node
[Pipeline] [windows-jdk7-m3.2.x_build] // ws
[Pipeline] [windows-jdk7-m3.3.x_build] // ws
[Pipeline] [windows-jdk7-m3.5.x_build] // ws
[Pipeline] [windows-jdk8-m3.5.x_build] // ws
[Pipeline] [windows-jdk10-m3.5.x_build] // ws
[Pipeline] [linux-jdk7-m3.5.x_build] }
[Pipeline] [linux-jdk9-m3.5.x_build] }
[Pipeline] [linux-jdk11-m3.5.x_build] }
[Pipeline] [windows-jdk9-m3.5.x_build] }
[Pipeline] [windows-jdk7-m3.2.x_build] }
[Pipeline] [windows-jdk7-m3.3.x_build] }
[Pipeline] [windows-jdk7-m3.5.x_build] }
[Pipeline] [windows-jdk8-m3.5.x_build] }
[Pipeline] [windows-jdk10-m3.5.x_build] }
[Pipeline] [linux-jdk10-m3.5.x_build] // ws
[Pipeline] [linux-jdk10-m3.5.x_build] }
[Pipeline] [windows-jdk11-m3.5.x_build] }
[Pipeline] [windows-jdk7-m3.2.x_build] // node
[Pipeline] [windows-jdk7-m3.3.x_build] // node
[Pipeline] [windows-jdk7-m3.5.x_build] // node
[Pipeline] [windows-jdk8-m3.5.x_build] // node
[Pipeline] [windows-jdk10-m3.5.x_build] // node
[Pipeline] [windows-jdk7-m3.2.x_build] }
[Pipeline] [windows-jdk7-m3.3.x_build] }
[Pipeline] [windows-jdk7-m3.5.x_build] }
[Pipeline] [windows-jdk8-m3.5.x_build] }
[Pipeline] [windows-jdk10-m3.5.x_build] }
[Pipeline] [linux-jdk10-m3.5.x_build] // node
[Pipeline] [windows-jdk11-m3.5.x_build] // stage
[Pipeline] [linux-jdk10-m3.5.x_build] }
[Pipeline] [windows-jdk11-m3.5.x_build] }
[Pipeline] [windows-jdk11-m3.5.x_build] // ws
[Pipeline] [windows-jdk11-m3.5.x_build] }
[Pipeline] [windows-jdk11-m3.5.x_build] // node
[Pipeline] [windows-jdk11-m3.5.x_build] }
[Pipeline] // parallel
[Pipeline] stage
[Pipeline] { (Notifications)
[Pipeline] echo
Build result: UNSTABLE
[Pipeline] jiraIssueSelector
[Pipeline] emailext
Build succeeded in Jenkins: Maven TLP » maven-javadoc-plugin » MJAVADOC-134 #2
Posted by Apache Jenkins Server <je...@builds.apache.org>.
See https://builds.apache.org/job/maven-box/job/maven-javadoc-plugin/job/MJAVADOC-134/2/
Changes:
* [MJAVADOC-134] Fix unittest
* [MJAVADOC-134] Fix unittest
* [MJAVADOC-134] Fix unittest
* [MJAVADOC-134] Fix unittest
* [MJAVADOC-134] Fix unittest
* [MJAVADOC-134] Fix unittest
* [MJAVADOC-134] Fix unittest
* [MJAVADOC-134] Fix unittest
* [MJAVADOC-134] Fix unittest
* [MJAVADOC-134] Fix unittest
* [MJAVADOC-134] Fix unittest
* [MJAVADOC-134] Fix unittest
* [MJAVADOC-134] Fix unittest
* [MJAVADOC-134] Fix unittest
All tests passed