You are viewing a plain text version of this content. The canonical link for it is here.
Posted to dev@lucene.apache.org by Policeman Jenkins Server <je...@thetaphi.de> on 2013/12/08 07:46:51 UTC
[JENKINS] Lucene-Solr-trunk-Linux (64bit/jdk1.7.0_45) - Build #
8611 - Still Failing!
Build: http://jenkins.thetaphi.de/job/Lucene-Solr-trunk-Linux/8611/
Java: 64bit/jdk1.7.0_45 -XX:-UseCompressedOops -XX:+UseG1GC
6 tests failed.
FAILED: org.apache.solr.analytics.expression.ExpressionTest.addTest
Error Message:
Caught exception in getStatResult, xPath = /response/lst[@name='stats']/lst[@name='ar']/double[@name='sum'] raw data: <?xml version="1.0" encoding="UTF-8"?> <response> <lst name="responseHeader"> <int name="status">0</int> <int name="QTime">29</int> </lst> <result name="response" numFound="100" start="0"> </result> <lst name="stats"> <lst name="stats_fields"/> </lst> <lst name="stats"> <lst name="cr"> <str name="ccmax">this is the secondstr9</str> <str name="ccmin">this is the firststr0</str> <str name="csmax">this is the second</str> <str name="csmin">this is the first</str> <str name="max">str9</str> <str name="min">str0</str> </lst> <lst name="cnr"> <double name="c10">10.0</double> <double name="c8">8.0</double> </lst> <lst name="pr"> <long name="count">100</long> <null name="mc"/> <null name="mean"/> <null name="su"/> <null name="sum"/> <null name="unique"/> </lst> <lst name="nr"> <double name="c">-100.0</double> <long name="count">100</long> <null name="s"/> <null name="sum"/> </lst> <lst name="csr"> <str name="cs1">this is the first</str> <str name="cs2">this is the second</str> <str name="cs3">this is the third</str> </lst> <lst name="rr"> <str name="max">str9</str> <str name="min">str0</str> <str name="rmax">9rts</str> <str name="rmin">0rts</str> </lst> <lst name="avr"> <double name="c">100.0</double> <long name="count">100</long> <null name="s"/> <null name="sum"/> </lst> <lst name="cdr"> <date name="cd1">1800-12-31T23:59:59Z</date> <date name="cd2">1804-06-30T23:59:59Z</date> <str name="cs1">1800-12-31T23:59:59Z</str> <str name="cs2">1804-06-30T23:59:59Z</str> </lst> <lst name="mr"> <long name="count">100</long> <null name="mcm"/> <null name="mean"/> <null name="median"/> <null name="su"/> <null name="sum"/> <null name="unique"/> </lst> <lst name="dr"> <long name="count">100</long> <null name="mc"/> <null name="mean"/> <null name="su"/> <null name="sum"/> <null name="unique"/> </lst> <lst name="dmr"> <str name="cma">+2MONTHS</str> <str name="cme">+2YEARS</str> <date name="dmma">1812-02-29T23:59:59Z</date> <date name="dmme">1807-12-31T23:59:59Z</date> <date name="max">1811-12-31T23:59:59Z</date> <date name="median">1805-12-31T23:59:59Z</date> </lst> <lst name="ar"> <long name="count">100</long> <null name="mcm"/> <null name="mean"/> <null name="median"/> <null name="su"/> <null name="sum"/> <null name="unique"/> </lst> </lst> </response>
Stack Trace:
java.lang.AssertionError: Caught exception in getStatResult, xPath = /response/lst[@name='stats']/lst[@name='ar']/double[@name='sum']
raw data: <?xml version="1.0" encoding="UTF-8"?>
<response>
<lst name="responseHeader">
<int name="status">0</int>
<int name="QTime">29</int>
</lst>
<result name="response" numFound="100" start="0">
</result>
<lst name="stats">
<lst name="stats_fields"/>
</lst>
<lst name="stats">
<lst name="cr">
<str name="ccmax">this is the secondstr9</str>
<str name="ccmin">this is the firststr0</str>
<str name="csmax">this is the second</str>
<str name="csmin">this is the first</str>
<str name="max">str9</str>
<str name="min">str0</str>
</lst>
<lst name="cnr">
<double name="c10">10.0</double>
<double name="c8">8.0</double>
</lst>
<lst name="pr">
<long name="count">100</long>
<null name="mc"/>
<null name="mean"/>
<null name="su"/>
<null name="sum"/>
<null name="unique"/>
</lst>
<lst name="nr">
<double name="c">-100.0</double>
<long name="count">100</long>
<null name="s"/>
<null name="sum"/>
</lst>
<lst name="csr">
<str name="cs1">this is the first</str>
<str name="cs2">this is the second</str>
<str name="cs3">this is the third</str>
</lst>
<lst name="rr">
<str name="max">str9</str>
<str name="min">str0</str>
<str name="rmax">9rts</str>
<str name="rmin">0rts</str>
</lst>
<lst name="avr">
<double name="c">100.0</double>
<long name="count">100</long>
<null name="s"/>
<null name="sum"/>
</lst>
<lst name="cdr">
<date name="cd1">1800-12-31T23:59:59Z</date>
<date name="cd2">1804-06-30T23:59:59Z</date>
<str name="cs1">1800-12-31T23:59:59Z</str>
<str name="cs2">1804-06-30T23:59:59Z</str>
</lst>
<lst name="mr">
<long name="count">100</long>
<null name="mcm"/>
<null name="mean"/>
<null name="median"/>
<null name="su"/>
<null name="sum"/>
<null name="unique"/>
</lst>
<lst name="dr">
<long name="count">100</long>
<null name="mc"/>
<null name="mean"/>
<null name="su"/>
<null name="sum"/>
<null name="unique"/>
</lst>
<lst name="dmr">
<str name="cma">+2MONTHS</str>
<str name="cme">+2YEARS</str>
<date name="dmma">1812-02-29T23:59:59Z</date>
<date name="dmme">1807-12-31T23:59:59Z</date>
<date name="max">1811-12-31T23:59:59Z</date>
<date name="median">1805-12-31T23:59:59Z</date>
</lst>
<lst name="ar">
<long name="count">100</long>
<null name="mcm"/>
<null name="mean"/>
<null name="median"/>
<null name="su"/>
<null name="sum"/>
<null name="unique"/>
</lst>
</lst>
</response>
at __randomizedtesting.SeedInfo.seed([7A73F81A6B413F97:8C5F55C42A8E38D0]:0)
at org.junit.Assert.fail(Assert.java:93)
at org.apache.solr.analytics.AbstractAnalyticsStatsTest.getStatResult(AbstractAnalyticsStatsTest.java:113)
at org.apache.solr.analytics.expression.ExpressionTest.addTest(ExpressionTest.java:78)
at sun.reflect.NativeMethodAccessorImpl.invoke0(Native Method)
at sun.reflect.NativeMethodAccessorImpl.invoke(NativeMethodAccessorImpl.java:57)
at sun.reflect.DelegatingMethodAccessorImpl.invoke(DelegatingMethodAccessorImpl.java:43)
at java.lang.reflect.Method.invoke(Method.java:606)
at com.carrotsearch.randomizedtesting.RandomizedRunner.invoke(RandomizedRunner.java:1559)
at com.carrotsearch.randomizedtesting.RandomizedRunner.access$600(RandomizedRunner.java:79)
at com.carrotsearch.randomizedtesting.RandomizedRunner$6.evaluate(RandomizedRunner.java:737)
at com.carrotsearch.randomizedtesting.RandomizedRunner$7.evaluate(RandomizedRunner.java:773)
at com.carrotsearch.randomizedtesting.RandomizedRunner$8.evaluate(RandomizedRunner.java:787)
at com.carrotsearch.randomizedtesting.rules.SystemPropertiesRestoreRule$1.evaluate(SystemPropertiesRestoreRule.java:53)
at org.apache.lucene.util.TestRuleSetupTeardownChained$1.evaluate(TestRuleSetupTeardownChained.java:50)
at org.apache.lucene.util.TestRuleFieldCacheSanity$1.evaluate(TestRuleFieldCacheSanity.java:51)
at org.apache.lucene.util.AbstractBeforeAfterRule$1.evaluate(AbstractBeforeAfterRule.java:46)
at com.carrotsearch.randomizedtesting.rules.SystemPropertiesInvariantRule$1.evaluate(SystemPropertiesInvariantRule.java:55)
at org.apache.lucene.util.TestRuleThreadAndTestName$1.evaluate(TestRuleThreadAndTestName.java:49)
at org.apache.lucene.util.TestRuleIgnoreAfterMaxFailures$1.evaluate(TestRuleIgnoreAfterMaxFailures.java:70)
at org.apache.lucene.util.TestRuleMarkFailure$1.evaluate(TestRuleMarkFailure.java:48)
at com.carrotsearch.randomizedtesting.rules.StatementAdapter.evaluate(StatementAdapter.java:36)
at com.carrotsearch.randomizedtesting.ThreadLeakControl$StatementRunner.run(ThreadLeakControl.java:358)
at com.carrotsearch.randomizedtesting.ThreadLeakControl.forkTimeoutingTask(ThreadLeakControl.java:782)
at com.carrotsearch.randomizedtesting.ThreadLeakControl$3.evaluate(ThreadLeakControl.java:442)
at com.carrotsearch.randomizedtesting.RandomizedRunner.runSingleTest(RandomizedRunner.java:746)
at com.carrotsearch.randomizedtesting.RandomizedRunner$3.evaluate(RandomizedRunner.java:648)
at com.carrotsearch.randomizedtesting.RandomizedRunner$4.evaluate(RandomizedRunner.java:682)
at com.carrotsearch.randomizedtesting.RandomizedRunner$5.evaluate(RandomizedRunner.java:693)
at com.carrotsearch.randomizedtesting.rules.StatementAdapter.evaluate(StatementAdapter.java:36)
at com.carrotsearch.randomizedtesting.rules.SystemPropertiesRestoreRule$1.evaluate(SystemPropertiesRestoreRule.java:53)
at org.apache.lucene.util.AbstractBeforeAfterRule$1.evaluate(AbstractBeforeAfterRule.java:46)
at org.apache.lucene.util.TestRuleStoreClassName$1.evaluate(TestRuleStoreClassName.java:42)
at com.carrotsearch.randomizedtesting.rules.SystemPropertiesInvariantRule$1.evaluate(SystemPropertiesInvariantRule.java:55)
at com.carrotsearch.randomizedtesting.rules.NoShadowingOrOverridesOnMethodsRule$1.evaluate(NoShadowingOrOverridesOnMethodsRule.java:39)
at com.carrotsearch.randomizedtesting.rules.NoShadowingOrOverridesOnMethodsRule$1.evaluate(NoShadowingOrOverridesOnMethodsRule.java:39)
at com.carrotsearch.randomizedtesting.rules.StatementAdapter.evaluate(StatementAdapter.java:36)
at org.apache.lucene.util.TestRuleAssertionsRequired$1.evaluate(TestRuleAssertionsRequired.java:43)
at org.apache.lucene.util.TestRuleMarkFailure$1.evaluate(TestRuleMarkFailure.java:48)
at org.apache.lucene.util.TestRuleIgnoreAfterMaxFailures$1.evaluate(TestRuleIgnoreAfterMaxFailures.java:70)
at org.apache.lucene.util.TestRuleIgnoreTestSuites$1.evaluate(TestRuleIgnoreTestSuites.java:55)
at com.carrotsearch.randomizedtesting.rules.StatementAdapter.evaluate(StatementAdapter.java:36)
at com.carrotsearch.randomizedtesting.ThreadLeakControl$StatementRunner.run(ThreadLeakControl.java:358)
at java.lang.Thread.run(Thread.java:744)
FAILED: org.apache.solr.analytics.expression.ExpressionTest.multiplyTest
Error Message:
Caught exception in getStatResult, xPath = /response/lst[@name='stats']/lst[@name='mr']/double[@name='sum'] raw data: <?xml version="1.0" encoding="UTF-8"?> <response> <lst name="responseHeader"> <int name="status">0</int> <int name="QTime">29</int> </lst> <result name="response" numFound="100" start="0"> </result> <lst name="stats"> <lst name="stats_fields"/> </lst> <lst name="stats"> <lst name="cr"> <str name="ccmax">this is the secondstr9</str> <str name="ccmin">this is the firststr0</str> <str name="csmax">this is the second</str> <str name="csmin">this is the first</str> <str name="max">str9</str> <str name="min">str0</str> </lst> <lst name="cnr"> <double name="c10">10.0</double> <double name="c8">8.0</double> </lst> <lst name="pr"> <long name="count">100</long> <null name="mc"/> <null name="mean"/> <null name="su"/> <null name="sum"/> <null name="unique"/> </lst> <lst name="nr"> <double name="c">-100.0</double> <long name="count">100</long> <null name="s"/> <null name="sum"/> </lst> <lst name="csr"> <str name="cs1">this is the first</str> <str name="cs2">this is the second</str> <str name="cs3">this is the third</str> </lst> <lst name="rr"> <str name="max">str9</str> <str name="min">str0</str> <str name="rmax">9rts</str> <str name="rmin">0rts</str> </lst> <lst name="avr"> <double name="c">100.0</double> <long name="count">100</long> <null name="s"/> <null name="sum"/> </lst> <lst name="cdr"> <date name="cd1">1800-12-31T23:59:59Z</date> <date name="cd2">1804-06-30T23:59:59Z</date> <str name="cs1">1800-12-31T23:59:59Z</str> <str name="cs2">1804-06-30T23:59:59Z</str> </lst> <lst name="mr"> <long name="count">100</long> <null name="mcm"/> <null name="mean"/> <null name="median"/> <null name="su"/> <null name="sum"/> <null name="unique"/> </lst> <lst name="dr"> <long name="count">100</long> <null name="mc"/> <null name="mean"/> <null name="su"/> <null name="sum"/> <null name="unique"/> </lst> <lst name="dmr"> <str name="cma">+2MONTHS</str> <str name="cme">+2YEARS</str> <date name="dmma">1812-02-29T23:59:59Z</date> <date name="dmme">1807-12-31T23:59:59Z</date> <date name="max">1811-12-31T23:59:59Z</date> <date name="median">1805-12-31T23:59:59Z</date> </lst> <lst name="ar"> <long name="count">100</long> <null name="mcm"/> <null name="mean"/> <null name="median"/> <null name="su"/> <null name="sum"/> <null name="unique"/> </lst> </lst> </response>
Stack Trace:
java.lang.AssertionError: Caught exception in getStatResult, xPath = /response/lst[@name='stats']/lst[@name='mr']/double[@name='sum']
raw data: <?xml version="1.0" encoding="UTF-8"?>
<response>
<lst name="responseHeader">
<int name="status">0</int>
<int name="QTime">29</int>
</lst>
<result name="response" numFound="100" start="0">
</result>
<lst name="stats">
<lst name="stats_fields"/>
</lst>
<lst name="stats">
<lst name="cr">
<str name="ccmax">this is the secondstr9</str>
<str name="ccmin">this is the firststr0</str>
<str name="csmax">this is the second</str>
<str name="csmin">this is the first</str>
<str name="max">str9</str>
<str name="min">str0</str>
</lst>
<lst name="cnr">
<double name="c10">10.0</double>
<double name="c8">8.0</double>
</lst>
<lst name="pr">
<long name="count">100</long>
<null name="mc"/>
<null name="mean"/>
<null name="su"/>
<null name="sum"/>
<null name="unique"/>
</lst>
<lst name="nr">
<double name="c">-100.0</double>
<long name="count">100</long>
<null name="s"/>
<null name="sum"/>
</lst>
<lst name="csr">
<str name="cs1">this is the first</str>
<str name="cs2">this is the second</str>
<str name="cs3">this is the third</str>
</lst>
<lst name="rr">
<str name="max">str9</str>
<str name="min">str0</str>
<str name="rmax">9rts</str>
<str name="rmin">0rts</str>
</lst>
<lst name="avr">
<double name="c">100.0</double>
<long name="count">100</long>
<null name="s"/>
<null name="sum"/>
</lst>
<lst name="cdr">
<date name="cd1">1800-12-31T23:59:59Z</date>
<date name="cd2">1804-06-30T23:59:59Z</date>
<str name="cs1">1800-12-31T23:59:59Z</str>
<str name="cs2">1804-06-30T23:59:59Z</str>
</lst>
<lst name="mr">
<long name="count">100</long>
<null name="mcm"/>
<null name="mean"/>
<null name="median"/>
<null name="su"/>
<null name="sum"/>
<null name="unique"/>
</lst>
<lst name="dr">
<long name="count">100</long>
<null name="mc"/>
<null name="mean"/>
<null name="su"/>
<null name="sum"/>
<null name="unique"/>
</lst>
<lst name="dmr">
<str name="cma">+2MONTHS</str>
<str name="cme">+2YEARS</str>
<date name="dmma">1812-02-29T23:59:59Z</date>
<date name="dmme">1807-12-31T23:59:59Z</date>
<date name="max">1811-12-31T23:59:59Z</date>
<date name="median">1805-12-31T23:59:59Z</date>
</lst>
<lst name="ar">
<long name="count">100</long>
<null name="mcm"/>
<null name="mean"/>
<null name="median"/>
<null name="su"/>
<null name="sum"/>
<null name="unique"/>
</lst>
</lst>
</response>
at __randomizedtesting.SeedInfo.seed([7A73F81A6B413F97:11F2E6645E4F09F9]:0)
at org.junit.Assert.fail(Assert.java:93)
at org.apache.solr.analytics.AbstractAnalyticsStatsTest.getStatResult(AbstractAnalyticsStatsTest.java:113)
at org.apache.solr.analytics.expression.ExpressionTest.multiplyTest(ExpressionTest.java:92)
at sun.reflect.NativeMethodAccessorImpl.invoke0(Native Method)
at sun.reflect.NativeMethodAccessorImpl.invoke(NativeMethodAccessorImpl.java:57)
at sun.reflect.DelegatingMethodAccessorImpl.invoke(DelegatingMethodAccessorImpl.java:43)
at java.lang.reflect.Method.invoke(Method.java:606)
at com.carrotsearch.randomizedtesting.RandomizedRunner.invoke(RandomizedRunner.java:1559)
at com.carrotsearch.randomizedtesting.RandomizedRunner.access$600(RandomizedRunner.java:79)
at com.carrotsearch.randomizedtesting.RandomizedRunner$6.evaluate(RandomizedRunner.java:737)
at com.carrotsearch.randomizedtesting.RandomizedRunner$7.evaluate(RandomizedRunner.java:773)
at com.carrotsearch.randomizedtesting.RandomizedRunner$8.evaluate(RandomizedRunner.java:787)
at com.carrotsearch.randomizedtesting.rules.SystemPropertiesRestoreRule$1.evaluate(SystemPropertiesRestoreRule.java:53)
at org.apache.lucene.util.TestRuleSetupTeardownChained$1.evaluate(TestRuleSetupTeardownChained.java:50)
at org.apache.lucene.util.TestRuleFieldCacheSanity$1.evaluate(TestRuleFieldCacheSanity.java:51)
at org.apache.lucene.util.AbstractBeforeAfterRule$1.evaluate(AbstractBeforeAfterRule.java:46)
at com.carrotsearch.randomizedtesting.rules.SystemPropertiesInvariantRule$1.evaluate(SystemPropertiesInvariantRule.java:55)
at org.apache.lucene.util.TestRuleThreadAndTestName$1.evaluate(TestRuleThreadAndTestName.java:49)
at org.apache.lucene.util.TestRuleIgnoreAfterMaxFailures$1.evaluate(TestRuleIgnoreAfterMaxFailures.java:70)
at org.apache.lucene.util.TestRuleMarkFailure$1.evaluate(TestRuleMarkFailure.java:48)
at com.carrotsearch.randomizedtesting.rules.StatementAdapter.evaluate(StatementAdapter.java:36)
at com.carrotsearch.randomizedtesting.ThreadLeakControl$StatementRunner.run(ThreadLeakControl.java:358)
at com.carrotsearch.randomizedtesting.ThreadLeakControl.forkTimeoutingTask(ThreadLeakControl.java:782)
at com.carrotsearch.randomizedtesting.ThreadLeakControl$3.evaluate(ThreadLeakControl.java:442)
at com.carrotsearch.randomizedtesting.RandomizedRunner.runSingleTest(RandomizedRunner.java:746)
at com.carrotsearch.randomizedtesting.RandomizedRunner$3.evaluate(RandomizedRunner.java:648)
at com.carrotsearch.randomizedtesting.RandomizedRunner$4.evaluate(RandomizedRunner.java:682)
at com.carrotsearch.randomizedtesting.RandomizedRunner$5.evaluate(RandomizedRunner.java:693)
at com.carrotsearch.randomizedtesting.rules.StatementAdapter.evaluate(StatementAdapter.java:36)
at com.carrotsearch.randomizedtesting.rules.SystemPropertiesRestoreRule$1.evaluate(SystemPropertiesRestoreRule.java:53)
at org.apache.lucene.util.AbstractBeforeAfterRule$1.evaluate(AbstractBeforeAfterRule.java:46)
at org.apache.lucene.util.TestRuleStoreClassName$1.evaluate(TestRuleStoreClassName.java:42)
at com.carrotsearch.randomizedtesting.rules.SystemPropertiesInvariantRule$1.evaluate(SystemPropertiesInvariantRule.java:55)
at com.carrotsearch.randomizedtesting.rules.NoShadowingOrOverridesOnMethodsRule$1.evaluate(NoShadowingOrOverridesOnMethodsRule.java:39)
at com.carrotsearch.randomizedtesting.rules.NoShadowingOrOverridesOnMethodsRule$1.evaluate(NoShadowingOrOverridesOnMethodsRule.java:39)
at com.carrotsearch.randomizedtesting.rules.StatementAdapter.evaluate(StatementAdapter.java:36)
at org.apache.lucene.util.TestRuleAssertionsRequired$1.evaluate(TestRuleAssertionsRequired.java:43)
at org.apache.lucene.util.TestRuleMarkFailure$1.evaluate(TestRuleMarkFailure.java:48)
at org.apache.lucene.util.TestRuleIgnoreAfterMaxFailures$1.evaluate(TestRuleIgnoreAfterMaxFailures.java:70)
at org.apache.lucene.util.TestRuleIgnoreTestSuites$1.evaluate(TestRuleIgnoreTestSuites.java:55)
at com.carrotsearch.randomizedtesting.rules.StatementAdapter.evaluate(StatementAdapter.java:36)
at com.carrotsearch.randomizedtesting.ThreadLeakControl$StatementRunner.run(ThreadLeakControl.java:358)
at java.lang.Thread.run(Thread.java:744)
FAILED: org.apache.solr.analytics.expression.ExpressionTest.divideTest
Error Message:
Caught exception in getStatResult, xPath = /response/lst[@name='stats']/lst[@name='dr']/double[@name='sum'] raw data: <?xml version="1.0" encoding="UTF-8"?> <response> <lst name="responseHeader"> <int name="status">0</int> <int name="QTime">29</int> </lst> <result name="response" numFound="100" start="0"> </result> <lst name="stats"> <lst name="stats_fields"/> </lst> <lst name="stats"> <lst name="cr"> <str name="ccmax">this is the secondstr9</str> <str name="ccmin">this is the firststr0</str> <str name="csmax">this is the second</str> <str name="csmin">this is the first</str> <str name="max">str9</str> <str name="min">str0</str> </lst> <lst name="cnr"> <double name="c10">10.0</double> <double name="c8">8.0</double> </lst> <lst name="pr"> <long name="count">100</long> <null name="mc"/> <null name="mean"/> <null name="su"/> <null name="sum"/> <null name="unique"/> </lst> <lst name="nr"> <double name="c">-100.0</double> <long name="count">100</long> <null name="s"/> <null name="sum"/> </lst> <lst name="csr"> <str name="cs1">this is the first</str> <str name="cs2">this is the second</str> <str name="cs3">this is the third</str> </lst> <lst name="rr"> <str name="max">str9</str> <str name="min">str0</str> <str name="rmax">9rts</str> <str name="rmin">0rts</str> </lst> <lst name="avr"> <double name="c">100.0</double> <long name="count">100</long> <null name="s"/> <null name="sum"/> </lst> <lst name="cdr"> <date name="cd1">1800-12-31T23:59:59Z</date> <date name="cd2">1804-06-30T23:59:59Z</date> <str name="cs1">1800-12-31T23:59:59Z</str> <str name="cs2">1804-06-30T23:59:59Z</str> </lst> <lst name="mr"> <long name="count">100</long> <null name="mcm"/> <null name="mean"/> <null name="median"/> <null name="su"/> <null name="sum"/> <null name="unique"/> </lst> <lst name="dr"> <long name="count">100</long> <null name="mc"/> <null name="mean"/> <null name="su"/> <null name="sum"/> <null name="unique"/> </lst> <lst name="dmr"> <str name="cma">+2MONTHS</str> <str name="cme">+2YEARS</str> <date name="dmma">1812-02-29T23:59:59Z</date> <date name="dmme">1807-12-31T23:59:59Z</date> <date name="max">1811-12-31T23:59:59Z</date> <date name="median">1805-12-31T23:59:59Z</date> </lst> <lst name="ar"> <long name="count">100</long> <null name="mcm"/> <null name="mean"/> <null name="median"/> <null name="su"/> <null name="sum"/> <null name="unique"/> </lst> </lst> </response>
Stack Trace:
java.lang.AssertionError: Caught exception in getStatResult, xPath = /response/lst[@name='stats']/lst[@name='dr']/double[@name='sum']
raw data: <?xml version="1.0" encoding="UTF-8"?>
<response>
<lst name="responseHeader">
<int name="status">0</int>
<int name="QTime">29</int>
</lst>
<result name="response" numFound="100" start="0">
</result>
<lst name="stats">
<lst name="stats_fields"/>
</lst>
<lst name="stats">
<lst name="cr">
<str name="ccmax">this is the secondstr9</str>
<str name="ccmin">this is the firststr0</str>
<str name="csmax">this is the second</str>
<str name="csmin">this is the first</str>
<str name="max">str9</str>
<str name="min">str0</str>
</lst>
<lst name="cnr">
<double name="c10">10.0</double>
<double name="c8">8.0</double>
</lst>
<lst name="pr">
<long name="count">100</long>
<null name="mc"/>
<null name="mean"/>
<null name="su"/>
<null name="sum"/>
<null name="unique"/>
</lst>
<lst name="nr">
<double name="c">-100.0</double>
<long name="count">100</long>
<null name="s"/>
<null name="sum"/>
</lst>
<lst name="csr">
<str name="cs1">this is the first</str>
<str name="cs2">this is the second</str>
<str name="cs3">this is the third</str>
</lst>
<lst name="rr">
<str name="max">str9</str>
<str name="min">str0</str>
<str name="rmax">9rts</str>
<str name="rmin">0rts</str>
</lst>
<lst name="avr">
<double name="c">100.0</double>
<long name="count">100</long>
<null name="s"/>
<null name="sum"/>
</lst>
<lst name="cdr">
<date name="cd1">1800-12-31T23:59:59Z</date>
<date name="cd2">1804-06-30T23:59:59Z</date>
<str name="cs1">1800-12-31T23:59:59Z</str>
<str name="cs2">1804-06-30T23:59:59Z</str>
</lst>
<lst name="mr">
<long name="count">100</long>
<null name="mcm"/>
<null name="mean"/>
<null name="median"/>
<null name="su"/>
<null name="sum"/>
<null name="unique"/>
</lst>
<lst name="dr">
<long name="count">100</long>
<null name="mc"/>
<null name="mean"/>
<null name="su"/>
<null name="sum"/>
<null name="unique"/>
</lst>
<lst name="dmr">
<str name="cma">+2MONTHS</str>
<str name="cme">+2YEARS</str>
<date name="dmma">1812-02-29T23:59:59Z</date>
<date name="dmme">1807-12-31T23:59:59Z</date>
<date name="max">1811-12-31T23:59:59Z</date>
<date name="median">1805-12-31T23:59:59Z</date>
</lst>
<lst name="ar">
<long name="count">100</long>
<null name="mcm"/>
<null name="mean"/>
<null name="median"/>
<null name="su"/>
<null name="sum"/>
<null name="unique"/>
</lst>
</lst>
</response>
at __randomizedtesting.SeedInfo.seed([7A73F81A6B413F97:227E13EC4F835D41]:0)
at org.junit.Assert.fail(Assert.java:93)
at org.apache.solr.analytics.AbstractAnalyticsStatsTest.getStatResult(AbstractAnalyticsStatsTest.java:113)
at org.apache.solr.analytics.expression.ExpressionTest.divideTest(ExpressionTest.java:106)
at sun.reflect.NativeMethodAccessorImpl.invoke0(Native Method)
at sun.reflect.NativeMethodAccessorImpl.invoke(NativeMethodAccessorImpl.java:57)
at sun.reflect.DelegatingMethodAccessorImpl.invoke(DelegatingMethodAccessorImpl.java:43)
at java.lang.reflect.Method.invoke(Method.java:606)
at com.carrotsearch.randomizedtesting.RandomizedRunner.invoke(RandomizedRunner.java:1559)
at com.carrotsearch.randomizedtesting.RandomizedRunner.access$600(RandomizedRunner.java:79)
at com.carrotsearch.randomizedtesting.RandomizedRunner$6.evaluate(RandomizedRunner.java:737)
at com.carrotsearch.randomizedtesting.RandomizedRunner$7.evaluate(RandomizedRunner.java:773)
at com.carrotsearch.randomizedtesting.RandomizedRunner$8.evaluate(RandomizedRunner.java:787)
at com.carrotsearch.randomizedtesting.rules.SystemPropertiesRestoreRule$1.evaluate(SystemPropertiesRestoreRule.java:53)
at org.apache.lucene.util.TestRuleSetupTeardownChained$1.evaluate(TestRuleSetupTeardownChained.java:50)
at org.apache.lucene.util.TestRuleFieldCacheSanity$1.evaluate(TestRuleFieldCacheSanity.java:51)
at org.apache.lucene.util.AbstractBeforeAfterRule$1.evaluate(AbstractBeforeAfterRule.java:46)
at com.carrotsearch.randomizedtesting.rules.SystemPropertiesInvariantRule$1.evaluate(SystemPropertiesInvariantRule.java:55)
at org.apache.lucene.util.TestRuleThreadAndTestName$1.evaluate(TestRuleThreadAndTestName.java:49)
at org.apache.lucene.util.TestRuleIgnoreAfterMaxFailures$1.evaluate(TestRuleIgnoreAfterMaxFailures.java:70)
at org.apache.lucene.util.TestRuleMarkFailure$1.evaluate(TestRuleMarkFailure.java:48)
at com.carrotsearch.randomizedtesting.rules.StatementAdapter.evaluate(StatementAdapter.java:36)
at com.carrotsearch.randomizedtesting.ThreadLeakControl$StatementRunner.run(ThreadLeakControl.java:358)
at com.carrotsearch.randomizedtesting.ThreadLeakControl.forkTimeoutingTask(ThreadLeakControl.java:782)
at com.carrotsearch.randomizedtesting.ThreadLeakControl$3.evaluate(ThreadLeakControl.java:442)
at com.carrotsearch.randomizedtesting.RandomizedRunner.runSingleTest(RandomizedRunner.java:746)
at com.carrotsearch.randomizedtesting.RandomizedRunner$3.evaluate(RandomizedRunner.java:648)
at com.carrotsearch.randomizedtesting.RandomizedRunner$4.evaluate(RandomizedRunner.java:682)
at com.carrotsearch.randomizedtesting.RandomizedRunner$5.evaluate(RandomizedRunner.java:693)
at com.carrotsearch.randomizedtesting.rules.StatementAdapter.evaluate(StatementAdapter.java:36)
at com.carrotsearch.randomizedtesting.rules.SystemPropertiesRestoreRule$1.evaluate(SystemPropertiesRestoreRule.java:53)
at org.apache.lucene.util.AbstractBeforeAfterRule$1.evaluate(AbstractBeforeAfterRule.java:46)
at org.apache.lucene.util.TestRuleStoreClassName$1.evaluate(TestRuleStoreClassName.java:42)
at com.carrotsearch.randomizedtesting.rules.SystemPropertiesInvariantRule$1.evaluate(SystemPropertiesInvariantRule.java:55)
at com.carrotsearch.randomizedtesting.rules.NoShadowingOrOverridesOnMethodsRule$1.evaluate(NoShadowingOrOverridesOnMethodsRule.java:39)
at com.carrotsearch.randomizedtesting.rules.NoShadowingOrOverridesOnMethodsRule$1.evaluate(NoShadowingOrOverridesOnMethodsRule.java:39)
at com.carrotsearch.randomizedtesting.rules.StatementAdapter.evaluate(StatementAdapter.java:36)
at org.apache.lucene.util.TestRuleAssertionsRequired$1.evaluate(TestRuleAssertionsRequired.java:43)
at org.apache.lucene.util.TestRuleMarkFailure$1.evaluate(TestRuleMarkFailure.java:48)
at org.apache.lucene.util.TestRuleIgnoreAfterMaxFailures$1.evaluate(TestRuleIgnoreAfterMaxFailures.java:70)
at org.apache.lucene.util.TestRuleIgnoreTestSuites$1.evaluate(TestRuleIgnoreTestSuites.java:55)
at com.carrotsearch.randomizedtesting.rules.StatementAdapter.evaluate(StatementAdapter.java:36)
at com.carrotsearch.randomizedtesting.ThreadLeakControl$StatementRunner.run(ThreadLeakControl.java:358)
at java.lang.Thread.run(Thread.java:744)
FAILED: org.apache.solr.analytics.expression.ExpressionTest.absoluteValueTest
Error Message:
Caught exception in getStatResult, xPath = /response/lst[@name='stats']/lst[@name='avr']/double[@name='sum'] raw data: <?xml version="1.0" encoding="UTF-8"?> <response> <lst name="responseHeader"> <int name="status">0</int> <int name="QTime">29</int> </lst> <result name="response" numFound="100" start="0"> </result> <lst name="stats"> <lst name="stats_fields"/> </lst> <lst name="stats"> <lst name="cr"> <str name="ccmax">this is the secondstr9</str> <str name="ccmin">this is the firststr0</str> <str name="csmax">this is the second</str> <str name="csmin">this is the first</str> <str name="max">str9</str> <str name="min">str0</str> </lst> <lst name="cnr"> <double name="c10">10.0</double> <double name="c8">8.0</double> </lst> <lst name="pr"> <long name="count">100</long> <null name="mc"/> <null name="mean"/> <null name="su"/> <null name="sum"/> <null name="unique"/> </lst> <lst name="nr"> <double name="c">-100.0</double> <long name="count">100</long> <null name="s"/> <null name="sum"/> </lst> <lst name="csr"> <str name="cs1">this is the first</str> <str name="cs2">this is the second</str> <str name="cs3">this is the third</str> </lst> <lst name="rr"> <str name="max">str9</str> <str name="min">str0</str> <str name="rmax">9rts</str> <str name="rmin">0rts</str> </lst> <lst name="avr"> <double name="c">100.0</double> <long name="count">100</long> <null name="s"/> <null name="sum"/> </lst> <lst name="cdr"> <date name="cd1">1800-12-31T23:59:59Z</date> <date name="cd2">1804-06-30T23:59:59Z</date> <str name="cs1">1800-12-31T23:59:59Z</str> <str name="cs2">1804-06-30T23:59:59Z</str> </lst> <lst name="mr"> <long name="count">100</long> <null name="mcm"/> <null name="mean"/> <null name="median"/> <null name="su"/> <null name="sum"/> <null name="unique"/> </lst> <lst name="dr"> <long name="count">100</long> <null name="mc"/> <null name="mean"/> <null name="su"/> <null name="sum"/> <null name="unique"/> </lst> <lst name="dmr"> <str name="cma">+2MONTHS</str> <str name="cme">+2YEARS</str> <date name="dmma">1812-02-29T23:59:59Z</date> <date name="dmme">1807-12-31T23:59:59Z</date> <date name="max">1811-12-31T23:59:59Z</date> <date name="median">1805-12-31T23:59:59Z</date> </lst> <lst name="ar"> <long name="count">100</long> <null name="mcm"/> <null name="mean"/> <null name="median"/> <null name="su"/> <null name="sum"/> <null name="unique"/> </lst> </lst> </response>
Stack Trace:
java.lang.AssertionError: Caught exception in getStatResult, xPath = /response/lst[@name='stats']/lst[@name='avr']/double[@name='sum']
raw data: <?xml version="1.0" encoding="UTF-8"?>
<response>
<lst name="responseHeader">
<int name="status">0</int>
<int name="QTime">29</int>
</lst>
<result name="response" numFound="100" start="0">
</result>
<lst name="stats">
<lst name="stats_fields"/>
</lst>
<lst name="stats">
<lst name="cr">
<str name="ccmax">this is the secondstr9</str>
<str name="ccmin">this is the firststr0</str>
<str name="csmax">this is the second</str>
<str name="csmin">this is the first</str>
<str name="max">str9</str>
<str name="min">str0</str>
</lst>
<lst name="cnr">
<double name="c10">10.0</double>
<double name="c8">8.0</double>
</lst>
<lst name="pr">
<long name="count">100</long>
<null name="mc"/>
<null name="mean"/>
<null name="su"/>
<null name="sum"/>
<null name="unique"/>
</lst>
<lst name="nr">
<double name="c">-100.0</double>
<long name="count">100</long>
<null name="s"/>
<null name="sum"/>
</lst>
<lst name="csr">
<str name="cs1">this is the first</str>
<str name="cs2">this is the second</str>
<str name="cs3">this is the third</str>
</lst>
<lst name="rr">
<str name="max">str9</str>
<str name="min">str0</str>
<str name="rmax">9rts</str>
<str name="rmin">0rts</str>
</lst>
<lst name="avr">
<double name="c">100.0</double>
<long name="count">100</long>
<null name="s"/>
<null name="sum"/>
</lst>
<lst name="cdr">
<date name="cd1">1800-12-31T23:59:59Z</date>
<date name="cd2">1804-06-30T23:59:59Z</date>
<str name="cs1">1800-12-31T23:59:59Z</str>
<str name="cs2">1804-06-30T23:59:59Z</str>
</lst>
<lst name="mr">
<long name="count">100</long>
<null name="mcm"/>
<null name="mean"/>
<null name="median"/>
<null name="su"/>
<null name="sum"/>
<null name="unique"/>
</lst>
<lst name="dr">
<long name="count">100</long>
<null name="mc"/>
<null name="mean"/>
<null name="su"/>
<null name="sum"/>
<null name="unique"/>
</lst>
<lst name="dmr">
<str name="cma">+2MONTHS</str>
<str name="cme">+2YEARS</str>
<date name="dmma">1812-02-29T23:59:59Z</date>
<date name="dmme">1807-12-31T23:59:59Z</date>
<date name="max">1811-12-31T23:59:59Z</date>
<date name="median">1805-12-31T23:59:59Z</date>
</lst>
<lst name="ar">
<long name="count">100</long>
<null name="mcm"/>
<null name="mean"/>
<null name="median"/>
<null name="su"/>
<null name="sum"/>
<null name="unique"/>
</lst>
</lst>
</response>
at __randomizedtesting.SeedInfo.seed([7A73F81A6B413F97:5BDFD80FA6DC67F1]:0)
at org.junit.Assert.fail(Assert.java:93)
at org.apache.solr.analytics.AbstractAnalyticsStatsTest.getStatResult(AbstractAnalyticsStatsTest.java:113)
at org.apache.solr.analytics.expression.ExpressionTest.absoluteValueTest(ExpressionTest.java:143)
at sun.reflect.NativeMethodAccessorImpl.invoke0(Native Method)
at sun.reflect.NativeMethodAccessorImpl.invoke(NativeMethodAccessorImpl.java:57)
at sun.reflect.DelegatingMethodAccessorImpl.invoke(DelegatingMethodAccessorImpl.java:43)
at java.lang.reflect.Method.invoke(Method.java:606)
at com.carrotsearch.randomizedtesting.RandomizedRunner.invoke(RandomizedRunner.java:1559)
at com.carrotsearch.randomizedtesting.RandomizedRunner.access$600(RandomizedRunner.java:79)
at com.carrotsearch.randomizedtesting.RandomizedRunner$6.evaluate(RandomizedRunner.java:737)
at com.carrotsearch.randomizedtesting.RandomizedRunner$7.evaluate(RandomizedRunner.java:773)
at com.carrotsearch.randomizedtesting.RandomizedRunner$8.evaluate(RandomizedRunner.java:787)
at com.carrotsearch.randomizedtesting.rules.SystemPropertiesRestoreRule$1.evaluate(SystemPropertiesRestoreRule.java:53)
at org.apache.lucene.util.TestRuleSetupTeardownChained$1.evaluate(TestRuleSetupTeardownChained.java:50)
at org.apache.lucene.util.TestRuleFieldCacheSanity$1.evaluate(TestRuleFieldCacheSanity.java:51)
at org.apache.lucene.util.AbstractBeforeAfterRule$1.evaluate(AbstractBeforeAfterRule.java:46)
at com.carrotsearch.randomizedtesting.rules.SystemPropertiesInvariantRule$1.evaluate(SystemPropertiesInvariantRule.java:55)
at org.apache.lucene.util.TestRuleThreadAndTestName$1.evaluate(TestRuleThreadAndTestName.java:49)
at org.apache.lucene.util.TestRuleIgnoreAfterMaxFailures$1.evaluate(TestRuleIgnoreAfterMaxFailures.java:70)
at org.apache.lucene.util.TestRuleMarkFailure$1.evaluate(TestRuleMarkFailure.java:48)
at com.carrotsearch.randomizedtesting.rules.StatementAdapter.evaluate(StatementAdapter.java:36)
at com.carrotsearch.randomizedtesting.ThreadLeakControl$StatementRunner.run(ThreadLeakControl.java:358)
at com.carrotsearch.randomizedtesting.ThreadLeakControl.forkTimeoutingTask(ThreadLeakControl.java:782)
at com.carrotsearch.randomizedtesting.ThreadLeakControl$3.evaluate(ThreadLeakControl.java:442)
at com.carrotsearch.randomizedtesting.RandomizedRunner.runSingleTest(RandomizedRunner.java:746)
at com.carrotsearch.randomizedtesting.RandomizedRunner$3.evaluate(RandomizedRunner.java:648)
at com.carrotsearch.randomizedtesting.RandomizedRunner$4.evaluate(RandomizedRunner.java:682)
at com.carrotsearch.randomizedtesting.RandomizedRunner$5.evaluate(RandomizedRunner.java:693)
at com.carrotsearch.randomizedtesting.rules.StatementAdapter.evaluate(StatementAdapter.java:36)
at com.carrotsearch.randomizedtesting.rules.SystemPropertiesRestoreRule$1.evaluate(SystemPropertiesRestoreRule.java:53)
at org.apache.lucene.util.AbstractBeforeAfterRule$1.evaluate(AbstractBeforeAfterRule.java:46)
at org.apache.lucene.util.TestRuleStoreClassName$1.evaluate(TestRuleStoreClassName.java:42)
at com.carrotsearch.randomizedtesting.rules.SystemPropertiesInvariantRule$1.evaluate(SystemPropertiesInvariantRule.java:55)
at com.carrotsearch.randomizedtesting.rules.NoShadowingOrOverridesOnMethodsRule$1.evaluate(NoShadowingOrOverridesOnMethodsRule.java:39)
at com.carrotsearch.randomizedtesting.rules.NoShadowingOrOverridesOnMethodsRule$1.evaluate(NoShadowingOrOverridesOnMethodsRule.java:39)
at com.carrotsearch.randomizedtesting.rules.StatementAdapter.evaluate(StatementAdapter.java:36)
at org.apache.lucene.util.TestRuleAssertionsRequired$1.evaluate(TestRuleAssertionsRequired.java:43)
at org.apache.lucene.util.TestRuleMarkFailure$1.evaluate(TestRuleMarkFailure.java:48)
at org.apache.lucene.util.TestRuleIgnoreAfterMaxFailures$1.evaluate(TestRuleIgnoreAfterMaxFailures.java:70)
at org.apache.lucene.util.TestRuleIgnoreTestSuites$1.evaluate(TestRuleIgnoreTestSuites.java:55)
at com.carrotsearch.randomizedtesting.rules.StatementAdapter.evaluate(StatementAdapter.java:36)
at com.carrotsearch.randomizedtesting.ThreadLeakControl$StatementRunner.run(ThreadLeakControl.java:358)
at java.lang.Thread.run(Thread.java:744)
FAILED: org.apache.solr.analytics.expression.ExpressionTest.negateTest
Error Message:
Caught exception in getStatResult, xPath = /response/lst[@name='stats']/lst[@name='nr']/double[@name='sum'] raw data: <?xml version="1.0" encoding="UTF-8"?> <response> <lst name="responseHeader"> <int name="status">0</int> <int name="QTime">29</int> </lst> <result name="response" numFound="100" start="0"> </result> <lst name="stats"> <lst name="stats_fields"/> </lst> <lst name="stats"> <lst name="cr"> <str name="ccmax">this is the secondstr9</str> <str name="ccmin">this is the firststr0</str> <str name="csmax">this is the second</str> <str name="csmin">this is the first</str> <str name="max">str9</str> <str name="min">str0</str> </lst> <lst name="cnr"> <double name="c10">10.0</double> <double name="c8">8.0</double> </lst> <lst name="pr"> <long name="count">100</long> <null name="mc"/> <null name="mean"/> <null name="su"/> <null name="sum"/> <null name="unique"/> </lst> <lst name="nr"> <double name="c">-100.0</double> <long name="count">100</long> <null name="s"/> <null name="sum"/> </lst> <lst name="csr"> <str name="cs1">this is the first</str> <str name="cs2">this is the second</str> <str name="cs3">this is the third</str> </lst> <lst name="rr"> <str name="max">str9</str> <str name="min">str0</str> <str name="rmax">9rts</str> <str name="rmin">0rts</str> </lst> <lst name="avr"> <double name="c">100.0</double> <long name="count">100</long> <null name="s"/> <null name="sum"/> </lst> <lst name="cdr"> <date name="cd1">1800-12-31T23:59:59Z</date> <date name="cd2">1804-06-30T23:59:59Z</date> <str name="cs1">1800-12-31T23:59:59Z</str> <str name="cs2">1804-06-30T23:59:59Z</str> </lst> <lst name="mr"> <long name="count">100</long> <null name="mcm"/> <null name="mean"/> <null name="median"/> <null name="su"/> <null name="sum"/> <null name="unique"/> </lst> <lst name="dr"> <long name="count">100</long> <null name="mc"/> <null name="mean"/> <null name="su"/> <null name="sum"/> <null name="unique"/> </lst> <lst name="dmr"> <str name="cma">+2MONTHS</str> <str name="cme">+2YEARS</str> <date name="dmma">1812-02-29T23:59:59Z</date> <date name="dmme">1807-12-31T23:59:59Z</date> <date name="max">1811-12-31T23:59:59Z</date> <date name="median">1805-12-31T23:59:59Z</date> </lst> <lst name="ar"> <long name="count">100</long> <null name="mcm"/> <null name="mean"/> <null name="median"/> <null name="su"/> <null name="sum"/> <null name="unique"/> </lst> </lst> </response>
Stack Trace:
java.lang.AssertionError: Caught exception in getStatResult, xPath = /response/lst[@name='stats']/lst[@name='nr']/double[@name='sum']
raw data: <?xml version="1.0" encoding="UTF-8"?>
<response>
<lst name="responseHeader">
<int name="status">0</int>
<int name="QTime">29</int>
</lst>
<result name="response" numFound="100" start="0">
</result>
<lst name="stats">
<lst name="stats_fields"/>
</lst>
<lst name="stats">
<lst name="cr">
<str name="ccmax">this is the secondstr9</str>
<str name="ccmin">this is the firststr0</str>
<str name="csmax">this is the second</str>
<str name="csmin">this is the first</str>
<str name="max">str9</str>
<str name="min">str0</str>
</lst>
<lst name="cnr">
<double name="c10">10.0</double>
<double name="c8">8.0</double>
</lst>
<lst name="pr">
<long name="count">100</long>
<null name="mc"/>
<null name="mean"/>
<null name="su"/>
<null name="sum"/>
<null name="unique"/>
</lst>
<lst name="nr">
<double name="c">-100.0</double>
<long name="count">100</long>
<null name="s"/>
<null name="sum"/>
</lst>
<lst name="csr">
<str name="cs1">this is the first</str>
<str name="cs2">this is the second</str>
<str name="cs3">this is the third</str>
</lst>
<lst name="rr">
<str name="max">str9</str>
<str name="min">str0</str>
<str name="rmax">9rts</str>
<str name="rmin">0rts</str>
</lst>
<lst name="avr">
<double name="c">100.0</double>
<long name="count">100</long>
<null name="s"/>
<null name="sum"/>
</lst>
<lst name="cdr">
<date name="cd1">1800-12-31T23:59:59Z</date>
<date name="cd2">1804-06-30T23:59:59Z</date>
<str name="cs1">1800-12-31T23:59:59Z</str>
<str name="cs2">1804-06-30T23:59:59Z</str>
</lst>
<lst name="mr">
<long name="count">100</long>
<null name="mcm"/>
<null name="mean"/>
<null name="median"/>
<null name="su"/>
<null name="sum"/>
<null name="unique"/>
</lst>
<lst name="dr">
<long name="count">100</long>
<null name="mc"/>
<null name="mean"/>
<null name="su"/>
<null name="sum"/>
<null name="unique"/>
</lst>
<lst name="dmr">
<str name="cma">+2MONTHS</str>
<str name="cme">+2YEARS</str>
<date name="dmma">1812-02-29T23:59:59Z</date>
<date name="dmme">1807-12-31T23:59:59Z</date>
<date name="max">1811-12-31T23:59:59Z</date>
<date name="median">1805-12-31T23:59:59Z</date>
</lst>
<lst name="ar">
<long name="count">100</long>
<null name="mcm"/>
<null name="mean"/>
<null name="median"/>
<null name="su"/>
<null name="sum"/>
<null name="unique"/>
</lst>
</lst>
</response>
at __randomizedtesting.SeedInfo.seed([7A73F81A6B413F97:727B90BFCF6C6F27]:0)
at org.junit.Assert.fail(Assert.java:93)
at org.apache.solr.analytics.AbstractAnalyticsStatsTest.getStatResult(AbstractAnalyticsStatsTest.java:113)
at org.apache.solr.analytics.expression.ExpressionTest.negateTest(ExpressionTest.java:132)
at sun.reflect.NativeMethodAccessorImpl.invoke0(Native Method)
at sun.reflect.NativeMethodAccessorImpl.invoke(NativeMethodAccessorImpl.java:57)
at sun.reflect.DelegatingMethodAccessorImpl.invoke(DelegatingMethodAccessorImpl.java:43)
at java.lang.reflect.Method.invoke(Method.java:606)
at com.carrotsearch.randomizedtesting.RandomizedRunner.invoke(RandomizedRunner.java:1559)
at com.carrotsearch.randomizedtesting.RandomizedRunner.access$600(RandomizedRunner.java:79)
at com.carrotsearch.randomizedtesting.RandomizedRunner$6.evaluate(RandomizedRunner.java:737)
at com.carrotsearch.randomizedtesting.RandomizedRunner$7.evaluate(RandomizedRunner.java:773)
at com.carrotsearch.randomizedtesting.RandomizedRunner$8.evaluate(RandomizedRunner.java:787)
at com.carrotsearch.randomizedtesting.rules.SystemPropertiesRestoreRule$1.evaluate(SystemPropertiesRestoreRule.java:53)
at org.apache.lucene.util.TestRuleSetupTeardownChained$1.evaluate(TestRuleSetupTeardownChained.java:50)
at org.apache.lucene.util.TestRuleFieldCacheSanity$1.evaluate(TestRuleFieldCacheSanity.java:51)
at org.apache.lucene.util.AbstractBeforeAfterRule$1.evaluate(AbstractBeforeAfterRule.java:46)
at com.carrotsearch.randomizedtesting.rules.SystemPropertiesInvariantRule$1.evaluate(SystemPropertiesInvariantRule.java:55)
at org.apache.lucene.util.TestRuleThreadAndTestName$1.evaluate(TestRuleThreadAndTestName.java:49)
at org.apache.lucene.util.TestRuleIgnoreAfterMaxFailures$1.evaluate(TestRuleIgnoreAfterMaxFailures.java:70)
at org.apache.lucene.util.TestRuleMarkFailure$1.evaluate(TestRuleMarkFailure.java:48)
at com.carrotsearch.randomizedtesting.rules.StatementAdapter.evaluate(StatementAdapter.java:36)
at com.carrotsearch.randomizedtesting.ThreadLeakControl$StatementRunner.run(ThreadLeakControl.java:358)
at com.carrotsearch.randomizedtesting.ThreadLeakControl.forkTimeoutingTask(ThreadLeakControl.java:782)
at com.carrotsearch.randomizedtesting.ThreadLeakControl$3.evaluate(ThreadLeakControl.java:442)
at com.carrotsearch.randomizedtesting.RandomizedRunner.runSingleTest(RandomizedRunner.java:746)
at com.carrotsearch.randomizedtesting.RandomizedRunner$3.evaluate(RandomizedRunner.java:648)
at com.carrotsearch.randomizedtesting.RandomizedRunner$4.evaluate(RandomizedRunner.java:682)
at com.carrotsearch.randomizedtesting.RandomizedRunner$5.evaluate(RandomizedRunner.java:693)
at com.carrotsearch.randomizedtesting.rules.StatementAdapter.evaluate(StatementAdapter.java:36)
at com.carrotsearch.randomizedtesting.rules.SystemPropertiesRestoreRule$1.evaluate(SystemPropertiesRestoreRule.java:53)
at org.apache.lucene.util.AbstractBeforeAfterRule$1.evaluate(AbstractBeforeAfterRule.java:46)
at org.apache.lucene.util.TestRuleStoreClassName$1.evaluate(TestRuleStoreClassName.java:42)
at com.carrotsearch.randomizedtesting.rules.SystemPropertiesInvariantRule$1.evaluate(SystemPropertiesInvariantRule.java:55)
at com.carrotsearch.randomizedtesting.rules.NoShadowingOrOverridesOnMethodsRule$1.evaluate(NoShadowingOrOverridesOnMethodsRule.java:39)
at com.carrotsearch.randomizedtesting.rules.NoShadowingOrOverridesOnMethodsRule$1.evaluate(NoShadowingOrOverridesOnMethodsRule.java:39)
at com.carrotsearch.randomizedtesting.rules.StatementAdapter.evaluate(StatementAdapter.java:36)
at org.apache.lucene.util.TestRuleAssertionsRequired$1.evaluate(TestRuleAssertionsRequired.java:43)
at org.apache.lucene.util.TestRuleMarkFailure$1.evaluate(TestRuleMarkFailure.java:48)
at org.apache.lucene.util.TestRuleIgnoreAfterMaxFailures$1.evaluate(TestRuleIgnoreAfterMaxFailures.java:70)
at org.apache.lucene.util.TestRuleIgnoreTestSuites$1.evaluate(TestRuleIgnoreTestSuites.java:55)
at com.carrotsearch.randomizedtesting.rules.StatementAdapter.evaluate(StatementAdapter.java:36)
at com.carrotsearch.randomizedtesting.ThreadLeakControl$StatementRunner.run(ThreadLeakControl.java:358)
at java.lang.Thread.run(Thread.java:744)
FAILED: org.apache.solr.analytics.expression.ExpressionTest.powerTest
Error Message:
Caught exception in getStatResult, xPath = /response/lst[@name='stats']/lst[@name='pr']/double[@name='sum'] raw data: <?xml version="1.0" encoding="UTF-8"?> <response> <lst name="responseHeader"> <int name="status">0</int> <int name="QTime">29</int> </lst> <result name="response" numFound="100" start="0"> </result> <lst name="stats"> <lst name="stats_fields"/> </lst> <lst name="stats"> <lst name="cr"> <str name="ccmax">this is the secondstr9</str> <str name="ccmin">this is the firststr0</str> <str name="csmax">this is the second</str> <str name="csmin">this is the first</str> <str name="max">str9</str> <str name="min">str0</str> </lst> <lst name="cnr"> <double name="c10">10.0</double> <double name="c8">8.0</double> </lst> <lst name="pr"> <long name="count">100</long> <null name="mc"/> <null name="mean"/> <null name="su"/> <null name="sum"/> <null name="unique"/> </lst> <lst name="nr"> <double name="c">-100.0</double> <long name="count">100</long> <null name="s"/> <null name="sum"/> </lst> <lst name="csr"> <str name="cs1">this is the first</str> <str name="cs2">this is the second</str> <str name="cs3">this is the third</str> </lst> <lst name="rr"> <str name="max">str9</str> <str name="min">str0</str> <str name="rmax">9rts</str> <str name="rmin">0rts</str> </lst> <lst name="avr"> <double name="c">100.0</double> <long name="count">100</long> <null name="s"/> <null name="sum"/> </lst> <lst name="cdr"> <date name="cd1">1800-12-31T23:59:59Z</date> <date name="cd2">1804-06-30T23:59:59Z</date> <str name="cs1">1800-12-31T23:59:59Z</str> <str name="cs2">1804-06-30T23:59:59Z</str> </lst> <lst name="mr"> <long name="count">100</long> <null name="mcm"/> <null name="mean"/> <null name="median"/> <null name="su"/> <null name="sum"/> <null name="unique"/> </lst> <lst name="dr"> <long name="count">100</long> <null name="mc"/> <null name="mean"/> <null name="su"/> <null name="sum"/> <null name="unique"/> </lst> <lst name="dmr"> <str name="cma">+2MONTHS</str> <str name="cme">+2YEARS</str> <date name="dmma">1812-02-29T23:59:59Z</date> <date name="dmme">1807-12-31T23:59:59Z</date> <date name="max">1811-12-31T23:59:59Z</date> <date name="median">1805-12-31T23:59:59Z</date> </lst> <lst name="ar"> <long name="count">100</long> <null name="mcm"/> <null name="mean"/> <null name="median"/> <null name="su"/> <null name="sum"/> <null name="unique"/> </lst> </lst> </response>
Stack Trace:
java.lang.AssertionError: Caught exception in getStatResult, xPath = /response/lst[@name='stats']/lst[@name='pr']/double[@name='sum']
raw data: <?xml version="1.0" encoding="UTF-8"?>
<response>
<lst name="responseHeader">
<int name="status">0</int>
<int name="QTime">29</int>
</lst>
<result name="response" numFound="100" start="0">
</result>
<lst name="stats">
<lst name="stats_fields"/>
</lst>
<lst name="stats">
<lst name="cr">
<str name="ccmax">this is the secondstr9</str>
<str name="ccmin">this is the firststr0</str>
<str name="csmax">this is the second</str>
<str name="csmin">this is the first</str>
<str name="max">str9</str>
<str name="min">str0</str>
</lst>
<lst name="cnr">
<double name="c10">10.0</double>
<double name="c8">8.0</double>
</lst>
<lst name="pr">
<long name="count">100</long>
<null name="mc"/>
<null name="mean"/>
<null name="su"/>
<null name="sum"/>
<null name="unique"/>
</lst>
<lst name="nr">
<double name="c">-100.0</double>
<long name="count">100</long>
<null name="s"/>
<null name="sum"/>
</lst>
<lst name="csr">
<str name="cs1">this is the first</str>
<str name="cs2">this is the second</str>
<str name="cs3">this is the third</str>
</lst>
<lst name="rr">
<str name="max">str9</str>
<str name="min">str0</str>
<str name="rmax">9rts</str>
<str name="rmin">0rts</str>
</lst>
<lst name="avr">
<double name="c">100.0</double>
<long name="count">100</long>
<null name="s"/>
<null name="sum"/>
</lst>
<lst name="cdr">
<date name="cd1">1800-12-31T23:59:59Z</date>
<date name="cd2">1804-06-30T23:59:59Z</date>
<str name="cs1">1800-12-31T23:59:59Z</str>
<str name="cs2">1804-06-30T23:59:59Z</str>
</lst>
<lst name="mr">
<long name="count">100</long>
<null name="mcm"/>
<null name="mean"/>
<null name="median"/>
<null name="su"/>
<null name="sum"/>
<null name="unique"/>
</lst>
<lst name="dr">
<long name="count">100</long>
<null name="mc"/>
<null name="mean"/>
<null name="su"/>
<null name="sum"/>
<null name="unique"/>
</lst>
<lst name="dmr">
<str name="cma">+2MONTHS</str>
<str name="cme">+2YEARS</str>
<date name="dmma">1812-02-29T23:59:59Z</date>
<date name="dmme">1807-12-31T23:59:59Z</date>
<date name="max">1811-12-31T23:59:59Z</date>
<date name="median">1805-12-31T23:59:59Z</date>
</lst>
<lst name="ar">
<long name="count">100</long>
<null name="mcm"/>
<null name="mean"/>
<null name="median"/>
<null name="su"/>
<null name="sum"/>
<null name="unique"/>
</lst>
</lst>
</response>
at __randomizedtesting.SeedInfo.seed([7A73F81A6B413F97:14C14F1983566146]:0)
at org.junit.Assert.fail(Assert.java:93)
at org.apache.solr.analytics.AbstractAnalyticsStatsTest.getStatResult(AbstractAnalyticsStatsTest.java:113)
at org.apache.solr.analytics.expression.ExpressionTest.powerTest(ExpressionTest.java:119)
at sun.reflect.NativeMethodAccessorImpl.invoke0(Native Method)
at sun.reflect.NativeMethodAccessorImpl.invoke(NativeMethodAccessorImpl.java:57)
at sun.reflect.DelegatingMethodAccessorImpl.invoke(DelegatingMethodAccessorImpl.java:43)
at java.lang.reflect.Method.invoke(Method.java:606)
at com.carrotsearch.randomizedtesting.RandomizedRunner.invoke(RandomizedRunner.java:1559)
at com.carrotsearch.randomizedtesting.RandomizedRunner.access$600(RandomizedRunner.java:79)
at com.carrotsearch.randomizedtesting.RandomizedRunner$6.evaluate(RandomizedRunner.java:737)
at com.carrotsearch.randomizedtesting.RandomizedRunner$7.evaluate(RandomizedRunner.java:773)
at com.carrotsearch.randomizedtesting.RandomizedRunner$8.evaluate(RandomizedRunner.java:787)
at com.carrotsearch.randomizedtesting.rules.SystemPropertiesRestoreRule$1.evaluate(SystemPropertiesRestoreRule.java:53)
at org.apache.lucene.util.TestRuleSetupTeardownChained$1.evaluate(TestRuleSetupTeardownChained.java:50)
at org.apache.lucene.util.TestRuleFieldCacheSanity$1.evaluate(TestRuleFieldCacheSanity.java:51)
at org.apache.lucene.util.AbstractBeforeAfterRule$1.evaluate(AbstractBeforeAfterRule.java:46)
at com.carrotsearch.randomizedtesting.rules.SystemPropertiesInvariantRule$1.evaluate(SystemPropertiesInvariantRule.java:55)
at org.apache.lucene.util.TestRuleThreadAndTestName$1.evaluate(TestRuleThreadAndTestName.java:49)
at org.apache.lucene.util.TestRuleIgnoreAfterMaxFailures$1.evaluate(TestRuleIgnoreAfterMaxFailures.java:70)
at org.apache.lucene.util.TestRuleMarkFailure$1.evaluate(TestRuleMarkFailure.java:48)
at com.carrotsearch.randomizedtesting.rules.StatementAdapter.evaluate(StatementAdapter.java:36)
at com.carrotsearch.randomizedtesting.ThreadLeakControl$StatementRunner.run(ThreadLeakControl.java:358)
at com.carrotsearch.randomizedtesting.ThreadLeakControl.forkTimeoutingTask(ThreadLeakControl.java:782)
at com.carrotsearch.randomizedtesting.ThreadLeakControl$3.evaluate(ThreadLeakControl.java:442)
at com.carrotsearch.randomizedtesting.RandomizedRunner.runSingleTest(RandomizedRunner.java:746)
at com.carrotsearch.randomizedtesting.RandomizedRunner$3.evaluate(RandomizedRunner.java:648)
at com.carrotsearch.randomizedtesting.RandomizedRunner$4.evaluate(RandomizedRunner.java:682)
at com.carrotsearch.randomizedtesting.RandomizedRunner$5.evaluate(RandomizedRunner.java:693)
at com.carrotsearch.randomizedtesting.rules.StatementAdapter.evaluate(StatementAdapter.java:36)
at com.carrotsearch.randomizedtesting.rules.SystemPropertiesRestoreRule$1.evaluate(SystemPropertiesRestoreRule.java:53)
at org.apache.lucene.util.AbstractBeforeAfterRule$1.evaluate(AbstractBeforeAfterRule.java:46)
at org.apache.lucene.util.TestRuleStoreClassName$1.evaluate(TestRuleStoreClassName.java:42)
at com.carrotsearch.randomizedtesting.rules.SystemPropertiesInvariantRule$1.evaluate(SystemPropertiesInvariantRule.java:55)
at com.carrotsearch.randomizedtesting.rules.NoShadowingOrOverridesOnMethodsRule$1.evaluate(NoShadowingOrOverridesOnMethodsRule.java:39)
at com.carrotsearch.randomizedtesting.rules.NoShadowingOrOverridesOnMethodsRule$1.evaluate(NoShadowingOrOverridesOnMethodsRule.java:39)
at com.carrotsearch.randomizedtesting.rules.StatementAdapter.evaluate(StatementAdapter.java:36)
at org.apache.lucene.util.TestRuleAssertionsRequired$1.evaluate(TestRuleAssertionsRequired.java:43)
at org.apache.lucene.util.TestRuleMarkFailure$1.evaluate(TestRuleMarkFailure.java:48)
at org.apache.lucene.util.TestRuleIgnoreAfterMaxFailures$1.evaluate(TestRuleIgnoreAfterMaxFailures.java:70)
at org.apache.lucene.util.TestRuleIgnoreTestSuites$1.evaluate(TestRuleIgnoreTestSuites.java:55)
at com.carrotsearch.randomizedtesting.rules.StatementAdapter.evaluate(StatementAdapter.java:36)
at com.carrotsearch.randomizedtesting.ThreadLeakControl$StatementRunner.run(ThreadLeakControl.java:358)
at java.lang.Thread.run(Thread.java:744)
Build Log:
[...truncated 10381 lines...]
[junit4] Suite: org.apache.solr.analytics.expression.ExpressionTest
[junit4] 2> 695615 T2320 oas.SolrTestCaseJ4.initCore ####initCore
[junit4] 2> Creating dataDir: /mnt/ssd/jenkins/workspace/Lucene-Solr-trunk-Linux/solr/build/solr-core/test/J1/./solrtest-ExpressionTest-1386484331762
[junit4] 2> 695616 T2320 oasc.SolrResourceLoader.<init> new SolrResourceLoader for directory: '/mnt/ssd/jenkins/workspace/Lucene-Solr-trunk-Linux/solr/build/solr-core/test-files/solr/collection1/'
[junit4] 2> 695616 T2320 oasc.SolrResourceLoader.replaceClassLoader Adding 'file:/mnt/ssd/jenkins/workspace/Lucene-Solr-trunk-Linux/solr/build/solr-core/test-files/solr/collection1/lib/classes/' to classloader
[junit4] 2> 695616 T2320 oasc.SolrResourceLoader.replaceClassLoader Adding 'file:/mnt/ssd/jenkins/workspace/Lucene-Solr-trunk-Linux/solr/build/solr-core/test-files/solr/collection1/lib/README' to classloader
[junit4] 2> 695654 T2320 oasc.SolrConfig.<init> Using Lucene MatchVersion: LUCENE_50
[junit4] 2> 695703 T2320 oasc.SolrConfig.<init> Loaded SolrConfig: solrconfig-basic.xml
[junit4] 2> 695704 T2320 oass.IndexSchema.readSchema Reading Solr Schema from schema-analytics.xml
[junit4] 2> 695708 T2320 oass.IndexSchema.readSchema [null] Schema name=schema-docValues
[junit4] 2> 695735 T2320 oass.IndexSchema.readSchema unique key field: id
[junit4] 2> 695737 T2320 oasc.SolrResourceLoader.locateSolrHome JNDI not configured for solr (NoInitialContextEx)
[junit4] 2> 695737 T2320 oasc.SolrResourceLoader.locateSolrHome using system property solr.solr.home: /mnt/ssd/jenkins/workspace/Lucene-Solr-trunk-Linux/solr/build/solr-core/test-files/solr
[junit4] 2> 695737 T2320 oasc.SolrResourceLoader.<init> new SolrResourceLoader for directory: '/mnt/ssd/jenkins/workspace/Lucene-Solr-trunk-Linux/solr/build/solr-core/test-files/solr/'
[junit4] 2> 695747 T2320 oasc.SolrResourceLoader.locateSolrHome JNDI not configured for solr (NoInitialContextEx)
[junit4] 2> 695747 T2320 oasc.SolrResourceLoader.locateSolrHome using system property solr.solr.home: /mnt/ssd/jenkins/workspace/Lucene-Solr-trunk-Linux/solr/build/solr-core/test-files/solr
[junit4] 2> 695747 T2320 oasc.SolrResourceLoader.<init> new SolrResourceLoader for deduced Solr Home: '/mnt/ssd/jenkins/workspace/Lucene-Solr-trunk-Linux/solr/build/solr-core/test-files/solr/'
[junit4] 2> 695788 T2320 oasc.CoreContainer.<init> New CoreContainer 1874832519
[junit4] 2> 695788 T2320 oasc.CoreContainer.load Loading cores into CoreContainer [instanceDir=/mnt/ssd/jenkins/workspace/Lucene-Solr-trunk-Linux/solr/build/solr-core/test-files/solr/]
[junit4] 2> 695789 T2320 oashc.HttpShardHandlerFactory.getParameter Setting socketTimeout to: 0
[junit4] 2> 695789 T2320 oashc.HttpShardHandlerFactory.getParameter Setting urlScheme to: http://
[junit4] 2> 695789 T2320 oashc.HttpShardHandlerFactory.getParameter Setting connTimeout to: 0
[junit4] 2> 695790 T2320 oashc.HttpShardHandlerFactory.getParameter Setting maxConnectionsPerHost to: 20
[junit4] 2> 695790 T2320 oashc.HttpShardHandlerFactory.getParameter Setting corePoolSize to: 0
[junit4] 2> 695790 T2320 oashc.HttpShardHandlerFactory.getParameter Setting maximumPoolSize to: 2147483647
[junit4] 2> 695790 T2320 oashc.HttpShardHandlerFactory.getParameter Setting maxThreadIdleTime to: 5
[junit4] 2> 695790 T2320 oashc.HttpShardHandlerFactory.getParameter Setting sizeOfQueue to: -1
[junit4] 2> 695790 T2320 oashc.HttpShardHandlerFactory.getParameter Setting fairnessPolicy to: false
[junit4] 2> 695793 T2320 oasl.LogWatcher.createWatcher SLF4J impl is org.slf4j.impl.Log4jLoggerFactory
[junit4] 2> 695794 T2320 oasl.LogWatcher.newRegisteredLogWatcher Registering Log Listener [Log4j (org.slf4j.impl.Log4jLoggerFactory)]
[junit4] 2> 695794 T2320 oasc.CoreContainer.load Host Name:
[junit4] 2> 695797 T2321 oasc.CoreContainer.create Creating SolrCore 'collection1' using instanceDir: /mnt/ssd/jenkins/workspace/Lucene-Solr-trunk-Linux/solr/build/solr-core/test-files/solr/collection1
[junit4] 2> 695797 T2321 oasc.SolrResourceLoader.<init> new SolrResourceLoader for directory: '/mnt/ssd/jenkins/workspace/Lucene-Solr-trunk-Linux/solr/build/solr-core/test-files/solr/collection1/'
[junit4] 2> 695798 T2321 oasc.SolrResourceLoader.replaceClassLoader Adding 'file:/mnt/ssd/jenkins/workspace/Lucene-Solr-trunk-Linux/solr/build/solr-core/test-files/solr/collection1/lib/classes/' to classloader
[junit4] 2> 695798 T2321 oasc.SolrResourceLoader.replaceClassLoader Adding 'file:/mnt/ssd/jenkins/workspace/Lucene-Solr-trunk-Linux/solr/build/solr-core/test-files/solr/collection1/lib/README' to classloader
[junit4] 2> 695827 T2321 oasc.SolrConfig.<init> Using Lucene MatchVersion: LUCENE_50
[junit4] 2> 695856 T2321 oasc.SolrConfig.<init> Loaded SolrConfig: solrconfig-basic.xml
[junit4] 2> 695857 T2321 oass.IndexSchema.readSchema Reading Solr Schema from schema-analytics.xml
[junit4] 2> 695861 T2321 oass.IndexSchema.readSchema [collection1] Schema name=schema-docValues
[junit4] 2> 695887 T2321 oass.IndexSchema.readSchema unique key field: id
[junit4] 2> 695888 T2321 oasc.SolrCore.initDirectoryFactory org.apache.solr.core.MockDirectoryFactory
[junit4] 2> 695888 T2321 oasc.SolrCore.<init> [collection1] Opening new SolrCore at /mnt/ssd/jenkins/workspace/Lucene-Solr-trunk-Linux/solr/build/solr-core/test-files/solr/collection1/, dataDir=/mnt/ssd/jenkins/workspace/Lucene-Solr-trunk-Linux/solr/build/solr-core/test/J1/./solrtest-ExpressionTest-1386484331762/
[junit4] 2> 695888 T2321 oasc.SolrCore.<init> JMX monitoring not detected for core: collection1
[junit4] 2> 695889 T2321 oasc.CachingDirectoryFactory.get return new directory for /mnt/ssd/jenkins/workspace/Lucene-Solr-trunk-Linux/solr/build/solr-core/test/J1/./solrtest-ExpressionTest-1386484331762
[junit4] 2> 695889 T2321 oasc.SolrCore.getNewIndexDir New index directory detected: old=null new=/mnt/ssd/jenkins/workspace/Lucene-Solr-trunk-Linux/solr/build/solr-core/test/J1/./solrtest-ExpressionTest-1386484331762/index/
[junit4] 2> 695889 T2321 oasc.SolrCore.initIndex WARN [collection1] Solr index directory '/mnt/ssd/jenkins/workspace/Lucene-Solr-trunk-Linux/solr/build/solr-core/test/J1/./solrtest-ExpressionTest-1386484331762/index' doesn't exist. Creating new index...
[junit4] 2> 695889 T2321 oasc.CachingDirectoryFactory.get return new directory for /mnt/ssd/jenkins/workspace/Lucene-Solr-trunk-Linux/solr/build/solr-core/test/J1/./solrtest-ExpressionTest-1386484331762/index
[junit4] 2> 695890 T2321 oasu.RandomMergePolicy.<init> RandomMergePolicy wrapping class org.apache.lucene.index.TieredMergePolicy: [TieredMergePolicy: maxMergeAtOnce=18, maxMergeAtOnceExplicit=12, maxMergedSegmentMB=37.8623046875, floorSegmentMB=0.576171875, forceMergeDeletesPctAllowed=22.815477601193063, segmentsPerTier=23.0, maxCFSSegmentSizeMB=8.796093022207999E12, noCFSRatio=0.0
[junit4] 2> 695890 T2321 oasc.SolrDeletionPolicy.onCommit SolrDeletionPolicy.onCommit: commits: num=1
[junit4] 2> commit{dir=MockDirectoryWrapper(org.apache.lucene.store.RAMDirectory@78d40cb2 lockFactory=org.apache.lucene.store.SingleInstanceLockFactory@12d0c6bc),segFN=segments_1,generation=1}
[junit4] 2> 695891 T2321 oasc.SolrDeletionPolicy.updateCommits newest commit generation = 1
[junit4] 2> 695892 T2321 oasc.SolrCore.loadUpdateProcessorChains no updateRequestProcessorChain defined as default, creating implicit default
[junit4] 2> 695892 T2321 oasc.RequestHandlers.initHandlersFromConfig created standard: solr.StandardRequestHandler
[junit4] 2> 695892 T2321 oasc.RequestHandlers.initHandlersFromConfig created /update: solr.UpdateRequestHandler
[junit4] 2> 695894 T2321 oashl.XMLLoader.init xsltCacheLifetimeSeconds=60
[junit4] 2> 695896 T2321 oasu.CommitTracker.<init> Hard AutoCommit: disabled
[junit4] 2> 695896 T2321 oasu.CommitTracker.<init> Soft AutoCommit: disabled
[junit4] 2> 695896 T2321 oasu.RandomMergePolicy.<init> RandomMergePolicy wrapping class org.apache.lucene.index.LogDocMergePolicy: [LogDocMergePolicy: minMergeSize=1000, mergeFactor=26, maxMergeSize=9223372036854775807, maxMergeSizeForForcedMerge=9223372036854775807, calibrateSizeByDeletes=true, maxMergeDocs=2147483647, maxCFSSegmentSizeMB=8.796093022207999E12, noCFSRatio=0.0]
[junit4] 2> 695897 T2321 oasc.SolrDeletionPolicy.onInit SolrDeletionPolicy.onInit: commits: num=1
[junit4] 2> commit{dir=MockDirectoryWrapper(org.apache.lucene.store.RAMDirectory@78d40cb2 lockFactory=org.apache.lucene.store.SingleInstanceLockFactory@12d0c6bc),segFN=segments_1,generation=1}
[junit4] 2> 695897 T2321 oasc.SolrDeletionPolicy.updateCommits newest commit generation = 1
[junit4] 2> 695897 T2321 oass.SolrIndexSearcher.<init> Opening Searcher@5d7428b6 main
[junit4] 2> 695897 T2321 oasc.CoreContainer.registerCore registering core: collection1
[junit4] 2> 695897 T2322 oasc.SolrCore.registerSearcher [collection1] Registered new searcher Searcher@5d7428b6 main{StandardDirectoryReader(segments_1:1:nrt)}
[junit4] 2> 695899 T2320 oas.SolrTestCaseJ4.initCore ####initCore end
[junit4] 2> ASYNC NEW_CORE C705 name=collection1 org.apache.solr.core.SolrCore@1cee0f0b
[junit4] 2> 695902 T2320 C705 oasu.DirectUpdateHandler2.deleteAll [collection1] REMOVING ALL DOCUMENTS FROM INDEX
[junit4] 2> 695902 T2320 C705 oasup.LogUpdateProcessor.finish [collection1] webapp=null path=null params={} {deleteByQuery=*:*} 0 0
[junit4] 2> 695907 T2320 C705 oasup.LogUpdateProcessor.finish [collection1] webapp=null path=null params={} {add=[10000]} 0 1
[junit4] 2> 695913 T2320 C705 oasup.LogUpdateProcessor.finish [collection1] webapp=null path=null params={} {add=[10001]} 0 0
[junit4] 2> 695918 T2320 C705 oasup.LogUpdateProcessor.finish [collection1] webapp=null path=null params={} {add=[10002]} 0 0
[junit4] 2> 695923 T2320 C705 oasup.LogUpdateProcessor.finish [collection1] webapp=null path=null params={} {add=[10003]} 0 0
[junit4] 2> 695928 T2320 C705 oasup.LogUpdateProcessor.finish [collection1] webapp=null path=null params={} {add=[10004]} 0 1
[junit4] 2> 695933 T2320 C705 oasup.LogUpdateProcessor.finish [collection1] webapp=null path=null params={} {add=[10005]} 0 1
[junit4] 2> 695937 T2320 C705 oasup.LogUpdateProcessor.finish [collection1] webapp=null path=null params={} {add=[10006]} 0 0
[junit4] 2> 695943 T2320 C705 oasup.LogUpdateProcessor.finish [collection1] webapp=null path=null params={} {add=[10007]} 0 1
[junit4] 2> 695947 T2320 C705 oasup.LogUpdateProcessor.finish [collection1] webapp=null path=null params={} {add=[10008]} 0 0
[junit4] 2> 695953 T2320 C705 oasup.LogUpdateProcessor.finish [collection1] webapp=null path=null params={} {add=[10009]} 0 1
[junit4] 2> 695957 T2320 C705 oasup.LogUpdateProcessor.finish [collection1] webapp=null path=null params={} {add=[100010]} 0 0
[junit4] 2> 695962 T2320 C705 oasup.LogUpdateProcessor.finish [collection1] webapp=null path=null params={} {add=[100011]} 0 0
[junit4] 2> 695967 T2320 C705 oasup.LogUpdateProcessor.finish [collection1] webapp=null path=null params={} {add=[100012]} 0 1
[junit4] 2> 695972 T2320 C705 oasup.LogUpdateProcessor.finish [collection1] webapp=null path=null params={} {add=[100013]} 0 1
[junit4] 2> 695977 T2320 C705 oasup.LogUpdateProcessor.finish [collection1] webapp=null path=null params={} {add=[100014]} 0 0
[junit4] 2> 695983 T2320 C705 oasup.LogUpdateProcessor.finish [collection1] webapp=null path=null params={} {add=[100015]} 0 1
[junit4] 2> 695988 T2320 C705 oasup.LogUpdateProcessor.finish [collection1] webapp=null path=null params={} {add=[100016]} 0 0
[junit4] 2> 695994 T2320 C705 oasup.LogUpdateProcessor.finish [collection1] webapp=null path=null params={} {add=[100017]} 0 1
[junit4] 2> 695999 T2320 C705 oasup.LogUpdateProcessor.finish [collection1] webapp=null path=null params={} {add=[100018]} 0 1
[junit4] 2> 696004 T2320 C705 oasup.LogUpdateProcessor.finish [collection1] webapp=null path=null params={} {add=[100019]} 0 1
[junit4] 2> ASYNC NEW_CORE C706 name=collection1 org.apache.solr.core.SolrCore@1cee0f0b
[junit4] 2> 696026 T2320 C706 oasup.LogUpdateProcessor.finish [collection1] webapp=null path=null params={} {add=[100020]} 0 1
[junit4] 2> 696032 T2320 C706 oasup.LogUpdateProcessor.finish [collection1] webapp=null path=null params={} {add=[100021]} 0 1
[junit4] 2> 696037 T2320 C706 oasup.LogUpdateProcessor.finish [collection1] webapp=null path=null params={} {add=[100022]} 0 1
[junit4] 2> 696042 T2320 C706 oasup.LogUpdateProcessor.finish [collection1] webapp=null path=null params={} {add=[100023]} 0 0
[junit4] 2> 696047 T2320 C706 oasup.LogUpdateProcessor.finish [collection1] webapp=null path=null params={} {add=[100024]} 0 0
[junit4] 2> 696052 T2320 C706 oasup.LogUpdateProcessor.finish [collection1] webapp=null path=null params={} {add=[100025]} 0 0
[junit4] 2> 696057 T2320 C706 oasup.LogUpdateProcessor.finish [collection1] webapp=null path=null params={} {add=[100026]} 0 1
[junit4] 2> 696061 T2320 C706 oasup.LogUpdateProcessor.finish [collection1] webapp=null path=null params={} {add=[100027]} 0 0
[junit4] 2> 696066 T2320 C706 oasup.LogUpdateProcessor.finish [collection1] webapp=null path=null params={} {add=[100028]} 0 0
[junit4] 2> 696071 T2320 C706 oasup.LogUpdateProcessor.finish [collection1] webapp=null path=null params={} {add=[100029]} 0 1
[junit4] 2> 696076 T2320 C706 oasup.LogUpdateProcessor.finish [collection1] webapp=null path=null params={} {add=[100030]} 0 1
[junit4] 2> 696080 T2320 C706 oasup.LogUpdateProcessor.finish [collection1] webapp=null path=null params={} {add=[100031]} 0 0
[junit4] 2> 696085 T2320 C706 oasup.LogUpdateProcessor.finish [collection1] webapp=null path=null params={} {add=[100032]} 0 1
[junit4] 2> 696090 T2320 C706 oasup.LogUpdateProcessor.finish [collection1] webapp=null path=null params={} {add=[100033]} 0 1
[junit4] 2> 696094 T2320 C706 oasup.LogUpdateProcessor.finish [collection1] webapp=null path=null params={} {add=[100034]} 0 0
[junit4] 2> 696099 T2320 C706 oasup.LogUpdateProcessor.finish [collection1] webapp=null path=null params={} {add=[100035]} 0 0
[junit4] 2> 696104 T2320 C706 oasup.LogUpdateProcessor.finish [collection1] webapp=null path=null params={} {add=[100036]} 0 0
[junit4] 2> 696109 T2320 C706 oasup.LogUpdateProcessor.finish [collection1] webapp=null path=null params={} {add=[100037]} 0 0
[junit4] 2> 696115 T2320 C706 oasup.LogUpdateProcessor.finish [collection1] webapp=null path=null params={} {add=[100038]} 0 1
[junit4] 2> 696119 T2320 C706 oasup.LogUpdateProcessor.finish [collection1] webapp=null path=null params={} {add=[100039]} 0 0
[junit4] 2> 696124 T2320 C706 oasup.LogUpdateProcessor.finish [collection1] webapp=null path=null params={} {add=[100040]} 0 0
[junit4] 2> 696129 T2320 C706 oasup.LogUpdateProcessor.finish [collection1] webapp=null path=null params={} {add=[100041]} 0 1
[junit4] 2> 696134 T2320 C706 oasup.LogUpdateProcessor.finish [collection1] webapp=null path=null params={} {add=[100042]} 0 1
[junit4] 2> 696138 T2320 C706 oasup.LogUpdateProcessor.finish [collection1] webapp=null path=null params={} {add=[100043]} 0 0
[junit4] 2> 696143 T2320 C706 oasup.LogUpdateProcessor.finish [collection1] webapp=null path=null params={} {add=[100044]} 0 0
[junit4] 2> 696148 T2320 C706 oasup.LogUpdateProcessor.finish [collection1] webapp=null path=null params={} {add=[100045]} 0 1
[junit4] 2> 696153 T2320 C706 oasup.LogUpdateProcessor.finish [collection1] webapp=null path=null params={} {add=[100046]} 0 1
[junit4] 2> 696158 T2320 C706 oasup.LogUpdateProcessor.finish [collection1] webapp=null path=null params={} {add=[100047]} 0 1
[junit4] 2> 696162 T2320 C706 oasup.LogUpdateProcessor.finish [collection1] webapp=null path=null params={} {add=[100048]} 0 0
[junit4] 2> 696167 T2320 C706 oasup.LogUpdateProcessor.finish [collection1] webapp=null path=null params={} {add=[100049]} 0 0
[junit4] 2> 696172 T2320 C706 oasup.LogUpdateProcessor.finish [collection1] webapp=null path=null params={} {add=[100050]} 0 1
[junit4] 2> 696177 T2320 C706 oasup.LogUpdateProcessor.finish [collection1] webapp=null path=null params={} {add=[100051]} 0 1
[junit4] 2> 696182 T2320 C706 oasup.LogUpdateProcessor.finish [collection1] webapp=null path=null params={} {add=[100052]} 0 1
[junit4] 2> 696187 T2320 C706 oasup.LogUpdateProcessor.finish [collection1] webapp=null path=null params={} {add=[100053]} 0 1
[junit4] 2> 696192 T2320 C706 oasup.LogUpdateProcessor.finish [collection1] webapp=null path=null params={} {add=[100054]} 0 1
[junit4] 2> 696197 T2320 C706 oasup.LogUpdateProcessor.finish [collection1] webapp=null path=null params={} {add=[100055]} 0 1
[junit4] 2> 696201 T2320 C706 oasup.LogUpdateProcessor.finish [collection1] webapp=null path=null params={} {add=[100056]} 0 0
[junit4] 2> 696206 T2320 C706 oasup.LogUpdateProcessor.finish [collection1] webapp=null path=null params={} {add=[100057]} 0 0
[junit4] 2> 696211 T2320 C706 oasup.LogUpdateProcessor.finish [collection1] webapp=null path=null params={} {add=[100058]} 0 1
[junit4] 2> 696216 T2320 C706 oasup.LogUpdateProcessor.finish [collection1] webapp=null path=null params={} {add=[100059]} 0 0
[junit4] 2> 696220 T2320 C706 oasup.LogUpdateProcessor.finish [collection1] webapp=null path=null params={} {add=[100060]} 0 0
[junit4] 2> 696225 T2320 C706 oasup.LogUpdateProcessor.finish [collection1] webapp=null path=null params={} {add=[100061]} 0 0
[junit4] 2> 696230 T2320 C706 oasup.LogUpdateProcessor.finish [collection1] webapp=null path=null params={} {add=[100062]} 0 0
[junit4] 2> 696235 T2320 C706 oasup.LogUpdateProcessor.finish [collection1] webapp=null path=null params={} {add=[100063]} 0 0
[junit4] 2> 696240 T2320 C706 oasup.LogUpdateProcessor.finish [collection1] webapp=null path=null params={} {add=[100064]} 0 0
[junit4] 2> 696245 T2320 C706 oasup.LogUpdateProcessor.finish [collection1] webapp=null path=null params={} {add=[100065]} 0 1
[junit4] 2> 696250 T2320 C706 oasup.LogUpdateProcessor.finish [collection1] webapp=null path=null params={} {add=[100066]} 0 1
[junit4] 2> 696255 T2320 C706 oasup.LogUpdateProcessor.finish [collection1] webapp=null path=null params={} {add=[100067]} 0 1
[junit4] 2> 696259 T2320 C706 oasup.LogUpdateProcessor.finish [collection1] webapp=null path=null params={} {add=[100068]} 0 0
[junit4] 2> 696264 T2320 C706 oasup.LogUpdateProcessor.finish [collection1] webapp=null path=null params={} {add=[100069]} 0 1
[junit4] 2> 696269 T2320 C706 oasup.LogUpdateProcessor.finish [collection1] webapp=null path=null params={} {add=[100070]} 0 1
[junit4] 2> 696273 T2320 C706 oasup.LogUpdateProcessor.finish [collection1] webapp=null path=null params={} {add=[100071]} 0 0
[junit4] 2> 696278 T2320 C706 oasup.LogUpdateProcessor.finish [collection1] webapp=null path=null params={} {add=[100072]} 0 0
[junit4] 2> 696283 T2320 C706 oasup.LogUpdateProcessor.finish [collection1] webapp=null path=null params={} {add=[100073]} 0 1
[junit4] 2> 696287 T2320 C706 oasup.LogUpdateProcessor.finish [collection1] webapp=null path=null params={} {add=[100074]} 0 0
[junit4] 2> 696292 T2320 C706 oasup.LogUpdateProcessor.finish [collection1] webapp=null path=null params={} {add=[100075]} 0 0
[junit4] 2> 696297 T2320 C706 oasup.LogUpdateProcessor.finish [collection1] webapp=null path=null params={} {add=[100076]} 0 0
[junit4] 2> 696302 T2320 C706 oasup.LogUpdateProcessor.finish [collection1] webapp=null path=null params={} {add=[100077]} 0 1
[junit4] 2> 696307 T2320 C706 oasup.LogUpdateProcessor.finish [collection1] webapp=null path=null params={} {add=[100078]} 0 1
[junit4] 2> 696312 T2320 C706 oasup.LogUpdateProcessor.finish [collection1] webapp=null path=null params={} {add=[100079]} 0 1
[junit4] 2> 696317 T2320 C706 oasup.LogUpdateProcessor.finish [collection1] webapp=null path=null params={} {add=[100080]} 0 1
[junit4] 2> 696322 T2320 C706 oasup.LogUpdateProcessor.finish [collection1] webapp=null path=null params={} {add=[100081]} 0 1
[junit4] 2> 696327 T2320 C706 oasup.LogUpdateProcessor.finish [collection1] webapp=null path=null params={} {add=[100082]} 0 1
[junit4] 2> 696331 T2320 C706 oasup.LogUpdateProcessor.finish [collection1] webapp=null path=null params={} {add=[100083]} 0 0
[junit4] 2> 696336 T2320 C706 oasup.LogUpdateProcessor.finish [collection1] webapp=null path=null params={} {add=[100084]} 0 0
[junit4] 2> 696341 T2320 C706 oasup.LogUpdateProcessor.finish [collection1] webapp=null path=null params={} {add=[100085]} 0 0
[junit4] 2> ASYNC NEW_CORE C707 name=collection1 org.apache.solr.core.SolrCore@1cee0f0b
[junit4] 2> 696366 T2320 C707 oasup.LogUpdateProcessor.finish [collection1] webapp=null path=null params={} {add=[100086]} 0 1
[junit4] 2> 696371 T2320 C707 oasup.LogUpdateProcessor.finish [collection1] webapp=null path=null params={} {add=[100087]} 0 1
[junit4] 2> 696376 T2320 C707 oasup.LogUpdateProcessor.finish [collection1] webapp=null path=null params={} {add=[100088]} 0 1
[junit4] 2> 696380 T2320 C707 oasup.LogUpdateProcessor.finish [collection1] webapp=null path=null params={} {add=[100089]} 0 0
[junit4] 2> 696385 T2320 C707 oasup.LogUpdateProcessor.finish [collection1] webapp=null path=null params={} {add=[100090]} 0 0
[junit4] 2> 696390 T2320 C707 oasup.LogUpdateProcessor.finish [collection1] webapp=null path=null params={} {add=[100091]} 0 1
[junit4] 2> 696395 T2320 C707 oasup.LogUpdateProcessor.finish [collection1] webapp=null path=null params={} {add=[100092]} 0 1
[junit4] 2> 696399 T2320 C707 oasup.LogUpdateProcessor.finish [collection1] webapp=null path=null params={} {add=[100093]} 0 0
[junit4] 2> 696404 T2320 C707 oasup.LogUpdateProcessor.finish [collection1] webapp=null path=null params={} {add=[100094]} 0 0
[junit4] 2> 696409 T2320 C707 oasup.LogUpdateProcessor.finish [collection1] webapp=null path=null params={} {add=[100095]} 0 1
[junit4] 2> 696413 T2320 C707 oasup.LogUpdateProcessor.finish [collection1] webapp=null path=null params={} {add=[100096]} 0 0
[junit4] 2> 696418 T2320 C707 oasup.LogUpdateProcessor.finish [collection1] webapp=null path=null params={} {add=[100097]} 0 0
[junit4] 2> 696423 T2320 C707 oasup.LogUpdateProcessor.finish [collection1] webapp=null path=null params={} {add=[100098]} 0 1
[junit4] 2> 696427 T2320 C707 oasup.LogUpdateProcessor.finish [collection1] webapp=null path=null params={} {add=[100099]} 0 0
[junit4] 2> 696432 T2320 C707 oasu.DirectUpdateHandler2.commit start commit{,optimize=false,openSearcher=true,waitSearcher=true,expungeDeletes=false,softCommit=false,prepareCommit=false}
[junit4] 2> 696447 T2320 C707 oasc.SolrDeletionPolicy.onCommit SolrDeletionPolicy.onCommit: commits: num=2
[junit4] 2> commit{dir=MockDirectoryWrapper(org.apache.lucene.store.RAMDirectory@78d40cb2 lockFactory=org.apache.lucene.store.SingleInstanceLockFactory@12d0c6bc),segFN=segments_1,generation=1}
[junit4] 2> commit{dir=MockDirectoryWrapper(org.apache.lucene.store.RAMDirectory@78d40cb2 lockFactory=org.apache.lucene.store.SingleInstanceLockFactory@12d0c6bc),segFN=segments_2,generation=2}
[junit4] 2> 696448 T2320 C707 oasc.SolrDeletionPolicy.updateCommits newest commit generation = 2
[junit4] 2> 696449 T2320 C707 oass.SolrIndexSearcher.<init> Opening Searcher@e512954 main
[junit4] 2> 696449 T2320 C707 oasu.DirectUpdateHandler2.commit end_commit_flush
[junit4] 2> 696449 T2322 oasc.SolrCore.registerSearcher [collection1] Registered new searcher Searcher@e512954 main{StandardDirectoryReader(segments_2:4:nrt _0(5.0):C100)}
[junit4] 2> 696450 T2320 C707 oasup.LogUpdateProcessor.finish [collection1] webapp=null path=null params={} {commit=} 0 18
[junit4] 2> 696482 T2320 C707 oasc.SolrCore.execute [collection1] webapp=null path=null params={o.mr.s.sum=sum(int_id)&o.ar.s.mcm=add(mean(int_id),count(long_ld),median(int_id))&o.dmr.s.dmma=date_math(max(date_dtd),const_str(%2B2MONTHS))&q=*:*&o.dmr.s.dmme=date_math(median(date_dtd),const_str(%2B2YEARS))&o.nr.s.s=neg(sum(int_id))&o.nr.s.count=count(long_ld)&o.rr.s.max=max(string_sd)&o.cr.s.csmax=const_str(this+is+the+second)&o.cdr.s.cs2=const_str(1804-06-30T23:59:59Z)&o.ar.s.su=add(sum(int_id),unique(long_ld))&o.ar.s.count=count(long_ld)&o.rr.s.rmin=rev(min(string_sd))&o.csr.s.cs1=const_str(this+is+the+first)&o.csr.s.cs3=const_str(this+is+the+third)&o.nr.s.sum=sum(int_id)&o.dr.s.mean=mean(int_id)&o.dmr.s.cme=const_str(%2B2YEARS)&o.dr.s.mc=div(mean(int_id),count(long_ld))&o.cr.s.max=max(string_sd)&o.avr.s.s=abs(neg(sum(int_id)))&o.dr.s.unique=unique(long_ld)&o.dr.s.su=div(sum(int_id),unique(long_ld))&o.cr.s.min=min(string_sd)&o.nr.s.c=neg(count(long_ld))&o.avr.s.count=count(long_ld)&rows=0&o.rr.s.min=min(string_sd)&o.cr.s.csmin=const_str(this+is+the+first)&o.avr.s.c=abs(neg(count(long_ld)))&o.ar.s.sum=sum(int_id)&o.pr.s.mc=pow(mean(int_id),count(long_ld))&o.dmr.s.cma=const_str(%2B2MONTHS)&o.ar.s.mean=mean(int_id)&o.dr.s.count=count(long_ld)&o.ar.s.unique=unique(long_ld)&o.rr.s.rmax=rev(max(string_sd))&olap=true&o.cr.s.ccmax=concat(const_str(this+is+the+second),max(string_sd))&o.mr.s.unique=unique(long_ld)&o.mr.s.mcm=mult(mean(int_id),count(long_ld),median(int_id))&o.cnr.s.c10=const_num(10)&o.pr.s.mean=mean(int_id)&indent=true&o.avr.s.sum=sum(int_id)&stats=true&o.cdr.s.cd2=const_date(1804-06-30T23:59:59Z)&o.cnr.s.c8=const_num(8)&o.cr.s.ccmin=concat(const_str(this+is+the+first),min(string_sd))&o.pr.s.su=pow(sum(int_id),unique(long_ld))&o.mr.s.su=mult(sum(int_id),unique(long_ld))&o.dr.s.sum=sum(int_id)&o.pr.s.count=count(long_ld)&o.dmr.s.median=median(date_dtd)&o.pr.s.sum=sum(int_id)&o.cdr.s.cd1=const_date(1800-12-31T23:59:59Z)&o.mr.s.mean=mean(int_id)&o.pr.s.unique=unique(long_ld)&o.mr.s.median=median(int_id)&o.csr.s.cs2=const_str(this+is+the+second)&o.mr.s.count=count(long_ld)&o.ar.s.median=median(int_id)&o.dmr.s.max=max(date_dtd)&o.cdr.s.cs1=const_str(1800-12-31T23:59:59Z)} hits=100 status=0 QTime=29
[junit4] 2> 696488 T2320 oas.SolrTestCaseJ4.setUp ###Starting reverseTest
[junit4] 2> 696492 T2320 oas.SolrTestCaseJ4.tearDown ###Ending reverseTest
[junit4] 2> 696497 T2320 oas.SolrTestCaseJ4.setUp ###Starting addTest
[junit4] 2> 696499 T2320 oas.SolrTestCaseJ4.tearDown ###Ending addTest
[junit4] 2> NOTE: reproduce with: ant test -Dtestcase=ExpressionTest -Dtests.method=addTest -Dtests.seed=7A73F81A6B413F97 -Dtests.multiplier=3 -Dtests.slow=true -Dtests.locale=sq -Dtests.timezone=Pacific/Nauru -Dtests.file.encoding=ISO-8859-1
[junit4] FAILURE 0.01s J1 | ExpressionTest.addTest <<<
[junit4] > Throwable #1: java.lang.AssertionError: Caught exception in getStatResult, xPath = /response/lst[@name='stats']/lst[@name='ar']/double[@name='sum']
[junit4] > raw data: <?xml version="1.0" encoding="UTF-8"?>
[junit4] > <response>
[junit4] > <lst name="responseHeader">
[junit4] > <int name="status">0</int>
[junit4] > <int name="QTime">29</int>
[junit4] > </lst>
[junit4] > <result name="response" numFound="100" start="0">
[junit4] > </result>
[junit4] > <lst name="stats">
[junit4] > <lst name="stats_fields"/>
[junit4] > </lst>
[junit4] > <lst name="stats">
[junit4] > <lst name="cr">
[junit4] > <str name="ccmax">this is the secondstr9</str>
[junit4] > <str name="ccmin">this is the firststr0</str>
[junit4] > <str name="csmax">this is the second</str>
[junit4] > <str name="csmin">this is the first</str>
[junit4] > <str name="max">str9</str>
[junit4] > <str name="min">str0</str>
[junit4] > </lst>
[junit4] > <lst name="cnr">
[junit4] > <double name="c10">10.0</double>
[junit4] > <double name="c8">8.0</double>
[junit4] > </lst>
[junit4] > <lst name="pr">
[junit4] > <long name="count">100</long>
[junit4] > <null name="mc"/>
[junit4] > <null name="mean"/>
[junit4] > <null name="su"/>
[junit4] > <null name="sum"/>
[junit4] > <null name="unique"/>
[junit4] > </lst>
[junit4] > <lst name="nr">
[junit4] > <double name="c">-100.0</double>
[junit4] > <long name="count">100</long>
[junit4] > <null name="s"/>
[junit4] > <null name="sum"/>
[junit4] > </lst>
[junit4] > <lst name="csr">
[junit4] > <str name="cs1">this is the first</str>
[junit4] > <str name="cs2">this is the second</str>
[junit4] > <str name="cs3">this is the third</str>
[junit4] > </lst>
[junit4] > <lst name="rr">
[junit4] > <str name="max">str9</str>
[junit4] > <str name="min">str0</str>
[junit4] > <str name="rmax">9rts</str>
[junit4] > <str name="rmin">0rts</str>
[junit4] > </lst>
[junit4] > <lst name="avr">
[junit4] > <double name="c">100.0</double>
[junit4] > <long name="count">100</long>
[junit4] > <null name="s"/>
[junit4] > <null name="sum"/>
[junit4] > </lst>
[junit4] > <lst name="cdr">
[junit4] > <date name="cd1">1800-12-31T23:59:59Z</date>
[junit4] > <date name="cd2">1804-06-30T23:59:59Z</date>
[junit4] > <str name="cs1">1800-12-31T23:59:59Z</str>
[junit4] > <str name="cs2">1804-06-30T23:59:59Z</str>
[junit4] > </lst>
[junit4] > <lst name="mr">
[junit4] > <long name="count">100</long>
[junit4] > <null name="mcm"/>
[junit4] > <null name="mean"/>
[junit4] > <null name="median"/>
[junit4] > <null name="su"/>
[junit4] > <null name="sum"/>
[junit4] > <null name="unique"/>
[junit4] > </lst>
[junit4] > <lst name="dr">
[junit4] > <long name="count">100</long>
[junit4] > <null name="mc"/>
[junit4] > <null name="mean"/>
[junit4] > <null name="su"/>
[junit4] > <null name="sum"/>
[junit4] > <null name="unique"/>
[junit4] > </lst>
[junit4] > <lst name="dmr">
[junit4] > <str name="cma">+2MONTHS</str>
[junit4] > <str name="cme">+2YEARS</str>
[junit4] > <date name="dmma">1812-02-29T23:59:59Z</date>
[junit4] > <date name="dmme">1807-12-31T23:59:59Z</date>
[junit4] > <date name="max">1811-12-31T23:59:59Z</date>
[junit4] > <date name="median">1805-12-31T23:59:59Z</date>
[junit4] > </lst>
[junit4] > <lst name="ar">
[junit4] > <long name="count">100</long>
[junit4] > <null name="mcm"/>
[junit4] > <null name="mean"/>
[junit4] > <null name="median"/>
[junit4] > <null name="su"/>
[junit4] > <null nam
[...truncated too long message...]
/lst>
[junit4] > <lst name="csr">
[junit4] > <str name="cs1">this is the first</str>
[junit4] > <str name="cs2">this is the second</str>
[junit4] > <str name="cs3">this is the third</str>
[junit4] > </lst>
[junit4] > <lst name="rr">
[junit4] > <str name="max">str9</str>
[junit4] > <str name="min">str0</str>
[junit4] > <str name="rmax">9rts</str>
[junit4] > <str name="rmin">0rts</str>
[junit4] > </lst>
[junit4] > <lst name="avr">
[junit4] > <double name="c">100.0</double>
[junit4] > <long name="count">100</long>
[junit4] > <null name="s"/>
[junit4] > <null name="sum"/>
[junit4] > </lst>
[junit4] > <lst name="cdr">
[junit4] > <date name="cd1">1800-12-31T23:59:59Z</date>
[junit4] > <date name="cd2">1804-06-30T23:59:59Z</date>
[junit4] > <str name="cs1">1800-12-31T23:59:59Z</str>
[junit4] > <str name="cs2">1804-06-30T23:59:59Z</str>
[junit4] > </lst>
[junit4] > <lst name="mr">
[junit4] > <long name="count">100</long>
[junit4] > <null name="mcm"/>
[junit4] > <null name="mean"/>
[junit4] > <null name="median"/>
[junit4] > <null name="su"/>
[junit4] > <null name="sum"/>
[junit4] > <null name="unique"/>
[junit4] > </lst>
[junit4] > <lst name="dr">
[junit4] > <long name="count">100</long>
[junit4] > <null name="mc"/>
[junit4] > <null name="mean"/>
[junit4] > <null name="su"/>
[junit4] > <null name="sum"/>
[junit4] > <null name="unique"/>
[junit4] > </lst>
[junit4] > <lst name="dmr">
[junit4] > <str name="cma">+2MONTHS</str>
[junit4] > <str name="cme">+2YEARS</str>
[junit4] > <date name="dmma">1812-02-29T23:59:59Z</date>
[junit4] > <date name="dmme">1807-12-31T23:59:59Z</date>
[junit4] > <date name="max">1811-12-31T23:59:59Z</date>
[junit4] > <date name="median">1805-12-31T23:59:59Z</date>
[junit4] > </lst>
[junit4] > <lst name="ar">
[junit4] > <long name="count">100</long>
[junit4] > <null name="mcm"/>
[junit4] > <null name="mean"/>
[junit4] > <null name="median"/>
[junit4] > <null name="su"/>
[junit4] > <null name="sum"/>
[junit4] > <null name="unique"/>
[junit4] > </lst>
[junit4] > </lst>
[junit4] > </response>
[junit4] > at __randomizedtesting.SeedInfo.seed([7A73F81A6B413F97:14C14F1983566146]:0)
[junit4] > at org.apache.solr.analytics.AbstractAnalyticsStatsTest.getStatResult(AbstractAnalyticsStatsTest.java:113)
[junit4] > at org.apache.solr.analytics.expression.ExpressionTest.powerTest(ExpressionTest.java:119)
[junit4] > at java.lang.Thread.run(Thread.java:744)
[junit4] 2> 696594 T2320 oas.SolrTestCaseJ4.deleteCore ###deleteCore
[junit4] 2> 696594 T2320 oasc.CoreContainer.shutdown Shutting down CoreContainer instance=1874832519
[junit4] 2> 696595 T2320 oasc.SolrCore.close [collection1] CLOSING SolrCore org.apache.solr.core.SolrCore@1cee0f0b
[junit4] 2> 696595 T2320 oasu.DirectUpdateHandler2.close closing DirectUpdateHandler2{commits=1,autocommits=0,soft autocommits=0,optimizes=0,rollbacks=0,expungeDeletes=0,docsPending=0,adds=0,deletesById=0,deletesByQuery=0,errors=0,cumulative_adds=100,cumulative_deletesById=0,cumulative_deletesByQuery=1,cumulative_errors=0}
[junit4] 2> 696595 T2320 oasu.SolrCoreState.decrefSolrCoreState Closing SolrCoreState
[junit4] 2> 696595 T2320 oasu.DefaultSolrCoreState.closeIndexWriter SolrCoreState ref count has reached 0 - closing IndexWriter
[junit4] 2> 696595 T2320 oasu.DefaultSolrCoreState.closeIndexWriter closing IndexWriter with IndexWriterCloser
[junit4] 2> 696596 T2320 oasc.SolrCore.closeSearcher [collection1] Closing main searcher on request.
[junit4] 2> 696596 T2320 oasc.CachingDirectoryFactory.close Closing MockDirectoryFactory - 2 directories currently being tracked
[junit4] 2> 696596 T2320 oasc.CachingDirectoryFactory.closeCacheValue looking to close /mnt/ssd/jenkins/workspace/Lucene-Solr-trunk-Linux/solr/build/solr-core/test/J1/./solrtest-ExpressionTest-1386484331762 [CachedDir<<refCount=0;path=/mnt/ssd/jenkins/workspace/Lucene-Solr-trunk-Linux/solr/build/solr-core/test/J1/./solrtest-ExpressionTest-1386484331762;done=false>>]
[junit4] 2> 696596 T2320 oasc.CachingDirectoryFactory.close Closing directory: /mnt/ssd/jenkins/workspace/Lucene-Solr-trunk-Linux/solr/build/solr-core/test/J1/./solrtest-ExpressionTest-1386484331762
[junit4] 2> 696596 T2320 oasc.CachingDirectoryFactory.closeCacheValue looking to close /mnt/ssd/jenkins/workspace/Lucene-Solr-trunk-Linux/solr/build/solr-core/test/J1/./solrtest-ExpressionTest-1386484331762/index [CachedDir<<refCount=0;path=/mnt/ssd/jenkins/workspace/Lucene-Solr-trunk-Linux/solr/build/solr-core/test/J1/./solrtest-ExpressionTest-1386484331762/index;done=false>>]
[junit4] 2> 696597 T2320 oasc.CachingDirectoryFactory.close Closing directory: /mnt/ssd/jenkins/workspace/Lucene-Solr-trunk-Linux/solr/build/solr-core/test/J1/./solrtest-ExpressionTest-1386484331762/index
[junit4] 2> NOTE: test params are: codec=Lucene46: {float_fd=PostingsFormat(name=FSTPulsing41), long_ld=PostingsFormat(name=Lucene41VarGapFixedInterval), int_id=PostingsFormat(name=Lucene41VarGapFixedInterval), id=PostingsFormat(name=Lucene41VarGapFixedInterval), double_dd=PostingsFormat(name=Memory doPackFST= true), string_sd=PostingsFormat(name=Lucene41VarGapFixedInterval), date_dtd=PostingsFormat(name=Lucene41VarGapFixedInterval)}, docValues:{stringdv=DocValuesFormat(name=SimpleText), doubledv=DocValuesFormat(name=SimpleText), float_fd=DocValuesFormat(name=Disk), floatdv=DocValuesFormat(name=Lucene45), int_id=DocValuesFormat(name=SimpleText), long_ld=DocValuesFormat(name=SimpleText), stringdvm=DocValuesFormat(name=Lucene45), double_dd=DocValuesFormat(name=Lucene45), intdv=DocValuesFormat(name=Disk), longdv=DocValuesFormat(name=Lucene45), datedv=DocValuesFormat(name=Memory), string_sd=DocValuesFormat(name=SimpleText), date_dtd=DocValuesFormat(name=SimpleText)}, sim=RandomSimilarityProvider(queryNorm=false,coord=crazy): {}, locale=sq, timezone=Pacific/Nauru
[junit4] 2> NOTE: Linux 3.8.0-34-generic amd64/Oracle Corporation 1.7.0_45 (64-bit)/cpus=8,threads=1,free=241115608,total=536870912
[junit4] 2> NOTE: All tests run in this JVM: [TestCollapseQParserPlugin, CurrencyFieldXmlFileTest, TestRecoveryHdfs, TestIndexingPerformance, MultiTermTest, XmlUpdateRequestHandlerTest, TestBinaryResponseWriter, TestRTGBase, AddBlockUpdateTest, SpellCheckComponentTest, TestDynamicFieldResource, TestUtils, BlockDirectoryTest, SolrIndexConfigTest, AliasIntegrationTest, MinimalSchemaTest, CollectionsAPIDistributedZkTest, AlternateDirectoryTest, TestDistributedMissingSort, TestQuerySenderListener, OpenExchangeRatesOrgProviderTest, TestRandomFaceting, FullSolrCloudDistribCmdsTest, TestDistribDocBasedVersion, SolrRequestParserTest, HdfsDirectoryTest, HighlighterTest, TestSolr4Spatial, SortByFunctionTest, TestUpdate, CachingDirectoryFactoryTest, FieldAnalysisRequestHandlerTest, DeleteInactiveReplicaTest, TestManagedSchemaFieldResource, TestRangeQuery, TestSolrQueryParserDefaultOperatorResource, DocumentAnalysisRequestHandlerTest, XsltUpdateRequestHandlerTest, TestAtomicUpdateErrorCases, TestSolrJ, RequestHandlersTest, TestStressLucene, TestHashPartitioner, TestCloudManagedSchema, TestDefaultSimilarityFactory, RangeFacetTest, SuggesterWFSTTest, HighlighterConfigTest, TestAnalyzedSuggestions, TestFoldingMultitermQuery, TestInfoStreamLogging, TestAddFieldRealTimeGet, TestRandomMergePolicy, TestSolrCoreProperties, TestDistributedGrouping, HardAutoCommitTest, TestFastOutputStream, TestLazyCores, TestSolrDeletionPolicy2, TestIBSimilarityFactory, SignatureUpdateProcessorFactoryTest, TestOmitPositions, ZkSolrClientTest, DirectSolrConnectionTest, TestPhraseSuggestions, TestNumberUtils, TestFiltering, TestFieldTypeCollectionResource, MigrateRouteKeyTest, TermVectorComponentDistributedTest, FieldFacetExtrasTest, TestCodecSupport, PluginInfoTest, TestFastLRUCache, TestFuzzyAnalyzedSuggestions, TestReload, FunctionTest, HdfsUnloadDistributedZkTest, ModifyConfFileTest, OutputWriterTest, TestSolrXml, SuggesterTSTTest, ChangedSchemaMergeTest, ExpressionTest]
[junit4] Completed on J1 in 1.01s, 12 tests, 6 failures <<< FAILURES!
[...truncated 612 lines...]
BUILD FAILED
/mnt/ssd/jenkins/workspace/Lucene-Solr-trunk-Linux/build.xml:420: The following error occurred while executing this line:
/mnt/ssd/jenkins/workspace/Lucene-Solr-trunk-Linux/build.xml:400: The following error occurred while executing this line:
/mnt/ssd/jenkins/workspace/Lucene-Solr-trunk-Linux/build.xml:39: The following error occurred while executing this line:
/mnt/ssd/jenkins/workspace/Lucene-Solr-trunk-Linux/extra-targets.xml:37: The following error occurred while executing this line:
/mnt/ssd/jenkins/workspace/Lucene-Solr-trunk-Linux/solr/build.xml:189: The following error occurred while executing this line:
/mnt/ssd/jenkins/workspace/Lucene-Solr-trunk-Linux/solr/common-build.xml:491: The following error occurred while executing this line:
/mnt/ssd/jenkins/workspace/Lucene-Solr-trunk-Linux/lucene/common-build.xml:1304: The following error occurred while executing this line:
/mnt/ssd/jenkins/workspace/Lucene-Solr-trunk-Linux/lucene/common-build.xml:937: There were test failures: 357 suites, 1572 tests, 6 failures, 34 ignored (6 assumptions)
Total time: 49 minutes 5 seconds
Build step 'Invoke Ant' marked build as failure
Description set: Java: 64bit/jdk1.7.0_45 -XX:-UseCompressedOops -XX:+UseG1GC
Archiving artifacts
Recording test results
Email was triggered for: Failure
Sending email for trigger: Failure