You are viewing a plain text version of this content. The canonical link for it is here.
Posted to dev@phoenix.apache.org by "Rajeshbabu Chintaguntla (Jira)" <ji...@apache.org> on 2024/02/08 19:39:00 UTC
[jira] [Closed] (OMID-237) TestHBaseTransactionClient.testReadCommitTimestampFromCommitTable fails
[ https://issues.apache.org/jira/browse/OMID-237?page=com.atlassian.jira.plugin.system.issuetabpanels:all-tabpanel ]
Rajeshbabu Chintaguntla closed OMID-237.
----------------------------------------
> TestHBaseTransactionClient.testReadCommitTimestampFromCommitTable fails
> -----------------------------------------------------------------------
>
> Key: OMID-237
> URL: https://issues.apache.org/jira/browse/OMID-237
> Project: Phoenix Omid
> Issue Type: Bug
> Affects Versions: 1.1.0
> Reporter: Istvan Toth
> Assignee: Istvan Toth
> Priority: Major
> Fix For: 1.1.1
>
>
> On my machine, TestHBaseTransactionClient.testReadCommitTimestampFromCommitTable failed in 3 out of 3 runs.
> {noformat}
> [ERROR] Tests run: 95, Failures: 1, Errors: 0, Skipped: 0, Time elapsed: 341.56 s <<< FAILURE! - in TestSuite
> [ERROR] testReadCommitTimestampFromCommitTable(org.apache.omid.transaction.TestHBaseTransactionClient) Time elapsed: 0.025 s <<< FAILURE!
> java.lang.AssertionError: expected [false] but found [true]
> at org.testng.Assert.fail(Assert.java:94)
> at org.testng.Assert.failNotEquals(Assert.java:513)
> at org.testng.Assert.assertFalse(Assert.java:63)
> at org.testng.Assert.assertFalse(Assert.java:73)
> at org.apache.omid.transaction.TestHBaseTransactionClient.testReadCommitTimestampFromCommitTable(TestHBaseTransactionClient.java:144)
> at java.base/jdk.internal.reflect.NativeMethodAccessorImpl.invoke0(Native Method)
> at java.base/jdk.internal.reflect.NativeMethodAccessorImpl.invoke(NativeMethodAccessorImpl.java:62)
> at java.base/jdk.internal.reflect.DelegatingMethodAccessorImpl.invoke(DelegatingMethodAccessorImpl.java:43)
> at java.base/java.lang.reflect.Method.invoke(Method.java:566)
> at org.testng.internal.MethodInvocationHelper.invokeMethod(MethodInvocationHelper.java:104)
> at org.testng.internal.InvokeMethodRunnable.runOne(InvokeMethodRunnable.java:54)
> at org.testng.internal.InvokeMethodRunnable.run(InvokeMethodRunnable.java:44)
> at java.base/java.util.concurrent.Executors$RunnableAdapter.call(Executors.java:515)
> at java.base/java.util.concurrent.FutureTask.run(FutureTask.java:264)
> at java.base/java.util.concurrent.ThreadPoolExecutor.runWorker(ThreadPoolExecutor.java:1128)
> at java.base/java.util.concurrent.ThreadPoolExecutor$Worker.run(ThreadPoolExecutor.java:628)
> at java.base/java.lang.Thread.run(Thread.java:829){noformat}
> I don't see this failure on the CI, so this is possibly a timing issue related to the host performance (or maybe the CI tests are just failing earlier)
--
This message was sent by Atlassian Jira
(v8.20.10#820010)