You are viewing a plain text version of this content. The canonical link for it is here.
Posted to dev@zookeeper.apache.org by Apache Jenkins Server <je...@builds.apache.org> on 2013/10/25 16:54:23 UTC

ZooKeeper_branch34_openjdk7 - Build # 379 - Failure

See https://builds.apache.org/job/ZooKeeper_branch34_openjdk7/379/

###################################################################################
########################## LAST 60 LINES OF THE CONSOLE ###########################
[...truncated 213902 lines...]
    [junit] 2013-10-25 14:54:16,198 [myid:] - INFO  [main:JMXEnv@105] - expect:InMemoryDataTree
    [junit] 2013-10-25 14:54:16,198 [myid:] - INFO  [main:JMXEnv@108] - found:InMemoryDataTree org.apache.ZooKeeperService:name0=StandaloneServer_port-1,name1=InMemoryDataTree
    [junit] 2013-10-25 14:54:16,199 [myid:] - INFO  [main:JMXEnv@105] - expect:StandaloneServer_port
    [junit] 2013-10-25 14:54:16,199 [myid:] - INFO  [main:JMXEnv@108] - found:StandaloneServer_port org.apache.ZooKeeperService:name0=StandaloneServer_port-1
    [junit] 2013-10-25 14:54:16,199 [myid:] - INFO  [main:ClientBase@421] - STOPPING server
    [junit] 2013-10-25 14:54:16,199 [myid:] - INFO  [NIOServerCxn.Factory:0.0.0.0/0.0.0.0:11221:NIOServerCnxnFactory@224] - NIOServerCnxn factory exited run method
    [junit] 2013-10-25 14:54:16,199 [myid:] - INFO  [main:ZooKeeperServer@441] - shutting down
    [junit] 2013-10-25 14:54:16,200 [myid:] - INFO  [main:SessionTrackerImpl@225] - Shutting down
    [junit] 2013-10-25 14:54:16,200 [myid:] - INFO  [main:PrepRequestProcessor@761] - Shutting down
    [junit] 2013-10-25 14:54:16,200 [myid:] - INFO  [main:SyncRequestProcessor@209] - Shutting down
    [junit] 2013-10-25 14:54:16,200 [myid:] - INFO  [ProcessThread(sid:0 cport:-1)::PrepRequestProcessor@143] - PrepRequestProcessor exited loop!
    [junit] 2013-10-25 14:54:16,201 [myid:] - INFO  [SyncThread:0:SyncRequestProcessor@187] - SyncRequestProcessor exited!
    [junit] 2013-10-25 14:54:16,201 [myid:] - INFO  [main:FinalRequestProcessor@415] - shutdown of request processor complete
    [junit] 2013-10-25 14:54:16,201 [myid:] - INFO  [main:FourLetterWordMain@43] - connecting to 127.0.0.1 11221
    [junit] 2013-10-25 14:54:16,202 [myid:] - INFO  [main:JMXEnv@133] - ensureOnly:[]
    [junit] 2013-10-25 14:54:16,203 [myid:] - INFO  [main:ClientBase@414] - STARTING server
    [junit] 2013-10-25 14:54:16,203 [myid:] - INFO  [main:ZooKeeperServer@162] - Created server with tickTime 3000 minSessionTimeout 6000 maxSessionTimeout 60000 datadir /home/jenkins/jenkins-slave/workspace/ZooKeeper_branch34_openjdk7/branch-3.4/build/test/tmp/test9192392697019643044.junit.dir/version-2 snapdir /home/jenkins/jenkins-slave/workspace/ZooKeeper_branch34_openjdk7/branch-3.4/build/test/tmp/test9192392697019643044.junit.dir/version-2
    [junit] 2013-10-25 14:54:16,204 [myid:] - INFO  [main:NIOServerCnxnFactory@94] - binding to port 0.0.0.0/0.0.0.0:11221
    [junit] 2013-10-25 14:54:16,207 [myid:] - INFO  [main:FourLetterWordMain@43] - connecting to 127.0.0.1 11221
    [junit] 2013-10-25 14:54:16,208 [myid:] - INFO  [NIOServerCxn.Factory:0.0.0.0/0.0.0.0:11221:NIOServerCnxnFactory@197] - Accepted socket connection from /127.0.0.1:36995
    [junit] 2013-10-25 14:54:16,208 [myid:] - INFO  [NIOServerCxn.Factory:0.0.0.0/0.0.0.0:11221:NIOServerCnxn@817] - Processing stat command from /127.0.0.1:36995
    [junit] 2013-10-25 14:54:16,209 [myid:] - INFO  [Thread-4:NIOServerCnxn$StatCommand@653] - Stat command output
    [junit] 2013-10-25 14:54:16,209 [myid:] - INFO  [Thread-4:NIOServerCnxn@997] - Closed socket connection for client /127.0.0.1:36995 (no session established for client)
    [junit] 2013-10-25 14:54:16,209 [myid:] - INFO  [main:JMXEnv@133] - ensureOnly:[InMemoryDataTree, StandaloneServer_port]
    [junit] 2013-10-25 14:54:16,211 [myid:] - INFO  [main:JMXEnv@105] - expect:InMemoryDataTree
    [junit] 2013-10-25 14:54:16,211 [myid:] - INFO  [main:JMXEnv@108] - found:InMemoryDataTree org.apache.ZooKeeperService:name0=StandaloneServer_port-1,name1=InMemoryDataTree
    [junit] 2013-10-25 14:54:16,211 [myid:] - INFO  [main:JMXEnv@105] - expect:StandaloneServer_port
    [junit] 2013-10-25 14:54:16,211 [myid:] - INFO  [main:JMXEnv@108] - found:StandaloneServer_port org.apache.ZooKeeperService:name0=StandaloneServer_port-1
    [junit] 2013-10-25 14:54:16,211 [myid:] - INFO  [main:JUnit4ZKTestRunner$LoggedInvokeMethod@57] - FINISHED TEST METHOD testQuota
    [junit] 2013-10-25 14:54:16,211 [myid:] - INFO  [main:ClientBase@451] - tearDown starting
    [junit] 2013-10-25 14:54:16,285 [myid:] - INFO  [main:ZooKeeper@684] - Session: 0x141f01bccb10000 closed
    [junit] 2013-10-25 14:54:16,285 [myid:] - INFO  [main-EventThread:ClientCnxn$EventThread@509] - EventThread shut down
    [junit] 2013-10-25 14:54:16,286 [myid:] - INFO  [main:ClientBase@421] - STOPPING server
    [junit] 2013-10-25 14:54:16,286 [myid:] - INFO  [NIOServerCxn.Factory:0.0.0.0/0.0.0.0:11221:NIOServerCnxnFactory@224] - NIOServerCnxn factory exited run method
    [junit] 2013-10-25 14:54:16,287 [myid:] - INFO  [main:ZooKeeperServer@441] - shutting down
    [junit] 2013-10-25 14:54:16,287 [myid:] - INFO  [main:SessionTrackerImpl@225] - Shutting down
    [junit] 2013-10-25 14:54:16,287 [myid:] - INFO  [main:PrepRequestProcessor@761] - Shutting down
    [junit] 2013-10-25 14:54:16,288 [myid:] - INFO  [main:SyncRequestProcessor@209] - Shutting down
    [junit] 2013-10-25 14:54:16,288 [myid:] - INFO  [ProcessThread(sid:0 cport:-1)::PrepRequestProcessor@143] - PrepRequestProcessor exited loop!
    [junit] 2013-10-25 14:54:16,288 [myid:] - INFO  [SyncThread:0:SyncRequestProcessor@187] - SyncRequestProcessor exited!
    [junit] 2013-10-25 14:54:16,288 [myid:] - INFO  [main:FinalRequestProcessor@415] - shutdown of request processor complete
    [junit] 2013-10-25 14:54:16,289 [myid:] - INFO  [main:FourLetterWordMain@43] - connecting to 127.0.0.1 11221
    [junit] 2013-10-25 14:54:16,290 [myid:] - INFO  [main:JMXEnv@133] - ensureOnly:[]
    [junit] 2013-10-25 14:54:16,294 [myid:] - INFO  [main:ClientBase@476] - fdcount after test is: 46 at start it was 34
    [junit] 2013-10-25 14:54:16,294 [myid:] - INFO  [main:ClientBase@478] - sleeping for 20 secs
    [junit] 2013-10-25 14:54:16,295 [myid:] - INFO  [main:ZKTestCase$1@60] - SUCCEEDED testQuota
    [junit] 2013-10-25 14:54:16,295 [myid:] - INFO  [main:ZKTestCase$1@55] - FINISHED testQuota
    [junit] Tests run: 1, Failures: 0, Errors: 0, Time elapsed: 0.967 sec

BUILD FAILED
/home/jenkins/jenkins-slave/workspace/ZooKeeper_branch34_openjdk7/branch-3.4/build.xml:1251: Tests failed!

Total time: 33 minutes 28 seconds
Build step 'Execute shell' marked build as failure
[locks-and-latches] Releasing all the locks
[locks-and-latches] All the locks released
Recording test results
Email was triggered for: Failure
Sending email for trigger: Failure



###################################################################################
############################## FAILED TESTS (if any) ##############################
2 tests failed.
REGRESSION:  org.apache.zookeeper.test.QuorumHammerTest.testHammerBasic

Error Message:
expected:<1000> but was:<468>

Stack Trace:
junit.framework.AssertionFailedError: expected:<1000> but was:<468>
	at org.apache.zookeeper.test.ClientHammerTest.verifyHammer(ClientHammerTest.java:230)
	at org.apache.zookeeper.test.ClientHammerTest.runHammer(ClientHammerTest.java:141)
	at org.apache.zookeeper.test.ClientHammerTest.testHammerBasic(ClientHammerTest.java:119)
	at org.apache.zookeeper.test.QuorumHammerTest.testHammerBasic(QuorumHammerTest.java:49)
	at org.apache.zookeeper.JUnit4ZKTestRunner$LoggedInvokeMethod.evaluate(JUnit4ZKTestRunner.java:52)


REGRESSION:  org.apache.zookeeper.test.QuorumQuotaTest.testQuotaWithQuorum

Error Message:
KeeperErrorCode = ConnectionLoss for /a/149

Stack Trace:
org.apache.zookeeper.KeeperException$ConnectionLossException: KeeperErrorCode = ConnectionLoss for /a/149
	at org.apache.zookeeper.KeeperException.create(KeeperException.java:99)
	at org.apache.zookeeper.KeeperException.create(KeeperException.java:51)
	at org.apache.zookeeper.ZooKeeper.create(ZooKeeper.java:783)
	at org.apache.zookeeper.test.QuorumQuotaTest.testQuotaWithQuorum(QuorumQuotaTest.java:45)
	at org.apache.zookeeper.JUnit4ZKTestRunner$LoggedInvokeMethod.evaluate(JUnit4ZKTestRunner.java:52)