You are viewing a plain text version of this content. The canonical link for it is here.
Posted to dev@subversion.apache.org by Edmund Wong <ed...@kdtc.net> on 2009/04/08 08:51:26 UTC
failing
Hi,
I just updated my subversion tree and noticed it's at 1.7. (wow).
I did a make check and got the following results:
Summary of test results:
355 tests PASSED
24 tests SKIPPED
33 tests XFAILED (4 WORK-IN-PROGRESS)
720 tests FAILED
make: *** [check] Error 1
I used to have 1111 tests passed. now 33 XFAILED,
and 720 failed completely.
Pardon my ignorance, but was it a wrong time to update the tree?
Edmund
------------------------------------------------------
http://subversion.tigris.org/ds/viewMessage.do?dsForumId=462&dsMessageId=1593030
Re: failing
Posted by Edmund Wong <ed...@kdtc.net>.
Senthil Kumaran S wrote:
> Edmund Wong wrote:
>> Summary of test results:
>> 355 tests PASSED
>> 24 tests SKIPPED
>> 33 tests XFAILED (4 WORK-IN-PROGRESS)
>> 720 tests FAILED
>> make: *** [check] Error 1
>
> There is something wrong with your local setup I guess. When I ran make check I
> get the following:
>
Yes.. there is something wrong with my setup. I'm finding that
openldap isn't configuring. Something about not finding
POSIX thread libraries, which isn't a good sign. :I
Edmund
------------------------------------------------------
http://subversion.tigris.org/ds/viewMessage.do?dsForumId=462&dsMessageId=1605399
Re: failing
Posted by Senthil Kumaran S <se...@collab.net>.
Edmund Wong wrote:
> Summary of test results:
> 355 tests PASSED
> 24 tests SKIPPED
> 33 tests XFAILED (4 WORK-IN-PROGRESS)
> 720 tests FAILED
> make: *** [check] Error 1
There is something wrong with your local setup I guess. When I ran make check I
get the following:
<snip>
Summary of test results:
1112 tests PASSED
24 tests SKIPPED
32 tests XFAILED (3 WORK-IN-PROGRESS)
2 tests FAILED
1 test XPASSED (1 WORK-IN-PROGRESS)
make: *** [check] Error 1
</snip>
which is the same behavior observed in buildbots -
http://crest.ics.uci.edu/buildbot/builders/i686-debian-sarge1%20shared%20gcc-3.3.5/builds/320/steps/Test%20fsfs%2Bra_svn/logs/testlog/text
Thank You.
--
Senthil Kumaran S
http://www.stylesen.org/
------------------------------------------------------
http://subversion.tigris.org/ds/viewMessage.do?dsForumId=462&dsMessageId=1593160
RE: failing
Posted by Bert Huijben <rh...@sharpsvn.net>.
> -----Original Message-----
> From: Edmund Wong [mailto:ed@kdtc.net]
> Sent: woensdag 8 april 2009 10:51
> To: dev@subversion.tigris.org
> Subject: failing
>
> Hi,
>
> I just updated my subversion tree and noticed it's at 1.7. (wow).
> I did a make check and got the following results:
>
> Summary of test results:
> 355 tests PASSED
> 24 tests SKIPPED
> 33 tests XFAILED (4 WORK-IN-PROGRESS)
> 720 tests FAILED
> make: *** [check] Error 1
>
> I used to have 1111 tests passed. now 33 XFAILED,
> and 720 failed completely.
>
> Pardon my ignorance, but was it a wrong time to update the tree?
The buildbots report just a few failures; not that many.
See http://crest.ics.uci.edu/buildbot/waterfall for the current status.
(The mac buildbots have a local issue)
Bert
------------------------------------------------------
http://subversion.tigris.org/ds/viewMessage.do?dsForumId=462&dsMessageId=1593155
Re: failing
Posted by Kamesh Jayachandran <ka...@collab.net>.
-----BEGIN PGP SIGNED MESSAGE-----
Hash: SHA1
Looking at tests.log would help you to find what is fundamentally wrong
with your setup.
With regards
Kamesh Jayachandran
Edmund Wong wrote:
> Hi,
>
> I just updated my subversion tree and noticed it's at 1.7. (wow).
> I did a make check and got the following results:
>
> Summary of test results:
> 355 tests PASSED
> 24 tests SKIPPED
> 33 tests XFAILED (4 WORK-IN-PROGRESS)
> 720 tests FAILED
> make: *** [check] Error 1
>
> I used to have 1111 tests passed. now 33 XFAILED,
> and 720 failed completely.
>
> Pardon my ignorance, but was it a wrong time to update the tree?
>
> Edmund
>
> ------------------------------------------------------
> http://subversion.tigris.org/ds/viewMessage.do?dsForumId=462&dsMessageId=1593030
-----BEGIN PGP SIGNATURE-----
Version: GnuPG v1.2.6 (GNU/Linux)
Comment: Using GnuPG with Mozilla - http://enigmail.mozdev.org
iD8DBQFJ3GuF3WHvyO0YTCwRAqODAKCpHdabo0gqoNTHBLA3HBWMrtlW4wCeKQcI
PIUiJkN9BFXiJiJSnR+48gs=
=AejG
-----END PGP SIGNATURE-----
------------------------------------------------------
http://subversion.tigris.org/ds/viewMessage.do?dsForumId=462&dsMessageId=1593216