You are viewing a plain text version of this content. The canonical link for it is here.
Posted to builds@cassandra.apache.org by Apache Jenkins Server <je...@builds.apache.org> on 2021/09/29 21:20:53 UTC

Build complete: Cassandra-trunk #741 [UNSTABLE] 643b9b776f374929128aec66d086eee7e6154e03

-------------------------------------------------------------------------------
Build Cassandra-trunk #741 Unstable
URL: https://ci-cassandra.apache.org/job/Cassandra-trunk/741/
-------------------------------------------------------------------------------
Changes:
[Aleksei Zotov] Add tests for Resource fromName/getName


-------------------------------------------------------------------------------
Failed Tests:
9 tests failed.
FAILED:  dtest-novnode.materialized_views_test.TestMaterializedViews.test_mv_with_default_ttl_with_flush
FAILED:  dtest-upgrade.upgrade_tests.upgrade_through_versions_test.TestProtoV4Upgrade_AllVersions_EndsAt_Trunk_HEAD.test_parallel_upgrade
FAILED:  dtest-upgrade.upgrade_tests.upgrade_through_versions_test.TestProtoV4Upgrade_AllVersions_RandomPartitioner_EndsAt_Trunk_HEAD.test_parallel_upgrade
FAILED:  dtest-upgrade.upgrade_tests.upgrade_through_versions_test.TestProtoV4Upgrade_AllVersions_RandomPartitioner_EndsAt_Trunk_HEAD.test_parallel_upgrade_with_internode_ssl
FAILED:  org.apache.cassandra.distributed.upgrade.CompactStorageUpgradeTest.compactStorageHiddenColumnTest
FAILED:  org.apache.cassandra.distributed.test.trackwarnings.TombstoneWarningTest.failThresholdSinglePartition
FAILED:  org.apache.cassandra.metrics.TableMetricsTest.testUnloggedPartitionsPerBatchMultiTable-cdc
FAILED:  org.apache.cassandra.net.ConnectionTest.testTimeout-compression
FAILED:  org.apache.cassandra.db.compaction.SingleSSTableLCSTaskTest.uplevelDisabledTest

-------------------------------------------------------------------------------
For complete test report and logs see https://nightlies.apache.org/cassandra/Cassandra-trunk/741/