You are viewing a plain text version of this content. The canonical link for it is here.
Posted to dev@zookeeper.apache.org by Apache Jenkins Server <je...@builds.apache.org> on 2018/05/23 10:01:43 UTC

Failed: ZOOKEEPER-2474 PreCommit Build #3692

Jira: https://issues.apache.org/jira/browse/ZOOKEEPER-2474
Build: https://builds.apache.org/job/PreCommit-ZOOKEEPER-Build/3692/

###################################################################################
########################## LAST 60 LINES OF THE CONSOLE ###########################
[...truncated 6.30 KB...]
     [exec] 
     [exec] 
     [exec] 
     [exec] -1 overall.  Here are the results of testing the latest attachment 
     [exec]   http://issues.apache.org/jira/secure/attachment/12822755/ZOOKEEPER-2474-01.patch
     [exec]   against trunk revision 07228badc4691ca96f0d35e5aaa5ebcb2b9891cb.
     [exec] 
     [exec]     +1 @author.  The patch does not contain any @author tags.
     [exec] 
     [exec]     +1 tests included.  The patch appears to include 3 new or modified tests.
     [exec] 
     [exec]     -1 patch.  The patch command could not apply the patch.
     [exec] 
     [exec] Console output: https://builds.apache.org/job/PreCommit-ZOOKEEPER-Build/3692//console
     [exec] 
     [exec] This message is automatically generated.
     [exec] 
     [exec] 
     [exec] ======================================================================
     [exec] ======================================================================
     [exec]     Adding comment to Jira.
     [exec] ======================================================================
     [exec] ======================================================================
     [exec] 
     [exec] 
     [exec] Comment with id 16487014 added to ZOOKEEPER-2474.
     [exec] Session logged out. Session was JSESSIONID=1D1881963F2065BC16FF8787DF9562F7.
     [exec] 
     [exec] 
     [exec] ======================================================================
     [exec] ======================================================================
     [exec]     Finished build.
     [exec] ======================================================================
     [exec] ======================================================================
     [exec] 
     [exec] 
     [exec] mv: '/home/jenkins/jenkins-slave/workspace/PreCommit-ZOOKEEPER-Build/patchprocess' and '/home/jenkins/jenkins-slave/workspace/PreCommit-ZOOKEEPER-Build/patchprocess' are the same file

BUILD FAILED
/home/jenkins/jenkins-slave/workspace/PreCommit-ZOOKEEPER-Build/build.xml:1716: exec returned: 1

Total time: 47 seconds
Build step 'Execute shell' marked build as failure
Archiving artifacts
Setting JDK_1_8_LATEST__HOME=/home/jenkins/tools/java/latest1.8
[Fast Archiver] No prior successful build to compare, so performing full copy of artifacts
Recording test results
Setting JDK_1_8_LATEST__HOME=/home/jenkins/tools/java/latest1.8
ERROR: Step ?Publish JUnit test result report? failed: No test report files were found. Configuration error?
Setting JDK_1_8_LATEST__HOME=/home/jenkins/tools/java/latest1.8
[description-setter] Description set: ZOOKEEPER-2993
Setting JDK_1_8_LATEST__HOME=/home/jenkins/tools/java/latest1.8
Setting JDK_1_8_LATEST__HOME=/home/jenkins/tools/java/latest1.8
Email was triggered for: Failure - Any
Sending email for trigger: Failure - Any
Setting JDK_1_8_LATEST__HOME=/home/jenkins/tools/java/latest1.8
Setting JDK_1_8_LATEST__HOME=/home/jenkins/tools/java/latest1.8
Setting JDK_1_8_LATEST__HOME=/home/jenkins/tools/java/latest1.8
Setting JDK_1_8_LATEST__HOME=/home/jenkins/tools/java/latest1.8



###################################################################################
############################## FAILED TESTS (if any) ##############################
No tests ran.

Failed: ZOOKEEPER-832 PreCommit Build #3694

Posted by Apache Jenkins Server <je...@builds.apache.org>.
Jira: https://issues.apache.org/jira/browse/ZOOKEEPER-832
Build: https://builds.apache.org/job/PreCommit-ZOOKEEPER-Build/3694/

###################################################################################
########################## LAST 60 LINES OF THE CONSOLE ###########################
[...truncated 2.59 KB...]

forrest.check:

hudson-test-patch:
     [exec] 
     [exec] 
     [exec] ======================================================================
     [exec] ======================================================================
     [exec]     Testing patch for ZOOKEEPER-832.
     [exec] ======================================================================
     [exec] ======================================================================
     [exec] 
     [exec] 
     [exec] 
     [exec] ZOOKEEPER-832 patch is being downloaded at Fri Jun 22 06:02:46 UTC 2018 from
     [exec] http://issues.apache.org/jira/secure/attachment/12752793/ZOOKEEPER-832.patch
     [exec] 
     [exec] 
     [exec] ======================================================================
     [exec] ======================================================================
     [exec]  Pre-build trunk to verify trunk stability and javac warnings
     [exec] ======================================================================
     [exec] ======================================================================
     [exec] 
     [exec] 
     [exec] /home/jenkins/tools/ant/latest/bin/ant  -Djavac.args=-Xlint -Xmaxwarns 1000 -Djava5.home=/home/jenkins/tools/java5/latest/ -Dforrest.home=/home/jenkins/tools/forrest/latest/ -DZookeeperPatchProcess= clean tar > /home/jenkins/jenkins-slave/workspace/PreCommit-ZOOKEEPER-Build/patchprocess/trunkJavacWarnings.txt 2>&1
     [exec] Trunk compilation is broken?
     [exec] 
     [exec] 
     [exec] ======================================================================
     [exec] ======================================================================
     [exec]     Finished build.
     [exec] ======================================================================
     [exec] ======================================================================
     [exec] 
     [exec] 
     [exec] mv: '/home/jenkins/jenkins-slave/workspace/PreCommit-ZOOKEEPER-Build/patchprocess' and '/home/jenkins/jenkins-slave/workspace/PreCommit-ZOOKEEPER-Build/patchprocess' are the same file

BUILD FAILED
/home/jenkins/jenkins-slave/workspace/PreCommit-ZOOKEEPER-Build/build.xml:1785: exec returned: 1

Total time: 38 seconds
Build step 'Execute shell' marked build as failure
Archiving artifacts
Setting JDK_1_8_LATEST__HOME=/home/jenkins/tools/java/latest1.8
[Fast Archiver] No prior successful build to compare, so performing full copy of artifacts
Recording test results
Setting JDK_1_8_LATEST__HOME=/home/jenkins/tools/java/latest1.8
ERROR: Step ?Publish JUnit test result report? failed: No test report files were found. Configuration error?
Setting JDK_1_8_LATEST__HOME=/home/jenkins/tools/java/latest1.8
[description-setter] Description set: ZOOKEEPER-2368
Setting JDK_1_8_LATEST__HOME=/home/jenkins/tools/java/latest1.8
Setting JDK_1_8_LATEST__HOME=/home/jenkins/tools/java/latest1.8
Email was triggered for: Failure - Any
Sending email for trigger: Failure - Any
Setting JDK_1_8_LATEST__HOME=/home/jenkins/tools/java/latest1.8
Setting JDK_1_8_LATEST__HOME=/home/jenkins/tools/java/latest1.8
Setting JDK_1_8_LATEST__HOME=/home/jenkins/tools/java/latest1.8
Setting JDK_1_8_LATEST__HOME=/home/jenkins/tools/java/latest1.8



###################################################################################
############################## FAILED TESTS (if any) ##############################
No tests ran.

Failed: ZOOKEEPER-2977 PreCommit Build #3693

Posted by Apache Jenkins Server <je...@builds.apache.org>.
Jira: https://issues.apache.org/jira/browse/ZOOKEEPER-2977
Build: https://builds.apache.org/job/PreCommit-ZOOKEEPER-Build/3693/

###################################################################################
########################## LAST 60 LINES OF THE CONSOLE ###########################
[...truncated 6.85 KB...]
     [exec] 
     [exec] 
     [exec] 
     [exec] -1 overall.  Here are the results of testing the latest attachment 
     [exec]   http://issues.apache.org/jira/secure/attachment/12911964/2977.patch
     [exec]   against trunk revision a2623a625a4778720f7d5482d0a66e9b37ae556f.
     [exec] 
     [exec]     +1 @author.  The patch does not contain any @author tags.
     [exec] 
     [exec]     +1 tests included.  The patch appears to include 3 new or modified tests.
     [exec] 
     [exec]     -1 patch.  The patch command could not apply the patch.
     [exec] 
     [exec] Console output: https://builds.apache.org/job/PreCommit-ZOOKEEPER-Build/3693//console
     [exec] 
     [exec] This message is automatically generated.
     [exec] 
     [exec] 
     [exec] ======================================================================
     [exec] ======================================================================
     [exec]     Adding comment to Jira.
     [exec] ======================================================================
     [exec] ======================================================================
     [exec] 
     [exec] 
     [exec] Comment with id 16507991 added to ZOOKEEPER-2977.
     [exec] Session logged out. Session was JSESSIONID=27AA6F8C283693799AA26E825BA39BD4.
     [exec] 
     [exec] 
     [exec] ======================================================================
     [exec] ======================================================================
     [exec]     Finished build.
     [exec] ======================================================================
     [exec] ======================================================================
     [exec] 
     [exec] 
     [exec] mv: '/home/jenkins/jenkins-slave/workspace/PreCommit-ZOOKEEPER-Build/patchprocess' and '/home/jenkins/jenkins-slave/workspace/PreCommit-ZOOKEEPER-Build/patchprocess' are the same file

BUILD FAILED
/home/jenkins/jenkins-slave/workspace/PreCommit-ZOOKEEPER-Build/build.xml:1785: exec returned: 1

Total time: 51 seconds
Build step 'Execute shell' marked build as failure
Archiving artifacts
Setting JDK_1_8_LATEST__HOME=/home/jenkins/tools/java/latest1.8
[Fast Archiver] No prior successful build to compare, so performing full copy of artifacts
Recording test results
Setting JDK_1_8_LATEST__HOME=/home/jenkins/tools/java/latest1.8
ERROR: Step ?Publish JUnit test result report? failed: No test report files were found. Configuration error?
Setting JDK_1_8_LATEST__HOME=/home/jenkins/tools/java/latest1.8
[description-setter] Description set: ZOOKEEPER-3019
Setting JDK_1_8_LATEST__HOME=/home/jenkins/tools/java/latest1.8
Setting JDK_1_8_LATEST__HOME=/home/jenkins/tools/java/latest1.8
Email was triggered for: Failure - Any
Sending email for trigger: Failure - Any
Setting JDK_1_8_LATEST__HOME=/home/jenkins/tools/java/latest1.8
Setting JDK_1_8_LATEST__HOME=/home/jenkins/tools/java/latest1.8
Setting JDK_1_8_LATEST__HOME=/home/jenkins/tools/java/latest1.8
Setting JDK_1_8_LATEST__HOME=/home/jenkins/tools/java/latest1.8



###################################################################################
############################## FAILED TESTS (if any) ##############################
No tests ran.