You are viewing a plain text version of this content. The canonical link for it is here.
Posted to dev@lucene.apache.org by Policeman Jenkins Server <je...@thetaphi.de> on 2018/11/17 07:57:12 UTC

[JENKINS] Lucene-Solr-7.x-Windows (64bit/jdk1.8.0_172) - Build # 889 - Still Unstable!

Build: https://jenkins.thetaphi.de/job/Lucene-Solr-7.x-Windows/889/
Java: 64bit/jdk1.8.0_172 -XX:-UseCompressedOops -XX:+UseParallelGC

2 tests failed.
FAILED:  org.apache.solr.cloud.autoscaling.TriggerIntegrationTest.testTriggerThrottling

Error Message:
Both triggers should have fired by now

Stack Trace:
java.lang.AssertionError: Both triggers should have fired by now
	at __randomizedtesting.SeedInfo.seed([9DEEC13A1BEDB426:66CC691FC94757B4]:0)
	at org.junit.Assert.fail(Assert.java:93)
	at org.apache.solr.cloud.autoscaling.TriggerIntegrationTest.testTriggerThrottling(TriggerIntegrationTest.java:270)
	at sun.reflect.NativeMethodAccessorImpl.invoke0(Native Method)
	at sun.reflect.NativeMethodAccessorImpl.invoke(NativeMethodAccessorImpl.java:62)
	at sun.reflect.DelegatingMethodAccessorImpl.invoke(DelegatingMethodAccessorImpl.java:43)
	at java.lang.reflect.Method.invoke(Method.java:498)
	at com.carrotsearch.randomizedtesting.RandomizedRunner.invoke(RandomizedRunner.java:1742)
	at com.carrotsearch.randomizedtesting.RandomizedRunner$8.evaluate(RandomizedRunner.java:935)
	at com.carrotsearch.randomizedtesting.RandomizedRunner$9.evaluate(RandomizedRunner.java:971)
	at com.carrotsearch.randomizedtesting.RandomizedRunner$10.evaluate(RandomizedRunner.java:985)
	at com.carrotsearch.randomizedtesting.rules.SystemPropertiesRestoreRule$1.evaluate(SystemPropertiesRestoreRule.java:57)
	at org.apache.lucene.util.TestRuleSetupTeardownChained$1.evaluate(TestRuleSetupTeardownChained.java:49)
	at org.apache.lucene.util.AbstractBeforeAfterRule$1.evaluate(AbstractBeforeAfterRule.java:45)
	at org.apache.lucene.util.TestRuleThreadAndTestName$1.evaluate(TestRuleThreadAndTestName.java:48)
	at org.apache.lucene.util.TestRuleIgnoreAfterMaxFailures$1.evaluate(TestRuleIgnoreAfterMaxFailures.java:64)
	at org.apache.lucene.util.TestRuleMarkFailure$1.evaluate(TestRuleMarkFailure.java:47)
	at com.carrotsearch.randomizedtesting.rules.StatementAdapter.evaluate(StatementAdapter.java:36)
	at com.carrotsearch.randomizedtesting.ThreadLeakControl$StatementRunner.run(ThreadLeakControl.java:368)
	at com.carrotsearch.randomizedtesting.ThreadLeakControl.forkTimeoutingTask(ThreadLeakControl.java:817)
	at com.carrotsearch.randomizedtesting.ThreadLeakControl$3.evaluate(ThreadLeakControl.java:468)
	at com.carrotsearch.randomizedtesting.RandomizedRunner.runSingleTest(RandomizedRunner.java:944)
	at com.carrotsearch.randomizedtesting.RandomizedRunner$5.evaluate(RandomizedRunner.java:830)
	at com.carrotsearch.randomizedtesting.RandomizedRunner$6.evaluate(RandomizedRunner.java:880)
	at com.carrotsearch.randomizedtesting.RandomizedRunner$7.evaluate(RandomizedRunner.java:891)
	at com.carrotsearch.randomizedtesting.rules.StatementAdapter.evaluate(StatementAdapter.java:36)
	at com.carrotsearch.randomizedtesting.rules.SystemPropertiesRestoreRule$1.evaluate(SystemPropertiesRestoreRule.java:57)
	at org.apache.lucene.util.AbstractBeforeAfterRule$1.evaluate(AbstractBeforeAfterRule.java:45)
	at com.carrotsearch.randomizedtesting.rules.StatementAdapter.evaluate(StatementAdapter.java:36)
	at org.apache.lucene.util.TestRuleStoreClassName$1.evaluate(TestRuleStoreClassName.java:41)
	at com.carrotsearch.randomizedtesting.rules.NoShadowingOrOverridesOnMethodsRule$1.evaluate(NoShadowingOrOverridesOnMethodsRule.java:40)
	at com.carrotsearch.randomizedtesting.rules.NoShadowingOrOverridesOnMethodsRule$1.evaluate(NoShadowingOrOverridesOnMethodsRule.java:40)
	at com.carrotsearch.randomizedtesting.rules.StatementAdapter.evaluate(StatementAdapter.java:36)
	at com.carrotsearch.randomizedtesting.rules.StatementAdapter.evaluate(StatementAdapter.java:36)
	at com.carrotsearch.randomizedtesting.rules.StatementAdapter.evaluate(StatementAdapter.java:36)
	at org.apache.lucene.util.TestRuleAssertionsRequired$1.evaluate(TestRuleAssertionsRequired.java:53)
	at org.apache.lucene.util.TestRuleMarkFailure$1.evaluate(TestRuleMarkFailure.java:47)
	at org.apache.lucene.util.TestRuleIgnoreAfterMaxFailures$1.evaluate(TestRuleIgnoreAfterMaxFailures.java:64)
	at org.apache.lucene.util.TestRuleIgnoreTestSuites$1.evaluate(TestRuleIgnoreTestSuites.java:54)
	at com.carrotsearch.randomizedtesting.rules.StatementAdapter.evaluate(StatementAdapter.java:36)
	at com.carrotsearch.randomizedtesting.ThreadLeakControl$StatementRunner.run(ThreadLeakControl.java:368)
	at java.lang.Thread.run(Thread.java:748)


FAILED:  org.apache.solr.cloud.autoscaling.TriggerIntegrationTest.testTriggerThrottling

Error Message:
Both triggers should have fired by now

Stack Trace:
java.lang.AssertionError: Both triggers should have fired by now
	at __randomizedtesting.SeedInfo.seed([9DEEC13A1BEDB426:66CC691FC94757B4]:0)
	at org.junit.Assert.fail(Assert.java:93)
	at org.apache.solr.cloud.autoscaling.TriggerIntegrationTest.testTriggerThrottling(TriggerIntegrationTest.java:270)
	at sun.reflect.NativeMethodAccessorImpl.invoke0(Native Method)
	at sun.reflect.NativeMethodAccessorImpl.invoke(NativeMethodAccessorImpl.java:62)
	at sun.reflect.DelegatingMethodAccessorImpl.invoke(DelegatingMethodAccessorImpl.java:43)
	at java.lang.reflect.Method.invoke(Method.java:498)
	at com.carrotsearch.randomizedtesting.RandomizedRunner.invoke(RandomizedRunner.java:1742)
	at com.carrotsearch.randomizedtesting.RandomizedRunner$8.evaluate(RandomizedRunner.java:935)
	at com.carrotsearch.randomizedtesting.RandomizedRunner$9.evaluate(RandomizedRunner.java:971)
	at com.carrotsearch.randomizedtesting.RandomizedRunner$10.evaluate(RandomizedRunner.java:985)
	at com.carrotsearch.randomizedtesting.rules.SystemPropertiesRestoreRule$1.evaluate(SystemPropertiesRestoreRule.java:57)
	at org.apache.lucene.util.TestRuleSetupTeardownChained$1.evaluate(TestRuleSetupTeardownChained.java:49)
	at org.apache.lucene.util.AbstractBeforeAfterRule$1.evaluate(AbstractBeforeAfterRule.java:45)
	at org.apache.lucene.util.TestRuleThreadAndTestName$1.evaluate(TestRuleThreadAndTestName.java:48)
	at org.apache.lucene.util.TestRuleIgnoreAfterMaxFailures$1.evaluate(TestRuleIgnoreAfterMaxFailures.java:64)
	at org.apache.lucene.util.TestRuleMarkFailure$1.evaluate(TestRuleMarkFailure.java:47)
	at com.carrotsearch.randomizedtesting.rules.StatementAdapter.evaluate(StatementAdapter.java:36)
	at com.carrotsearch.randomizedtesting.ThreadLeakControl$StatementRunner.run(ThreadLeakControl.java:368)
	at com.carrotsearch.randomizedtesting.ThreadLeakControl.forkTimeoutingTask(ThreadLeakControl.java:817)
	at com.carrotsearch.randomizedtesting.ThreadLeakControl$3.evaluate(ThreadLeakControl.java:468)
	at com.carrotsearch.randomizedtesting.RandomizedRunner.runSingleTest(RandomizedRunner.java:944)
	at com.carrotsearch.randomizedtesting.RandomizedRunner$5.evaluate(RandomizedRunner.java:830)
	at com.carrotsearch.randomizedtesting.RandomizedRunner$6.evaluate(RandomizedRunner.java:880)
	at com.carrotsearch.randomizedtesting.RandomizedRunner$7.evaluate(RandomizedRunner.java:891)
	at com.carrotsearch.randomizedtesting.rules.StatementAdapter.evaluate(StatementAdapter.java:36)
	at com.carrotsearch.randomizedtesting.rules.SystemPropertiesRestoreRule$1.evaluate(SystemPropertiesRestoreRule.java:57)
	at org.apache.lucene.util.AbstractBeforeAfterRule$1.evaluate(AbstractBeforeAfterRule.java:45)
	at com.carrotsearch.randomizedtesting.rules.StatementAdapter.evaluate(StatementAdapter.java:36)
	at org.apache.lucene.util.TestRuleStoreClassName$1.evaluate(TestRuleStoreClassName.java:41)
	at com.carrotsearch.randomizedtesting.rules.NoShadowingOrOverridesOnMethodsRule$1.evaluate(NoShadowingOrOverridesOnMethodsRule.java:40)
	at com.carrotsearch.randomizedtesting.rules.NoShadowingOrOverridesOnMethodsRule$1.evaluate(NoShadowingOrOverridesOnMethodsRule.java:40)
	at com.carrotsearch.randomizedtesting.rules.StatementAdapter.evaluate(StatementAdapter.java:36)
	at com.carrotsearch.randomizedtesting.rules.StatementAdapter.evaluate(StatementAdapter.java:36)
	at com.carrotsearch.randomizedtesting.rules.StatementAdapter.evaluate(StatementAdapter.java:36)
	at org.apache.lucene.util.TestRuleAssertionsRequired$1.evaluate(TestRuleAssertionsRequired.java:53)
	at org.apache.lucene.util.TestRuleMarkFailure$1.evaluate(TestRuleMarkFailure.java:47)
	at org.apache.lucene.util.TestRuleIgnoreAfterMaxFailures$1.evaluate(TestRuleIgnoreAfterMaxFailures.java:64)
	at org.apache.lucene.util.TestRuleIgnoreTestSuites$1.evaluate(TestRuleIgnoreTestSuites.java:54)
	at com.carrotsearch.randomizedtesting.rules.StatementAdapter.evaluate(StatementAdapter.java:36)
	at com.carrotsearch.randomizedtesting.ThreadLeakControl$StatementRunner.run(ThreadLeakControl.java:368)
	at java.lang.Thread.run(Thread.java:748)




Build Log:
[...truncated 14471 lines...]
   [junit4] Suite: org.apache.solr.cloud.autoscaling.TriggerIntegrationTest
   [junit4]   2> Creating dataDir: C:\Users\jenkins\workspace\Lucene-Solr-7.x-Windows\solr\build\solr-core\test\J1\temp\solr.cloud.autoscaling.TriggerIntegrationTest_9DEEC13A1BEDB426-001\init-core-data-001
   [junit4]   2> 3202026 INFO  (SUITE-TriggerIntegrationTest-seed#[9DEEC13A1BEDB426]-worker) [    ] o.a.s.SolrTestCaseJ4 Using PointFields (NUMERIC_POINTS_SYSPROP=true) w/NUMERIC_DOCVALUES_SYSPROP=true
   [junit4]   2> 3202027 INFO  (SUITE-TriggerIntegrationTest-seed#[9DEEC13A1BEDB426]-worker) [    ] o.a.s.SolrTestCaseJ4 Randomized ssl (false) and clientAuth (true) via: @org.apache.solr.util.RandomizeSSL(reason=, value=NaN, ssl=NaN, clientAuth=NaN)
   [junit4]   2> 3202027 INFO  (SUITE-TriggerIntegrationTest-seed#[9DEEC13A1BEDB426]-worker) [    ] o.a.s.SolrTestCaseJ4 SecureRandom sanity checks: test.solr.allowed.securerandom=null & java.security.egd=file:/dev/./urandom
   [junit4]   2> 3202029 INFO  (SUITE-TriggerIntegrationTest-seed#[9DEEC13A1BEDB426]-worker) [    ] o.a.s.c.MiniSolrCloudCluster Starting cluster of 2 servers in C:\Users\jenkins\workspace\Lucene-Solr-7.x-Windows\solr\build\solr-core\test\J1\temp\solr.cloud.autoscaling.TriggerIntegrationTest_9DEEC13A1BEDB426-001\tempDir-001
   [junit4]   2> 3202029 INFO  (SUITE-TriggerIntegrationTest-seed#[9DEEC13A1BEDB426]-worker) [    ] o.a.s.c.ZkTestServer STARTING ZK TEST SERVER
   [junit4]   2> 3202030 INFO  (Thread-5803) [    ] o.a.s.c.ZkTestServer client port:0.0.0.0/0.0.0.0:0
   [junit4]   2> 3202030 INFO  (Thread-5803) [    ] o.a.s.c.ZkTestServer Starting server
   [junit4]   2> 3202034 ERROR (Thread-5803) [    ] o.a.z.s.ZooKeeperServer ZKShutdownHandler is not registered, so ZooKeeper server won't take any action on ERROR or SHUTDOWN server state changes
   [junit4]   2> 3202126 INFO  (SUITE-TriggerIntegrationTest-seed#[9DEEC13A1BEDB426]-worker) [    ] o.a.s.c.ZkTestServer start zk server on port:64908
   [junit4]   2> 3202129 INFO  (zkConnectionManagerCallback-11032-thread-1) [    ] o.a.s.c.c.ConnectionManager zkClient has connected
   [junit4]   2> 3202133 INFO  (jetty-launcher-11029-thread-2) [    ] o.e.j.s.Server jetty-9.4.11.v20180605; built: 2018-06-05T18:24:03.829Z; git: d5fc0523cfa96bfebfbda19606cad384d772f04c; jvm 1.8.0_172-b11
   [junit4]   2> 3202133 INFO  (jetty-launcher-11029-thread-1) [    ] o.e.j.s.Server jetty-9.4.11.v20180605; built: 2018-06-05T18:24:03.829Z; git: d5fc0523cfa96bfebfbda19606cad384d772f04c; jvm 1.8.0_172-b11
   [junit4]   2> 3202134 INFO  (jetty-launcher-11029-thread-2) [    ] o.e.j.s.session DefaultSessionIdManager workerName=node0
   [junit4]   2> 3202134 INFO  (jetty-launcher-11029-thread-2) [    ] o.e.j.s.session No SessionScavenger set, using defaults
   [junit4]   2> 3202134 INFO  (jetty-launcher-11029-thread-2) [    ] o.e.j.s.session node0 Scavenging every 660000ms
   [junit4]   2> 3202134 INFO  (jetty-launcher-11029-thread-1) [    ] o.e.j.s.session DefaultSessionIdManager workerName=node0
   [junit4]   2> 3202134 INFO  (jetty-launcher-11029-thread-1) [    ] o.e.j.s.session No SessionScavenger set, using defaults
   [junit4]   2> 3202134 INFO  (jetty-launcher-11029-thread-1) [    ] o.e.j.s.session node0 Scavenging every 660000ms
   [junit4]   2> 3202134 INFO  (jetty-launcher-11029-thread-1) [    ] o.e.j.s.h.ContextHandler Started o.e.j.s.ServletContextHandler@1e51f47e{/solr,null,AVAILABLE}
   [junit4]   2> 3202134 INFO  (jetty-launcher-11029-thread-2) [    ] o.e.j.s.h.ContextHandler Started o.e.j.s.ServletContextHandler@338d7b73{/solr,null,AVAILABLE}
   [junit4]   2> 3202135 INFO  (jetty-launcher-11029-thread-2) [    ] o.e.j.s.AbstractConnector Started ServerConnector@6a4dc737{HTTP/1.1,[http/1.1]}{127.0.0.1:64913}
   [junit4]   2> 3202136 INFO  (jetty-launcher-11029-thread-1) [    ] o.e.j.s.AbstractConnector Started ServerConnector@432fe3b5{HTTP/1.1,[http/1.1]}{127.0.0.1:64912}
   [junit4]   2> 3202136 INFO  (jetty-launcher-11029-thread-2) [    ] o.e.j.s.Server Started @3168464ms
   [junit4]   2> 3202136 INFO  (jetty-launcher-11029-thread-1) [    ] o.e.j.s.Server Started @3168464ms
   [junit4]   2> 3202136 INFO  (jetty-launcher-11029-thread-2) [    ] o.a.s.c.s.e.JettySolrRunner Jetty properties: {hostContext=/solr, hostPort=64913}
   [junit4]   2> 3202136 INFO  (jetty-launcher-11029-thread-1) [    ] o.a.s.c.s.e.JettySolrRunner Jetty properties: {hostContext=/solr, hostPort=64912}
   [junit4]   2> 3202136 ERROR (jetty-launcher-11029-thread-2) [    ] o.a.s.u.StartupLoggingUtils Missing Java Option solr.log.dir. Logging may be missing or incomplete.
   [junit4]   2> 3202136 ERROR (jetty-launcher-11029-thread-1) [    ] o.a.s.u.StartupLoggingUtils Missing Java Option solr.log.dir. Logging may be missing or incomplete.
   [junit4]   2> 3202136 INFO  (jetty-launcher-11029-thread-2) [    ] o.a.s.s.SolrDispatchFilter Using logger factory org.apache.logging.slf4j.Log4jLoggerFactory
   [junit4]   2> 3202136 INFO  (jetty-launcher-11029-thread-1) [    ] o.a.s.s.SolrDispatchFilter Using logger factory org.apache.logging.slf4j.Log4jLoggerFactory
   [junit4]   2> 3202136 INFO  (jetty-launcher-11029-thread-1) [    ] o.a.s.s.SolrDispatchFilter  ___      _       Welcome to Apache Solr? version 7.7.0
   [junit4]   2> 3202136 INFO  (jetty-launcher-11029-thread-2) [    ] o.a.s.s.SolrDispatchFilter  ___      _       Welcome to Apache Solr? version 7.7.0
   [junit4]   2> 3202136 INFO  (jetty-launcher-11029-thread-2) [    ] o.a.s.s.SolrDispatchFilter / __| ___| |_ _   Starting in cloud mode on port null
   [junit4]   2> 3202136 INFO  (jetty-launcher-11029-thread-1) [    ] o.a.s.s.SolrDispatchFilter / __| ___| |_ _   Starting in cloud mode on port null
   [junit4]   2> 3202136 INFO  (jetty-launcher-11029-thread-2) [    ] o.a.s.s.SolrDispatchFilter \__ \/ _ \ | '_|  Install dir: null
   [junit4]   2> 3202136 INFO  (jetty-launcher-11029-thread-1) [    ] o.a.s.s.SolrDispatchFilter \__ \/ _ \ | '_|  Install dir: null
   [junit4]   2> 3202136 INFO  (jetty-launcher-11029-thread-2) [    ] o.a.s.s.SolrDispatchFilter |___/\___/_|_|    Start time: 2018-11-17T07:08:37.084Z
   [junit4]   2> 3202136 INFO  (jetty-launcher-11029-thread-1) [    ] o.a.s.s.SolrDispatchFilter |___/\___/_|_|    Start time: 2018-11-17T07:08:37.084Z
   [junit4]   2> 3202138 INFO  (zkConnectionManagerCallback-11034-thread-1) [    ] o.a.s.c.c.ConnectionManager zkClient has connected
   [junit4]   2> 3202138 INFO  (zkConnectionManagerCallback-11036-thread-1) [    ] o.a.s.c.c.ConnectionManager zkClient has connected
   [junit4]   2> 3202138 INFO  (jetty-launcher-11029-thread-2) [    ] o.a.s.s.SolrDispatchFilter solr.xml found in ZooKeeper. Loading...
   [junit4]   2> 3202138 INFO  (jetty-launcher-11029-thread-1) [    ] o.a.s.s.SolrDispatchFilter solr.xml found in ZooKeeper. Loading...
   [junit4]   2> 3202149 WARN  (NIOServerCxn.Factory:0.0.0.0/0.0.0.0:0) [    ] o.a.z.s.NIOServerCnxn Unable to read additional data from client sessionid 0x1000d10b01f0001, likely client has closed socket
   [junit4]   2> 3202150 WARN  (NIOServerCxn.Factory:0.0.0.0/0.0.0.0:0) [    ] o.a.z.s.NIOServerCnxn Unable to read additional data from client sessionid 0x1000d10b01f0002, likely client has closed socket
   [junit4]   2> 3202206 INFO  (jetty-launcher-11029-thread-1) [    ] o.a.s.c.ZkContainer Zookeeper client=127.0.0.1:64908/solr
   [junit4]   2> 3202208 INFO  (zkConnectionManagerCallback-11040-thread-1) [    ] o.a.s.c.c.ConnectionManager zkClient has connected
   [junit4]   2> 3202209 WARN  (NIOServerCxn.Factory:0.0.0.0/0.0.0.0:0) [    ] o.a.z.s.NIOServerCnxn Unable to read additional data from client sessionid 0x1000d10b01f0003, likely client has closed socket
   [junit4]   2> 3202210 INFO  (zkConnectionManagerCallback-11042-thread-1) [    ] o.a.s.c.c.ConnectionManager zkClient has connected
   [junit4]   2> 3202280 INFO  (jetty-launcher-11029-thread-1) [n:127.0.0.1:64912_solr    ] o.a.s.c.OverseerElectionContext I am going to be the leader 127.0.0.1:64912_solr
   [junit4]   2> 3202281 INFO  (jetty-launcher-11029-thread-1) [n:127.0.0.1:64912_solr    ] o.a.s.c.Overseer Overseer (id=72071959363387396-127.0.0.1:64912_solr-n_0000000000) starting
   [junit4]   2> 3202285 INFO  (zkConnectionManagerCallback-11049-thread-1) [    ] o.a.s.c.c.ConnectionManager zkClient has connected
   [junit4]   2> 3202287 INFO  (jetty-launcher-11029-thread-1) [n:127.0.0.1:64912_solr    ] o.a.s.c.s.i.ZkClientClusterStateProvider Cluster at 127.0.0.1:64908/solr ready
   [junit4]   2> 3202288 INFO  (jetty-launcher-11029-thread-1) [n:127.0.0.1:64912_solr    ] o.a.s.c.ZkController Register node as live in ZooKeeper:/live_nodes/127.0.0.1:64912_solr
   [junit4]   2> 3202288 INFO  (OverseerStateUpdate-72071959363387396-127.0.0.1:64912_solr-n_0000000000) [n:127.0.0.1:64912_solr    ] o.a.s.c.Overseer Starting to work on the main queue : 127.0.0.1:64912_solr
   [junit4]   2> 3202288 DEBUG (OverseerAutoScalingTriggerThread-72071959363387396-127.0.0.1:64912_solr-n_0000000000) [    ] o.a.s.c.a.OverseerTriggerThread Adding .auto_add_replicas and .scheduled_maintenance triggers
   [junit4]   2> 3202289 INFO  (OverseerStateUpdate-72071959363387396-127.0.0.1:64912_solr-n_0000000000) [n:127.0.0.1:64912_solr    ] o.a.s.c.c.ZkStateReader Updated live nodes from ZooKeeper... (0) -> (1)
   [junit4]   2> 3202290 DEBUG (OverseerAutoScalingTriggerThread-72071959363387396-127.0.0.1:64912_solr-n_0000000000) [    ] o.a.s.c.a.OverseerTriggerThread Refreshing /autoscaling.json with znode version 1
   [junit4]   2> 3202290 DEBUG (OverseerAutoScalingTriggerThread-72071959363387396-127.0.0.1:64912_solr-n_0000000000) [    ] o.a.s.c.a.OverseerTriggerThread Current znodeVersion 1, lastZnodeVersion -1
   [junit4]   2> 3202290 DEBUG (OverseerAutoScalingTriggerThread-72071959363387396-127.0.0.1:64912_solr-n_0000000000) [    ] o.a.s.c.a.OverseerTriggerThread Processed trigger updates upto znodeVersion 1
   [junit4]   2> 3202292 DEBUG (OverseerAutoScalingTriggerThread-72071959363387396-127.0.0.1:64912_solr-n_0000000000) [    ] o.a.s.c.a.NodeLostTrigger NodeLostTrigger .auto_add_replicas - Initial livenodes: []
   [junit4]   2> 3202292 DEBUG (OverseerAutoScalingTriggerThread-72071959363387396-127.0.0.1:64912_solr-n_0000000000) [    ] o.a.s.c.a.OverseerTriggerThread -- clean old nodeAdded markers
   [junit4]   2> 3202293 DEBUG (OverseerAutoScalingTriggerThread-72071959363387396-127.0.0.1:64912_solr-n_0000000000) [    ] o.a.s.c.a.OverseerTriggerThread Current znodeVersion 1, lastZnodeVersion 1
   [junit4]   2> 3202294 INFO  (zkCallback-11048-thread-1) [    ] o.a.s.c.c.ZkStateReader Updated live nodes from ZooKeeper... (0) -> (1)
   [junit4]   2> 3202295 DEBUG (ScheduledTrigger-13452-thread-1) [    ] o.a.s.c.a.NodeLostTrigger Running NodeLostTrigger: .auto_add_replicas with currently live nodes: 1
   [junit4]   2> 3202331 INFO  (jetty-launcher-11029-thread-1) [n:127.0.0.1:64912_solr    ] o.a.s.h.a.MetricsHistoryHandler No .system collection, keeping metrics history in memory.
   [junit4]   2> 3202375 INFO  (jetty-launcher-11029-thread-2) [    ] o.a.s.c.ZkContainer Zookeeper client=127.0.0.1:64908/solr
   [junit4]   2> 3202377 INFO  (jetty-launcher-11029-thread-1) [n:127.0.0.1:64912_solr    ] o.a.s.m.r.SolrJmxReporter JMX monitoring for 'solr_64912.solr.node' (registry 'solr.node') enabled at server: com.sun.jmx.mbeanserver.JmxMBeanServer@6ea14ee4
   [junit4]   2> 3202378 INFO  (zkConnectionManagerCallback-11054-thread-1) [    ] o.a.s.c.c.ConnectionManager zkClient has connected
   [junit4]   2> 3202379 WARN  (NIOServerCxn.Factory:0.0.0.0/0.0.0.0:0) [    ] o.a.z.s.NIOServerCnxn Unable to read additional data from client sessionid 0x1000d10b01f0006, likely client has closed socket
   [junit4]   2> 3202380 INFO  (zkConnectionManagerCallback-11056-thread-1) [    ] o.a.s.c.c.ConnectionManager zkClient has connected
   [junit4]   2> 3202383 INFO  (jetty-launcher-11029-thread-1) [n:127.0.0.1:64912_solr    ] o.a.s.m.r.SolrJmxReporter JMX monitoring for 'solr_64912.solr.jvm' (registry 'solr.jvm') enabled at server: com.sun.jmx.mbeanserver.JmxMBeanServer@6ea14ee4
   [junit4]   2> 3202383 INFO  (jetty-launcher-11029-thread-1) [n:127.0.0.1:64912_solr    ] o.a.s.m.r.SolrJmxReporter JMX monitoring for 'solr_64912.solr.jetty' (registry 'solr.jetty') enabled at server: com.sun.jmx.mbeanserver.JmxMBeanServer@6ea14ee4
   [junit4]   2> 3202385 INFO  (jetty-launcher-11029-thread-1) [n:127.0.0.1:64912_solr    ] o.a.s.c.CorePropertiesLocator Found 0 core definitions underneath C:\Users\jenkins\workspace\Lucene-Solr-7.x-Windows\solr\build\solr-core\test\J1\temp\solr.cloud.autoscaling.TriggerIntegrationTest_9DEEC13A1BEDB426-001\tempDir-001\node1\.
   [junit4]   2> 3202385 INFO  (jetty-launcher-11029-thread-2) [n:127.0.0.1:64913_solr    ] o.a.s.c.c.ZkStateReader Updated live nodes from ZooKeeper... (0) -> (1)
   [junit4]   2> 3202388 INFO  (jetty-launcher-11029-thread-2) [n:127.0.0.1:64913_solr    ] o.a.s.c.TransientSolrCoreCacheDefault Allocating transient cache for 2147483647 transient cores
   [junit4]   2> 3202388 INFO  (jetty-launcher-11029-thread-2) [n:127.0.0.1:64913_solr    ] o.a.s.c.ZkController Register node as live in ZooKeeper:/live_nodes/127.0.0.1:64913_solr
   [junit4]   2> 3202389 INFO  (zkCallback-11041-thread-1) [    ] o.a.s.c.c.ZkStateReader Updated live nodes from ZooKeeper... (1) -> (2)
   [junit4]   2> 3202389 INFO  (zkCallback-11048-thread-1) [    ] o.a.s.c.c.ZkStateReader Updated live nodes from ZooKeeper... (1) -> (2)
   [junit4]   2> 3202390 INFO  (zkCallback-11055-thread-1) [    ] o.a.s.c.c.ZkStateReader Updated live nodes from ZooKeeper... (1) -> (2)
   [junit4]   2> 3202434 INFO  (zkConnectionManagerCallback-11063-thread-1) [    ] o.a.s.c.c.ConnectionManager zkClient has connected
   [junit4]   2> 3202436 INFO  (jetty-launcher-11029-thread-2) [n:127.0.0.1:64913_solr    ] o.a.s.c.c.ZkStateReader Updated live nodes from ZooKeeper... (0) -> (2)
   [junit4]   2> 3202437 INFO  (jetty-launcher-11029-thread-2) [n:127.0.0.1:64913_solr    ] o.a.s.c.s.i.ZkClientClusterStateProvider Cluster at 127.0.0.1:64908/solr ready
   [junit4]   2> 3202437 INFO  (jetty-launcher-11029-thread-2) [n:127.0.0.1:64913_solr    ] o.a.s.h.a.MetricsHistoryHandler No .system collection, keeping metrics history in memory.
   [junit4]   2> 3202457 INFO  (jetty-launcher-11029-thread-2) [n:127.0.0.1:64913_solr    ] o.a.s.m.r.SolrJmxReporter JMX monitoring for 'solr_64913.solr.node' (registry 'solr.node') enabled at server: com.sun.jmx.mbeanserver.JmxMBeanServer@6ea14ee4
   [junit4]   2> 3202461 INFO  (jetty-launcher-11029-thread-2) [n:127.0.0.1:64913_solr    ] o.a.s.m.r.SolrJmxReporter JMX monitoring for 'solr_64913.solr.jvm' (registry 'solr.jvm') enabled at server: com.sun.jmx.mbeanserver.JmxMBeanServer@6ea14ee4
   [junit4]   2> 3202461 INFO  (jetty-launcher-11029-thread-2) [n:127.0.0.1:64913_solr    ] o.a.s.m.r.SolrJmxReporter JMX monitoring for 'solr_64913.solr.jetty' (registry 'solr.jetty') enabled at server: com.sun.jmx.mbeanserver.JmxMBeanServer@6ea14ee4
   [junit4]   2> 3202462 INFO  (jetty-launcher-11029-thread-2) [n:127.0.0.1:64913_solr    ] o.a.s.c.CorePropertiesLocator Found 0 core definitions underneath C:\Users\jenkins\workspace\Lucene-Solr-7.x-Windows\solr\build\solr-core\test\J1\temp\solr.cloud.autoscaling.TriggerIntegrationTest_9DEEC13A1BEDB426-001\tempDir-001\node2\.
   [junit4]   2> 3202487 INFO  (zkConnectionManagerCallback-11066-thread-1) [    ] o.a.s.c.c.ConnectionManager zkClient has connected
   [junit4]   2> 3202492 INFO  (zkConnectionManagerCallback-11071-thread-1) [    ] o.a.s.c.c.ConnectionManager zkClient has connected
   [junit4]   2> 3202494 INFO  (SUITE-TriggerIntegrationTest-seed#[9DEEC13A1BEDB426]-worker) [    ] o.a.s.c.c.ZkStateReader Updated live nodes from ZooKeeper... (0) -> (2)
   [junit4]   2> 3202495 INFO  (SUITE-TriggerIntegrationTest-seed#[9DEEC13A1BEDB426]-worker) [    ] o.a.s.c.s.i.ZkClientClusterStateProvider Cluster at 127.0.0.1:64908/solr ready
   [junit4]   2> 3202504 INFO  (qtp233219129-34940) [n:127.0.0.1:64912_solr    ] o.a.s.s.HttpSolrCall [admin] webapp=null path=/admin/metrics params={prefix=CONTAINER.fs.usableSpace,CONTAINER.fs.totalSpace,CORE.coreName&wt=javabin&version=2&group=solr.node,solr.core} status=0 QTime=3
   [junit4]   2> 3202506 INFO  (qtp1115307807-34929) [n:127.0.0.1:64913_solr    ] o.a.s.s.HttpSolrCall [admin] webapp=null path=/admin/metrics params={prefix=CONTAINER.fs.usableSpace,CONTAINER.fs.totalSpace,CORE.coreName&wt=javabin&version=2&group=solr.node,solr.core} status=0 QTime=2
   [junit4]   2> 3202506 DEBUG (qtp233219129-34936) [n:127.0.0.1:64912_solr    ] o.a.s.c.a.AutoScalingHandler Verified autoscaling configuration
   [junit4]   2> 3202507 INFO  (qtp233219129-34936) [n:127.0.0.1:64912_solr    ] o.a.s.s.HttpSolrCall [admin] webapp=null path=/cluster/autoscaling params={wt=javabin&version=2} status=0 QTime=8
   [junit4]   2> 3202507 DEBUG (zkCallback-11048-thread-1) [    ] o.a.s.c.a.OverseerTriggerThread Refreshing /autoscaling.json with znode version 2
   [junit4]   2> 3202508 DEBUG (OverseerAutoScalingTriggerThread-72071959363387396-127.0.0.1:64912_solr-n_0000000000) [    ] o.a.s.c.a.OverseerTriggerThread Processed trigger updates upto znodeVersion 2
   [junit4]   2> 3202514 DEBUG (OverseerAutoScalingTriggerThread-72071959363387396-127.0.0.1:64912_solr-n_0000000000) [    ] o.a.s.c.a.OverseerTriggerThread -- clean old nodeAdded markers
   [junit4]   2> 3202514 DEBUG (OverseerAutoScalingTriggerThread-72071959363387396-127.0.0.1:64912_solr-n_0000000000) [    ] o.a.s.c.a.OverseerTriggerThread Current znodeVersion 2, lastZnodeVersion 2
   [junit4]   2> 3202522 INFO  (TEST-TriggerIntegrationTest.testEventQueue-seed#[9DEEC13A1BEDB426]) [    ] o.a.s.SolrTestCaseJ4 ###Starting testEventQueue
   [junit4]   2> 3202524 INFO  (zkConnectionManagerCallback-11073-thread-1) [    ] o.a.s.c.c.ConnectionManager zkClient has connected
   [junit4]   2> 3202524 INFO  (qtp233219129-34935) [n:127.0.0.1:64912_solr    ] o.a.s.h.a.CollectionsHandler Invoked Collection Action :overseerstatus with params action=OVERSEERSTATUS&wt=javabin&version=2 and sendToOCPQueue=true
   [junit4]   2> 3202528 INFO  (qtp233219129-34935) [n:127.0.0.1:64912_solr    ] o.a.s.s.HttpSolrCall [admin] webapp=null path=/admin/collections params={action=OVERSEERSTATUS&wt=javabin&version=2} status=0 QTime=4
   [junit4]   2> 3202530 INFO  (TEST-TriggerIntegrationTest.testEventQueue-seed#[9DEEC13A1BEDB426]) [    ] o.a.s.c.a.ScheduledTriggers -- removing trigger: .auto_add_replicas
   [junit4]   2> 3202532 INFO  (TEST-TriggerIntegrationTest.testEventQueue-seed#[9DEEC13A1BEDB426]) [    ] o.a.s.c.a.TriggerIntegrationTest /autoscaling.json reset, new znode version 3
   [junit4]   2> 3202532 DEBUG (zkCallback-11048-thread-1) [    ] o.a.s.c.a.OverseerTriggerThread Refreshing /autoscaling.json with znode version 3
   [junit4]   2> 3202532 DEBUG (OverseerAutoScalingTriggerThread-72071959363387396-127.0.0.1:64912_solr-n_0000000000) [    ] o.a.s.c.a.OverseerTriggerThread Processed trigger updates upto znodeVersion 3
   [junit4]   2> 3202532 DEBUG (OverseerAutoScalingTriggerThread-72071959363387396-127.0.0.1:64912_solr-n_0000000000) [    ] o.a.s.c.a.OverseerTriggerThread -- clean old nodeLost markers
   [junit4]   2> 3202532 INFO  (TEST-TriggerIntegrationTest.testEventQueue-seed#[9DEEC13A1BEDB426]) [    ] o.a.s.c.c.ZkStateReader Updated live nodes from ZooKeeper... (0) -> (2)
   [junit4]   2> 3202533 DEBUG (OverseerAutoScalingTriggerThread-72071959363387396-127.0.0.1:64912_solr-n_0000000000) [    ] o.a.s.c.a.OverseerTriggerThread -- clean old nodeAdded markers
   [junit4]   2> 3202533 DEBUG (OverseerAutoScalingTriggerThread-72071959363387396-127.0.0.1:64912_solr-n_0000000000) [    ] o.a.s.c.a.OverseerTriggerThread Current znodeVersion 3, lastZnodeVersion 3
   [junit4]   2> 3202534 INFO  (TEST-TriggerIntegrationTest.testEventQueue-seed#[9DEEC13A1BEDB426]) [    ] o.e.j.s.AbstractConnector Stopped ServerConnector@432fe3b5{HTTP/1.1,[http/1.1]}{127.0.0.1:0}
   [junit4]   2> 3202534 INFO  (TEST-TriggerIntegrationTest.testEventQueue-seed#[9DEEC13A1BEDB426]) [    ] o.a.s.c.CoreContainer Shutting down CoreContainer instance=1286496924
   [junit4]   2> 3202534 INFO  (TEST-TriggerIntegrationTest.testEventQueue-seed#[9DEEC13A1BEDB426]) [    ] o.a.s.m.SolrMetricManager Closing metric reporters for registry=solr.node, tag=null
   [junit4]   2> 3202534 INFO  (TEST-TriggerIntegrationTest.testEventQueue-seed#[9DEEC13A1BEDB426]) [    ] o.a.s.m.r.SolrJmxReporter Closing reporter [org.apache.solr.metrics.reporters.SolrJmxReporter@34045d9f: rootName = solr_64912, domain = solr.node, service url = null, agent id = null] for registry solr.node / com.codahale.metrics.MetricRegistry@611b2b3a
   [junit4]   2> 3202539 INFO  (TEST-TriggerIntegrationTest.testEventQueue-seed#[9DEEC13A1BEDB426]) [    ] o.a.s.m.SolrMetricManager Closing metric reporters for registry=solr.jvm, tag=null
   [junit4]   2> 3202539 INFO  (TEST-TriggerIntegrationTest.testEventQueue-seed#[9DEEC13A1BEDB426]) [    ] o.a.s.m.r.SolrJmxReporter Closing reporter [org.apache.solr.metrics.reporters.SolrJmxReporter@68017d05: rootName = solr_64912, domain = solr.jvm, service url = null, agent id = null] for registry solr.jvm / com.codahale.metrics.MetricRegistry@60eb32b9
   [junit4]   2> 3202542 INFO  (TEST-TriggerIntegrationTest.testEventQueue-seed#[9DEEC13A1BEDB426]) [    ] o.a.s.m.SolrMetricManager Closing metric reporters for registry=solr.jetty, tag=null
   [junit4]   2> 3202542 INFO  (TEST-TriggerIntegrationTest.testEventQueue-seed#[9DEEC13A1BEDB426]) [    ] o.a.s.m.r.SolrJmxReporter Closing reporter [org.apache.solr.metrics.reporters.SolrJmxReporter@18af4363: rootName = solr_64912, domain = solr.jetty, service url = null, agent id = null] for registry solr.jetty / com.codahale.metrics.MetricRegistry@5bc9d45f
   [junit4]   2> 3202544 INFO  (TEST-TriggerIntegrationTest.testEventQueue-seed#[9DEEC13A1BEDB426]) [    ] o.a.s.c.ZkController Remove node as live in ZooKeeper:/live_nodes/127.0.0.1:64912_solr
   [junit4]   2> 3202545 INFO  (TEST-TriggerIntegrationTest.testEventQueue-seed#[9DEEC13A1BEDB426]) [    ] o.a.s.m.SolrMetricManager Closing metric reporters for registry=solr.cluster, tag=null
   [junit4]   2> 3202545 INFO  (TEST-TriggerIntegrationTest.testEventQueue-seed#[9DEEC13A1BEDB426]) [    ] o.a.s.c.TransientSolrCoreCacheDefault Allocating transient cache for 2147483647 transient cores
   [junit4]   2> 3202545 INFO  (zkCallback-11062-thread-1) [    ] o.a.s.c.c.ZkStateReader Updated live nodes from ZooKeeper... (2) -> (1)
   [junit4]   2> 3202545 INFO  (zkCallback-11041-thread-1) [    ] o.a.s.c.c.ZkStateReader Updated live nodes from ZooKeeper... (2) -> (1)
   [junit4]   2> 3202545 INFO  (TEST-TriggerIntegrationTest.testEventQueue-seed#[9DEEC13A1BEDB426]) [    ] o.a.s.c.Overseer Overseer (id=72071959363387396-127.0.0.1:64912_solr-n_0000000000) closing
   [junit4]   2> 3202546 INFO  (zkCallback-11055-thread-1) [    ] o.a.s.c.c.ZkStateReader Updated live nodes from ZooKeeper... (2) -> (1)
   [junit4]   2> 3202546 INFO  (zkCallback-11070-thread-1) [    ] o.a.s.c.c.ZkStateReader Updated live nodes from ZooKeeper... (2) -> (1)
   [junit4]   2> 3202546 INFO  (zkCallback-11070-thread-2) [    ] o.a.s.c.c.ZkStateReader Updated live nodes from ZooKeeper... (2) -> (1)
   [junit4]   2> 3202546 INFO  (zkCallback-11048-thread-1) [    ] o.a.s.c.c.ZkStateReader Updated live nodes from ZooKeeper... (2) -> (1)
   [junit4]   2> 3202546 DEBUG (TEST-TriggerIntegrationTest.testEventQueue-seed#[9DEEC13A1BEDB426]) [    ] o.a.s.c.a.ScheduledTriggers Shutting down scheduled thread pool executor now
   [junit4]   2> 3202546 DEBUG (TEST-TriggerIntegrationTest.testEventQueue-seed#[9DEEC13A1BEDB426]) [    ] o.a.s.c.a.ScheduledTriggers Shutting down action executor now
   [junit4]   2> 3202546 DEBUG (TEST-TriggerIntegrationTest.testEventQueue-seed#[9DEEC13A1BEDB426]) [    ] o.a.s.c.a.ScheduledTriggers Awaiting termination for action executor
   [junit4]   2> 3202546 DEBUG (TEST-TriggerIntegrationTest.testEventQueue-seed#[9DEEC13A1BEDB426]) [    ] o.a.s.c.a.ScheduledTriggers Awaiting termination for scheduled thread pool executor
   [junit4]   2> 3202546 INFO  (OverseerStateUpdate-72071959363387396-127.0.0.1:64912_solr-n_0000000000) [n:127.0.0.1:64912_solr    ] o.a.s.c.Overseer Overseer Loop exiting : 127.0.0.1:64912_solr
   [junit4]   2> 3202546 WARN  (OverseerAutoScalingTriggerThread-72071959363387396-127.0.0.1:64912_solr-n_0000000000) [    ] o.a.s.c.a.OverseerTriggerThread OverseerTriggerThread woken up but we are closed, exiting.
   [junit4]   2> 3202547 DEBUG (TEST-TriggerIntegrationTest.testEventQueue-seed#[9DEEC13A1BEDB426]) [    ] o.a.s.c.a.ScheduledTriggers ScheduledTriggers closed completely
   [junit4]   2> 3202547 DEBUG (TEST-TriggerIntegrationTest.testEventQueue-seed#[9DEEC13A1BEDB426]) [    ] o.a.s.c.a.OverseerTriggerThread OverseerTriggerThread has been closed explicitly
   [junit4]   2> 3202548 WARN  (NIOServerCxn.Factory:0.0.0.0/0.0.0.0:0) [    ] o.a.z.s.NIOServerCnxn Unable to read additional data from client sessionid 0x1000d10b01f0004, likely client has closed socket
   [junit4]   2> 3202548 INFO  (TEST-TriggerIntegrationTest.testEventQueue-seed#[9DEEC13A1BEDB426]) [    ] o.e.j.s.h.ContextHandler Stopped o.e.j.s.ServletContextHandler@1e51f47e{/solr,null,UNAVAILABLE}
   [junit4]   2> 3202548 INFO  (zkCallback-11055-thread-1) [    ] o.a.s.c.OverseerElectionContext I am going to be the leader 127.0.0.1:64913_solr
   [junit4]   2> 3202549 INFO  (TEST-TriggerIntegrationTest.testEventQueue-seed#[9DEEC13A1BEDB426]) [    ] o.e.j.s.session node0 Stopped scavenging
   [junit4]   2> 3202550 INFO  (zkCallback-11055-thread-1) [n:127.0.0.1:64913_solr    ] o.a.s.c.Overseer Overseer (id=72071959363387399-127.0.0.1:64913_solr-n_0000000001) starting
   [junit4]   2> 3202555 INFO  (OverseerStateUpdate-72071959363387399-127.0.0.1:64913_solr-n_0000000001) [n:127.0.0.1:64913_solr    ] o.a.s.c.Overseer Starting to work on the main queue : 127.0.0.1:64913_solr
   [junit4]   2> 3202555 DEBUG (OverseerAutoScalingTriggerThread-72071959363387399-127.0.0.1:64913_solr-n_0000000001) [    ] o.a.s.c.a.OverseerTriggerThread Adding .auto_add_replicas and .scheduled_maintenance triggers
   [junit4]   2> 3202556 DEBUG (OverseerAutoScalingTriggerThread-72071959363387399-127.0.0.1:64913_solr-n_0000000001) [    ] o.a.s.c.a.OverseerTriggerThread Refreshing /autoscaling.json with znode version 4
   [junit4]   2> 3202556 DEBUG (OverseerAutoScalingTriggerThread-72071959363387399-127.0.0.1:64913_solr-n_0000000001) [    ] o.a.s.c.a.OverseerTriggerThread Current znodeVersion 4, lastZnodeVersion -1
   [junit4]   2> 3202557 DEBUG (OverseerAutoScalingTriggerThread-72071959363387399-127.0.0.1:64913_solr-n_0000000001) [    ] o.a.s.c.a.OverseerTriggerThread Processed trigger updates upto znodeVersion 4
   [junit4]   2> 3202560 DEBUG (OverseerAutoScalingTriggerThread-72071959363387399-127.0.0.1:64913_solr-n_0000000001) [    ] o.a.s.c.a.NodeLostTrigger NodeLostTrigger .auto_add_replicas - Initial livenodes: [127.0.0.1:64913_solr]
   [junit4]   2> 3202560 DEBUG (OverseerAutoScalingTriggerThread-72071959363387399-127.0.0.1:64913_solr-n_0000000001) [    ] o.a.s.c.a.OverseerTriggerThread -- clean old nodeAdded markers
   [junit4]   2> 3202560 DEBUG (OverseerAutoScalingTriggerThread-72071959363387399-127.0.0.1:64913_solr-n_0000000001) [    ] o.a.s.c.a.OverseerTriggerThread Current znodeVersion 4, lastZnodeVersion 4
   [junit4]   2> 3202560 DEBUG (ScheduledTrigger-13468-thread-1) [    ] o.a.s.c.a.NodeLostTrigger Running NodeLostTrigger: .auto_add_replicas with currently live nodes: 1
   [junit4]   2> 3203522 DEBUG (ScheduledTrigger-13468-thread-3) [    ] o.a.s.c.a.NodeLostTrigger Running NodeLostTrigger: .auto_add_replicas with currently live nodes: 1
   [junit4]   2> 3204484 DEBUG (ScheduledTrigger-13468-thread-1) [    ] o.a.s.c.a.NodeLostTrigger Running NodeLostTrigger: .auto_add_replicas with currently live nodes: 1
   [junit4]   2> 3205445 DEBUG (ScheduledTrigger-13468-thread-3) [    ] o.a.s.c.a.NodeLostTrigger Running NodeLostTrigger: .auto_add_replicas with currently live nodes: 1
   [junit4]   2> 3206406 DEBUG (ScheduledTrigger-13468-thread-4) [    ] o.a.s.c.a.NodeLostTrigger Running NodeLostTrigger: .auto_add_replicas with currently live nodes: 1
   [junit4]   2> 3207353 INFO  (TEST-TriggerIntegrationTest.testEventQueue-seed#[9DEEC13A1BEDB426]) [    ] o.e.j.s.Server jetty-9.4.11.v20180605; built: 2018-06-05T18:24:03.829Z; git: d5fc0523cfa96bfebfbda19606cad384d772f04c; jvm 1.8.0_172-b11
   [junit4]   2> 3207353 INFO  (TEST-TriggerIntegrationTest.testEventQueue-seed#[9DEEC13A1BEDB426]) [    ] o.e.j.s.session DefaultSessionIdManager workerName=node0
   [junit4]   2> 3207353 INFO  (TEST-TriggerIntegrationTest.testEventQueue-seed#[9DEEC13A1BEDB426]) [    ] o.e.j.s.session No SessionScavenger set, using defaults
   [junit4]   2> 3207353 INFO  (TEST-TriggerIntegrationTest.testEventQueue-seed#[9DEEC13A1BEDB426]) [    ] o.e.j.s.session node0 Scavenging every 600000ms
   [junit4]   2> 3207353 INFO  (TEST-TriggerIntegrationTest.testEventQueue-seed#[9DEEC13A1BEDB426]) [    ] o.e.j.s.h.ContextHandler Started o.e.j.s.ServletContextHandler@351c0299{/solr,null,AVAILABLE}
   [junit4]   2> 3207354 INFO  (TEST-TriggerIntegrationTest.testEventQueue-seed#[9DEEC13A1BEDB426]) [    ] o.e.j.s.AbstractConnector Started ServerConnector@20bd523d{HTTP/1.1,[http/1.1]}{127.0.0.1:64957}
   [junit4]   2> 3207355 INFO  (TEST-TriggerIntegrationTest.testEventQueue-seed#[9DEEC13A1BEDB426]) [    ] o.e.j.s.Server Started @3173898ms
   [junit4]   2> 3207355 INFO  (TEST-TriggerIntegrationTest.testEventQueue-seed#[9DEEC13A1BEDB426]) [    ] o.a.s.c.s.e.JettySolrRunner Jetty properties: {hostContext=/solr, hostPort=64957}
   [junit4]   2> 3207355 ERROR (TEST-TriggerIntegrationTest.testEventQueue-seed#[9DEEC13A1BEDB426]) [    ] o.a.s.u.StartupLoggingUtils Missing Java Option solr.log.dir. Logging may be missing or incomplete.
   [junit4]   2> 3207355 INFO  (TEST-TriggerIntegrationTest.testEventQueue-seed#[9DEEC13A1BEDB426]) [    ] o.a.s.s.SolrDispatchFilter Using logger factory org.apache.logging.slf4j.Log4jLoggerFactory
   [junit4]   2> 3207355 INFO  (TEST-TriggerIntegrationTest.testEventQueue-seed#[9DEEC13A1BEDB426]) [    ] o.a.s.s.SolrDispatchFilter  ___      _       Welcome to Apache Solr? version 7.7.0
   [junit4]   2> 3207355 INFO  (TEST-TriggerIntegrationTest.testEventQueue-seed#[9DEEC13A1BEDB426]) [    ] o.a.s.s.SolrDispatchFilter / __| ___| |_ _   Starting in cloud mode on port null
   [junit4]   2> 3207355 INFO  (TEST-TriggerIntegrationTest.testEventQueue-seed#[9DEEC13A1BEDB426]) [    ] o.a.s.s.SolrDispatchFilter \__ \/ _ \ | '_|  Install dir: null
   [junit4]   2> 3207355 INFO  (TEST-TriggerIntegrationTest.testEventQueue-seed#[9DEEC13A1BEDB426]) [    ] o.a.s.s.SolrDispatchFilter |___/\___/_|_|    Start time: 2018-11-17T07:08:42.303Z
   [junit4]   2> 3207358 INFO  (zkConnectionManagerCallback-11077-thread-1) [    ] o.a.s.c.c.ConnectionManager zkClient has connected
   [junit4]   2> 3207358 INFO  (TEST-TriggerIntegrationTest.testEventQueue-seed#[9DEEC13A1BEDB426]) [    ] o.a.s.s.SolrDispatchFilter solr.xml found in ZooKeeper. Loading...
   [junit4]   2> 3207368 DEBUG (ScheduledTrigger-13468-thread-3) [    ] o.a.s.c.a.NodeLostTrigger Running NodeLostTrigger: .auto_add_replicas with currently live nodes: 1
   [junit4]   2> 3207642 INFO  (TEST-TriggerIntegrationTest.testEventQueue-seed#[9DEEC13A1BEDB426]) [    ] o.a.s.c.ZkContainer Zookeeper client=127.0.0.1:64908/solr
   [junit4]   2> 3207644 INFO  (zkConnectionManagerCallback-11081-thread-1) [    ] o.a.s.c.c.ConnectionManager zkClient has connected
   [junit4]   2> 3207646 INFO  (zkConnectionManagerCallback-11083-thread-1) [    ] o.a.s.c.c.ConnectionManager zkClient has connected
   [junit4]   2> 3207653 INFO  (TEST-TriggerIntegrationTest.testEventQueue-seed#[9DEEC13A1BEDB426]) [n:127.0.0.1:64957_solr    ] o.a.s.c.c.ZkStateReader Updated live nodes from ZooKeeper... (0) -> (1)
   [junit4]   2> 3207656 INFO  (TEST-TriggerIntegrationTest.testEventQueue-seed#[9DEEC13A1BEDB426]) [n:127.0.0.1:64957_solr    ] o.a.s.c.TransientSolrCoreCacheDefault Allocating transient cache for 2147483647 transient cores
   [junit4]   2> 3207656 INFO  (TEST-TriggerIntegrationTest.testEventQueue-seed#[9DEEC13A1BEDB426]) [n:127.0.0.1:64957_solr    ] o.a.s.c.ZkController Register node as live in ZooKeeper:/live_nodes/127.0.0.1:64957_solr
   [junit4]   2> 3207657 INFO  (zkCallback-11062-thread-1) [    ] o.a.s.c.c.ZkStateReader Updated live nodes from ZooKeeper... (1) -> (2)
   [junit4]   2> 3207657 INFO  (zkCallback-11055-thread-1) [    ] o.a.s.c.c.ZkStateReader Updated live nodes from ZooKeeper... (1) -> (2)
   [junit4]   2> 3207658 INFO  (zkCallback-11070-thread-2) [    ] o.a.s.c.c.ZkStateReader Updated live nodes from ZooKeeper... (1) -> (2)
   [junit4]   2> 3207658 INFO  (zkCallback-11070-thread-1) [    ] o.a.s.c.c.ZkStateReader Updated live nodes from ZooKeeper... (1) -> (2)
   [junit4]   2> 3207658 INFO  (zkCallback-11082-thread-1) [    ] o.a.s.c.c.ZkStateReader Updated live nodes from ZooKeeper... (1) -> (2)
   [junit4]   2> 3207711 INFO  (zkConnectionManagerCallback-11090-thread-1) [    ] o.a.s.c.c.ConnectionManager zkClient has connected
   [junit4]   2> 3207712 INFO  (TEST-TriggerIntegrationTest.testEventQueue-seed#[9DEEC13A1BEDB426]) [n:127.0.0.1:64957_solr    ] o.a.s.c.c.ZkStateReader Updated live nodes from ZooKeeper... (0) -> (2)
   [junit4]   2> 3207713 INFO  (TEST-TriggerIntegrationTest.testEventQueue-seed#[9DEEC13A1BEDB426]) [n:127.0.0.1:64957_solr    ] o.a.s.c.s.i.ZkClientClusterStateProvider Cluster at 127.0.0.1:64908/solr ready
   [junit4]   2> 3207713 INFO  (TEST-TriggerIntegrationTest.testEventQueue-seed#[9DEEC13A1BEDB426]) [n:127.0.0.1:64957_solr    ] o.a.s.h.a.MetricsHistoryHandler No .system collection, keeping metrics history in memory.
   [junit4]   2> 3207734 INFO  (TEST-TriggerIntegrationTest.testEventQueue-seed#[9DEEC13A1BEDB426]) [n:127.0.0.1:64957_solr    ] o.a.s.m.r.SolrJmxReporter JMX monitoring for 'solr_64957.solr.node' (registry 'solr.node') enabled at server: com.sun.jmx.mbeanserver.JmxMBeanServer@6ea14ee4
   [junit4]   2> 3207740 INFO  (TEST-TriggerIntegrationTest.testEventQueue-seed#[9DEEC13A1BEDB426]) [n:127.0.0.1:64957_solr    ] o.a.s.m.r.SolrJmxReporter JMX monitoring for 'solr_64957.solr.jvm' (registry 'solr.jvm') enabled at server: com.sun.jmx.mbeanserver.JmxMBeanServer@6ea14ee4
   [junit4]   2> 3207740 INFO  (TEST-TriggerIntegrationTest.testEventQueue-seed#[9DEEC13A1BEDB426]) [n:127.0.0.1:64957_solr    ] o.a.s.m.r.SolrJmxReporter JMX monitoring for 'solr_64957.solr.jetty' (registry 'solr.jetty') enabled at server: com.sun.jmx.mbeanserver.JmxMBeanServer@6ea14ee4
   [junit4]   2> 3207742 INFO  (TEST-TriggerIntegrationTest.testEventQueue-seed#[9DEEC13A1BEDB426]) [n:127.0.0.1:64957_solr    ] o.a.s.c.CorePropertiesLocator Found 0 core definitions underneath C:\Users\jenkins\workspace\Lucene-Solr-7.x-Windows\solr\build\solr-core\test\J1\temp\solr.cloud.autoscaling.TriggerIntegrationTest_9DEEC13A1BEDB426-001\tempDir-001\node3\.
   [junit4]   2> 3207772 INFO  (qtp1115307807-34926) [n:127.0.0.1:64913_solr    ] o.a.s.h.a.CollectionsHandler Invoked Collection Action :overseerstatus with params action=OVERSEERSTATUS&wt=javabin&version=2 and sendToOCPQueue=true
   [junit4]   2> 3207777 INFO  (qtp1115307807-34926) [n:127.0.0.1:64913_solr    ] o.a.s.s.HttpSolrCall [admin] webapp=null path=/admin/collections params={action=OVERSEERSTATUS&wt=javabin&version=2} status=0 QTime=5
   [junit4]   2> 3207777 INFO  (qtp1115307807-34928) [n:127.0.0.1:64913_solr    ] o.a.s.c.a.TriggerIntegrationTest TestEventQueueAction instantiated
   [junit4]   2> 3207781 INFO  (qtp1115307807-34930) [n:127.0.0.1:64913_solr    ] o.a.s.s.HttpSolrCall [admin] webapp=null path=/admin/metrics params={prefix=CONTAINER.fs.usableSpace,CONTAINER.fs.totalSpace,CORE.coreName&wt=javabin&version=2&group=solr.node,solr.core} status=0 QTime=2
   [junit4]   2> 3207785 INFO  (qtp440435584-35019) [n:127.0.0.1:64957_solr    ] o.a.s.s.HttpSolrCall [admin] webapp=null path=/admin/metrics params={prefix=CONTAINER.fs.usableSpace,CONTAINER.fs.totalSpace,CORE.coreName&wt=javabin&version=2&group=solr.node,solr.core} status=0 QTime=2
   [junit4]   2> 3207785 DEBUG (qtp1115307807-34928) [n:127.0.0.1:64913_solr    ] o.a.s.c.a.AutoScalingHandler Verified autoscaling configuration
   [junit4]   2> 3207786 INFO  (qtp1115307807-34928) [n:127.0.0.1:64913_solr    ] o.a.s.s.HttpSolrCall [admin] webapp=null path=/admin/autoscaling params={wt=javabin&version=2} status=0 QTime=8
   [junit4]   2> 3207786 DEBUG (zkCallback-11062-thread-1) [    ] o.a.s.c.a.OverseerTriggerThread Refreshing /autoscaling.json with znode version 5
   [junit4]   2> 3207786 INFO  (zkCallback-11062-thread-1) [    ] o.a.s.c.a.TriggerIntegrationTest TestEventQueueAction instantiated
   [junit4]   2> 3207786 DEBUG (OverseerAutoScalingTriggerThread-72071959363387399-127.0.0.1:64913_solr-n_0000000001) [    ] o.a.s.c.a.OverseerTriggerThread Processed trigger updates upto znodeVersion 5
   [junit4]   2> 3207789 INFO  (OverseerAutoScalingTriggerThread-72071959363387399-127.0.0.1:64913_solr-n_0000000001) [    ] o.a.s.c.a.TriggerIntegrationTest TestEventQueueAction init
   [junit4]   2> 3207789 DEBUG (OverseerAutoScalingTriggerThread-72071959363387399-127.0.0.1:64913_solr-n_0000000001) [    ] o.a.s.c.a.NodeAddedTrigger NodeAddedTrigger node_added_triggerEQ - Initial livenodes: [127.0.0.1:64957_solr, 127.0.0.1:64913_solr]
   [junit4]   2> 3207789 DEBUG (OverseerAutoScalingTriggerThread-72071959363387399-127.0.0.1:64913_solr-n_0000000001) [    ] o.a.s.c.a.NodeAddedTrigger NodeAddedTrigger node_added_triggerEQ instantiated with properties: {event=nodeAdded, waitFor=1, actions=[{name=test, class=org.apache.solr.cloud.autoscaling.TriggerIntegrationTest$TestEventQueueAction}], enabled=true}
   [junit4]   2> 3207790 DEBUG (ScheduledTrigger-13468-thread-4) [    ] o.a.s.c.a.NodeAddedTrigger Running NodeAddedTrigger node_added_triggerEQ
   [junit4]   2> 3207790 DEBUG (ScheduledTrigger-13468-thread-4) [    ] o.a.s.c.a.NodeAddedTrigger Found livenodes: 2
   [junit4]   2> 3207790 INFO  (TEST-TriggerIntegrationTest.testEventQueue-seed#[9DEEC13A1BEDB426]) [    ] o.e.j.s.Server jetty-9.4.11.v20180605; built: 2018-06-05T18:24:03.829Z; git: d5fc0523cfa96bfebfbda19606cad384d772f04c; jvm 1.8.0_172-b11
   [junit4]   2> 3207792 INFO  (TEST-TriggerIntegrationTest.testEventQueue-seed#[9DEEC13A1BEDB426]) [    ] o.e.j.s.session DefaultSessionIdManager workerName=node0
   [junit4]   2> 3207792 INFO  (TEST-TriggerIntegrationTest.testEventQueue-seed#[9DEEC13A1BEDB426]) [    ] o.e.j.s.session No SessionScavenger set, using defaults
   [junit4]   2> 3207792 INFO  (TEST-TriggerIntegrationTest.testEventQueue-seed#[9DEEC13A1BEDB426]) [    ] o.e.j.s.session node0 Scavenging every 660000ms
   [junit4]   2> 3207792 DEBUG (OverseerAutoScalingTriggerThread-72071959363387399-127.0.0.1:64913_solr-n_0000000001) [    ] o.a.s.c.a.OverseerTriggerThread Current znodeVersion 5, lastZnodeVersion 5
   [junit4]   2> 3207792 INFO  (TEST-TriggerIntegrationTest.testEventQueue-seed#[9DEEC13A1BEDB426]) [    ] o.e.j.s.h.ContextHandler Started o.e.j.s.ServletContextHandler@630c7e0{/solr,null,AVAILABLE}
   [junit4]   2> 3207793 INFO  (TEST-TriggerIntegrationTest.testEventQueue-seed#[9DEEC13A1BEDB426]) [    ] o.e.j.s.AbstractConnector Started ServerConnector@3ec2d428{HTTP/1.1,[http/1.1]}{127.0.0.1:64975}
   [junit4]   2> 3207793 INFO  (TEST-TriggerIntegrationTest.testEventQueue-seed#[9DEEC13A1BEDB426]) [    ] o.e.j.s.Server Started @3174354ms
   [junit4]   2> 3207793 INFO  (TEST-TriggerIntegrationTest.testEventQueue-seed#[9DEEC13A1BEDB426]) [    ] o.a.s.c.s.e.JettySolrRunner Jetty properties: {hostContext=/solr, hostPort=64975}
   [junit4]   2> 3207794 ERROR (TEST-TriggerIntegrationTest.testEventQueue-seed#[9DEEC13A1BEDB426]) [    ] o.a.s.u.StartupLoggingUtils Missing Java Option solr.log.dir. Logging may be missing or incomplete.
   [junit4]   2> 3207794 INFO  (TEST-TriggerIntegrationTest.testEventQueue-seed#[9DEEC13A1BEDB426]) [    ] o.a.s.s.SolrDispatchFilter Using logger factory org.apache.logging.slf4j.Log4jLoggerFactory
   [junit4]   2> 3207794 INFO  (TEST-TriggerIntegrationTest.testEventQueue-seed#[9DEEC13A1BEDB426]) [    ] o.a.s.s.SolrDispatchFilter  ___      _       Welcome to Apache Solr? version 7.7.0
   [junit4]   2> 3207794 INFO  (TEST-TriggerIntegrationTest.testEventQueue-seed#[9DEEC13A1BEDB426]) [    ] o.a.s.s.SolrDispatchFilter / __| ___| |_ _   Starting in cloud mode on port null
   [junit4]   2> 3207794 INFO  (TEST-TriggerIntegrationTest.testEventQueue-seed#[9DEEC13A1BEDB426]) [    ] o.a.s.s.SolrDispatchFilter \__ \/ _ \ | '_|  Install dir: null
   [junit4]   2> 3207794 INFO  (TEST-TriggerIntegrationTest.testEventQueue-seed#[9DEEC13A1BEDB426]) [    ] o.a.s.s.SolrDispatchFilter |___/\___/_|_|    Start time: 2018-11-17T07:08:42.742Z
   [junit4]   2> 3207795 INFO  (zkConnectionManagerCallback-11093-thread-1) [    ] o.a.s.c.c.ConnectionManager zkClient has connected
   [junit4]   2> 3207796 INFO  (TEST-TriggerIntegrationTest.testEventQueue-seed#[9DEEC13A1BEDB426]) [    ] o.a.s.s.SolrDispatchFilter solr.xml found in ZooKeeper. Loading...
   [junit4]   2> 3207976 INFO  (TEST-TriggerIntegrationTest.testEventQueue-seed#[9DEEC13A1BEDB426]) [    ] o.a.s.c.ZkContainer Zookeeper client=127.0.0.1:64908/solr
   [junit4]   2> 3207978 INFO  (zkConnectionManagerCallback-11097-thread-1) [    ] o.a.s.c.c.ConnectionManager zkClient has connected
   [junit4]   2> 3207981 INFO  (zkConnectionManagerCallback-11099-thread-1) [    ] o.a.s.c.c.ConnectionManager zkClient has connected
   [junit4]   2> 3207988 INFO  (TEST-TriggerIntegrationTest.testEventQueue-seed#[9DEEC13A1BEDB426]) [    ] o.a.s.c.c.ZkStateReader Updated live nodes from ZooKeeper... (0) -> (2)
   [junit4]   2> 3207992 INFO  (TEST-TriggerIntegrationTest.testEventQueue-seed#[9DEEC13A1BEDB426]) [    ] o.a.s.c.TransientSolrCoreCacheDefault Allocating transient cache for 2147483647 transient cores
   [junit4]   2> 3207992 INFO  (TEST-TriggerIntegrationTest.testEventQueue-seed#[9DEEC13A1BEDB426]) [    ] o.a.s.c.ZkController Register node as live in ZooKeeper:/live_nodes/127.0.0.1:64975_solr
   [junit4]   2> 3207993 INFO  (zkCallback-11062-thread-1) [    ] o.a.s.c.c.ZkStateReader Updated live nodes from ZooKeeper... (2) -> (3)
   [junit4]   2> 3207993 INFO  (zkCallback-11082-thread-1) [    ] o.a.s.c.c.ZkStateReader Updated live nodes from ZooKeeper... (2) -> (3)
   [junit4]   2> 3207993 INFO  (zkCallback-11055-thread-1) [    ] o.a.s.c.c.ZkStateReader Updated live nodes from ZooKeeper... (2) -> (3)
   [junit4]   2> 3207993 INFO  (zkCallback-11070-thread-1) [    ] o.a.s.c.c.ZkStateReader Updated live nodes from ZooKeeper... (2) -> (3)
   [junit4]   2> 3207993 INFO  (zkCallback-11070-thread-2) [    ] o.a.s.c.c.ZkStateReader Updated live nodes from ZooKeeper... (2) -> (3)
   [junit4]   2> 3207993 INFO  (zkCallback-11089-thread-1) [    ] o.a.s.c.c.ZkStateReader Updated live nodes from ZooKeeper... (2) -> (3)
   [junit4]   2> 3207993 INFO  (zkCallback-11098-thread-1) [    ] o.a.s.c.c.ZkStateReader Updated live nodes from ZooKeeper... (2) -> (3)
   [junit4]   2> 3208045 INFO  (zkConnectionManagerCallback-11106-thread-1) [    ] o.a.s.c.c.ConnectionManager zkClient has connected
   [junit4]   2> 3208046 INFO  (TEST-TriggerIntegrationTest.testEventQueue-seed#[9DEEC13A1BEDB426]) [    ] o.a.s.c.c.ZkStateReader Updated live nodes from ZooKeeper... (0) -> (3)
   [junit4]   2> 3208047 INFO  (TEST-TriggerIntegrationTest.testEventQueue-seed#[9DEEC13A1BEDB426]) [    ] o.a.s.c.s.i.ZkClientClusterStateProvider Cluster at 127.0.0.1:64908/solr ready
   [junit4]   2> 3208047 INFO  (TEST-TriggerIntegrationTest.testEventQueue-seed#[9DEEC13A1BEDB426]) [    ] o.a.s.h.a.MetricsHistoryHandler No .system collection, keeping metrics history in memory.
   [junit4]   2> 3208074 INFO  (TEST-TriggerIntegrationTest.testEventQueue-seed#[9DEEC13A1BEDB426]) [    ] o.a.s.m.r.SolrJmxReporter JMX monitoring for 'solr_64975.solr.node' (registry 'solr.node') enabled at server: com.sun.jmx.mbeanserver.JmxMBeanServer@6ea14ee4
   [junit4]   2> 3208081 INFO  (TEST-TriggerIntegrationTest.testEventQueue-seed#[9DEEC13A1BEDB426]) [    ] o.a.s.m.r.SolrJmxReporter JMX monitoring for 'solr_64975.solr.jvm' (registry 'solr.jvm') enabled at server: com.sun.jmx.mbeanserver.JmxMBeanServer@6ea14ee4
   [junit4]   2> 3208081 INFO  (TEST-TriggerIntegrationTest.testEventQueue-seed#[9DEEC13A1BEDB426]) [    ] o.a.s.m.r.SolrJmxReporter JMX monitoring for 'solr_64975.solr.jetty' (registry 'solr.jetty') enabled at server: com.sun.jmx.mbeanserver.JmxMBeanServer@6ea14ee4
   [junit4]   2> 3208082 INFO  (TEST-TriggerIntegrationTest.testEventQueue-seed#[9DEEC13A1BEDB426]) [    ] o.a.s.c.CorePropertiesLocator Found 0 core definitions underneath C:\Users\jenkins\workspace\Lucene-Solr-7.x-Windows\solr\build\solr-core\test\J1\temp\solr.cloud.autoscaling.TriggerIntegrationTest_9DEEC13A1BEDB426-001\tempDir-001\node4\.
   [junit4]   2> 3208329 DEBUG (ScheduledTrigger-13468-thread-2) [    ] o.a.s.c.a.NodeLostTrigger Running NodeLostTrigger: .auto_add_replicas with currently live nodes: 3
   [junit4]   2> 3208754 DEBUG (ScheduledTrigger-13468-thread-1) [    ] o.a.s.c.a.NodeAddedTrigger Running NodeAddedTrigger node_added_triggerEQ
   [junit4]   2> 3208754 DEBUG (ScheduledTrigger-13468-thread-1) [    ] o.a.s.c.a.NodeAddedTrigger Found livenodes: 3
   [junit4]   2> 3208754 DEBUG (ScheduledTrigger-13468-thread-1) [    ] o.a.s.c.a.NodeAddedTrigger Tracking new node: 127.0.0.1:64975_solr at time 219204468195600
   [junit4]   2> 3209291 DEBUG (ScheduledTrigger-13468-thread-3) [    ] o.a.s.c.a.NodeLostTrigger Running NodeLostTrigger: .auto_add_replicas with currently live nodes: 3
   [junit4]   2> 3209698 INFO  (OverseerCollectionConfigSetProcessor-72071959363387399-127.0.0.1:64913_solr-n_0000000001) [n:127.0.0.1:64913_solr    ] o.a.s.c.OverseerTaskQueue Response ZK path: /overseer/collection-queue-work/qnr-0000000002 doesn't exist.  Requestor may have disconnected from ZooKeeper
   [junit4]   2> 3209716 DEBUG (ScheduledTrigger-13468-thread-2) [    ] o.a.s.c.a.NodeAddedTrigger Running NodeAddedTrigger node_added_triggerEQ
   [junit4]   2> 3209716 DEBUG (ScheduledTrigger-13468-thread-2) [    ] o.a.s.c.a.NodeAddedTrigger Found livenodes: 3
   [junit4]   2> 3209716 DEBUG (ScheduledTrigger-13468-thread-2) [    ] o.a.s.c.a.NodeAddedTrigger NodeAddedTrigger node_added_triggerEQ firing registered processor for nodes: [127.0.0.1:64975_solr] added at times [219204468195600], now=219205469744200
   [junit4]   2> 3209716 DEBUG (ScheduledTrigger-13468-thread-2) [    ] o.a.s.c.a.ScheduledTriggers ++++++++ Cooldown inactive - processing event: {
   [junit4]   2>   "id":"c75d8475c110Taf46cb68f1tjadhzpak9nodmi",
   [junit4]   2>   "source":"node_added_triggerEQ",
   [junit4]   2>   "eventTime":219204468195600,
   [junit4]   2>   "eventType":"NODEADDED",
   [junit4]   2>   "properties":{
   [junit4]   2>     "eventTimes":[219204468195600],
   [junit4]   2>     "preferredOperation":"movereplica",
   [junit4]   2>     "nodeNames":["127.0.0.1:64975_solr"]}}
   [junit4]   2> 3209716 DEBUG (ScheduledTrigger-13468-thread-2) [    ] o.a.s.c.a.ScheduledTriggers Pausing all triggers: [.auto_add_replicas, .scheduled_maintenance, node_added_triggerEQ]
   [junit4]   2> 3209717 INFO  (ScheduledTrigger-13468-thread-2) [    ] o.a.s.c.a.SystemLogListener Collection .system does not exist, disabling logging.
   [junit4]   2> 3209717 DEBUG (ScheduledTrigger-13468-thread-2) [    ] o.a.s.c.a.NodeAddedTrigger NodeAddedTrigger node_added_triggerEQ - removing marker path: /autoscaling/nodeAdded/127.0.0.1:64975_solr
   [junit4]   2> 3209717 DEBUG (AutoscalingActionExecutor-13469-thread-1) [    ] o.a.s.c.a.ScheduledTriggers -- processing actions for {
   [junit4]   2>   "id":"c75d8475c110Taf46cb68f1tjadhzpak9nodmi",
   [junit4]   2>   "source":"node_added_triggerEQ",
   [junit4]   2>   "eventTime":219204468195600,
   [junit4]   2>   "eventType":"NODEADDED",
   [junit4]   2>   "properties":{
   [junit4]   2>     "eventTimes":[219204468195600],
   [junit4]   2>     "preferredOperation":"movereplica",
   [junit4]   2>     "_enqueue_time_":219205470281300,
   [junit4]   2>     "nodeNames":["127.0.0.1:64975_solr"]}}
   [junit4]   2> 3209717 INFO  (AutoscalingActionExecutor-13469-thread-1) [    ] o.a.s.c.a.TriggerIntegrationTest -- event: {
   [junit4]   2>   "id":"c75d8475c110Taf46cb68f1tjadhzpak9nodmi",
   [junit4]   2>   "source":"node_added_triggerEQ",
   [junit4]   2>   "eventTime":219204468195600,
   [junit4]   2>   "eventType":"NODEADDED",
   [junit4]   2>   "properties":{
   [junit4]   2>     "eventTimes":[219204468195600],
   [junit4]   2>     "preferredOperation":"movereplica",
   [junit4]   2>     "_enqueue_time_":219205470281300,
   [junit4]   2>     "nodeNames":["127.0.0.1:64975_solr"]}}
   [junit4]   2> 3209717 INFO  (AutoscalingActionExecutor-13469-thread-1) [    ] o.a.s.c.a.TriggerIntegrationTest -- Going to sleep for 5000 ms
   [junit4]   2> 3209719 INFO  (TEST-TriggerIntegrationTest.testEventQueue-seed#[9DEEC13A1BEDB426]) [    ] o.e.j.s.AbstractConnector Stopped ServerConnector@6a4dc737{HTTP/1.1,[http/1.1]}{127.0.0.1:0}
   [junit4]   2> 3209719 INFO  (TEST-TriggerIntegrationTest.testEventQueue-seed#[9DEEC13A1BEDB426]) [    ] o.a.s.c.CoreContainer Shutting down CoreContainer instance=232502728
   [junit4]   2> 3209720 INFO  (TEST-TriggerIntegrationTest.testEventQueue-seed#[9DEEC13A1BEDB426]) [    ] o.a.s.m.SolrMetricManager Closing metric reporters for registry=solr.node, tag=null
   [junit4]   2> 3209720 INFO  (TEST-TriggerIntegrationTest.testEventQueue-seed#[9DEEC13A1BEDB426]) [    ] o.a.s.m.r.SolrJmxReporter Closing reporter [org.apache.solr.metrics.reporters.SolrJmxReporter@270992bd: rootName = solr_64913, domain = solr.node, service url = null, agent id = null] for registry solr.node / com.codahale.metrics.MetricRegistry@4dc1eddb
   [junit4]   2> 3209723 INFO  (TEST-TriggerIntegrationTest.testEventQueue-seed#[9DEEC13A1BEDB426]) [    ] o.a.s.m.SolrMetricManager Closing metric reporters for registry=solr.jvm, tag=null
   [junit4]   2> 3209723 INFO  (TEST-TriggerIntegrationTest.testEventQueue-seed#[9DEEC13A1BEDB426]) [    ] o.a.s.m.r.SolrJmxReporter Closing reporter [org.apache.solr.metrics.reporters.SolrJmxReporter@58121c0c: rootName = solr_64913, domain = solr.jvm, service url = null, agent id = null] for registry solr.jvm / com.codahale.metrics.MetricRegistry@60eb32b9
   [junit4]   2> 3209726 INFO  (TEST-TriggerIntegrationTest.testEventQueue-seed#[9DEEC13A1BEDB426]) [    ] o.a.s.m.SolrMetricManager Closing metric reporters for registry=solr.jetty, tag=null
   [junit4]   2> 3209726 INFO  (TEST-TriggerIntegrationTest.testEventQueue-seed#[9DEEC13A1BEDB426]) [    ] o.a.s.m.r.SolrJmxReporter Closing reporter [org.apache.solr.metrics.reporters.SolrJmxReporter@17e9cff0: rootName = solr_64913, domain = solr.jetty, service url = null, agent id = null] for registry solr.jetty / com.codahale.metrics.MetricRegistry@5bc9d45f
   [junit4]   2> 3209728 INFO  (TEST-TriggerIntegrationTest.testEventQueue-seed#[9DEEC13A1BEDB426]) [    ] o.a.s.c.ZkController Remove node as live in ZooKeeper:/live_nodes/127.0.0.1:64913_solr
   [junit4]   2> 3209728 INFO  (TEST-TriggerIntegrationTest.testEventQueue-seed#[9DEEC13A1BEDB426]) [    ] o.a.s.m.SolrMetricManager Closing metric reporters for registry=solr.cluster, tag=null
   [junit4]   2> 3209729 INFO  (zkCallback-11089-thread-1) [    ] o.a.s.c.c.ZkStateReader Updated live nodes from ZooKeeper... (3) -> (2)
   [junit4]   2> 3209729 INFO  (zkCallback-11070-thread-2) [    ] o.a.s.c.c.ZkStateReader Updated live nodes from ZooKeeper... (3) -> (2)
   [junit4]   2> 3209729 INFO  (zkCallback-11062-thread-1) [    ] o.a.s.c.c.ZkStateReader Updated live nodes from ZooKeeper... (3) -> (2)
   [junit4]   2> 3209729 INFO  (zkCallback-11098-thread-1) [    ] o.a.s.c.c.ZkStateReader Updated live nodes from ZooKeeper... (3) -> (2)
   [junit4]   2> 3209729 INFO  (TEST-TriggerIntegrationTest.testEventQueue-seed#[9DEEC13A1BEDB426]) [    ] o.a.s.c.Overseer Overseer (id=72071959363387399-127.0.0.1:64913_solr-n_0000000001) closing
   [junit4]   2> 3209729 INFO  (zkCallback-11055-thread-1) [    ] o.a.s.c.c.ZkStateReader Updated live nodes from ZooKeeper... (3) -> (2)
   [junit4]   2> 3209730 INFO  (zkCallback-11082-thread-1) [    ] o.a.s.c.c.ZkStateReader Updated live nodes from ZooKeeper... (3) -> (2)
   [junit4]   2> 3209730 INFO  (zkCallback-11070-thread-1) [    ] o.a.s.c.c.ZkStateReader Updated live nodes from ZooKeeper... (3) -> (2)
   [junit4]   2> 3209730 INFO  (zkCallback-11105-thread-1) [    ] o.a.s.c.c.ZkStateReader Updated live nodes from ZooKeeper... (3) -> (2)
   [junit4]   2> 3209731 INFO  (OverseerStateUpdate-72071959363387399-127.0.0.1:64913_solr-n_0000000001) [n:127.0.0.1:64913_solr    ] o.a.s.c.Overseer Overseer Loop exiting : 127.0.0.1:64913_solr
   [junit4]   2> 3209731 DEBUG (TEST-TriggerIntegrationTest.testEventQueue-seed#[9DEEC13A1BEDB426]) [    ] o.a.s.c.a.ScheduledTriggers Shutting down scheduled thread pool executor now
   [junit4]   2> 3209731 DEBUG (TEST-TriggerIntegrationTest.testEventQueue-seed#[9DEEC13A1BEDB426]) [    ] o.a.s.c.a.ScheduledTriggers Shutting down action executor now
   [junit4]   2> 3209731 WARN  (OverseerAutoScalingTriggerThread-72071959363387399-127.0.0.1:64913_solr-n_0000000001) [    ] o.a.s.c.a.OverseerTriggerThread OverseerTriggerThread woken up but we are closed, exiting.
   [junit4]   2> 3209731 DEBUG (TEST-TriggerIntegrationTest.testEventQueue-seed#[9DEEC13A1BEDB426]) [    ] o.a.s.c.a.ScheduledTriggers Awaiting termination for action executor
   [junit4]   2> 3209731 INFO  (AutoscalingActionExecutor-13469-thread-1) [    ] o.a.s.c.a.TriggerIntegrationTest -- Interrupted
   [junit4]   2> 3209732 WARN  (AutoscalingActionExecutor-13469-thread-1) [    ] o.a.s.c.a.ScheduledTriggers Unhandled exception executing actions
   [junit4]   2> org.apache.lucene.store.AlreadyClosedException: ScheduledTrigger node_added_triggerEQ has been closed.
   [junit4]   2> 	at org.apache.solr.cloud.autoscaling.ScheduledTriggers$TriggerWrapper.dequeue(ScheduledTriggers.java:549) ~[java/:?]
   [junit4]   2> 	at org.apache.solr.cloud.autoscaling.ScheduledTriggers.lambda$null$3(ScheduledTriggers.java:319) ~[java/:?]
   [junit4]   2> 	at java.util.concurrent.Executors$RunnableAdapter.call(Executors.java:511) ~[?:1.8.0_172]
   [junit4]   2> 	at java.util.concurrent.FutureTask.run(FutureTask.java:266) ~[?:1.8.0_172]
   [junit4]   2> 	at org.apache.solr.common.util.ExecutorUtil$MDCAwareThreadPoolExecutor.lambda$execute$0(ExecutorUtil.java:209) ~[java/:?]
   [junit4]   2> 	at java.util.concurrent.ThreadPoolExecutor.runWorker(ThreadPoolExecutor.java:1149) [?:1.8.0_172]
   [junit4]   2> 	at java.util.concurrent.ThreadPoolExecutor$Worker.run(ThreadPoolExecutor.java:624) [?:1.8.0_172]
   [junit4]   2> 	at java.lang.Thread.run(Thread.java:748) [?:1.8.0_172]
   [junit4]   2> 3209732 DEBUG (AutoscalingActionExecutor-13469-thread-1) [    ] o.a.s.c.a.ScheduledTriggers -- processing took 15 ms for event id=c75d8475c110Taf46cb68f1tjadhzpak9nodmi
   [junit4]   2> 3209732 DEBUG (TEST-TriggerIntegrationTest.testEventQueue-seed#[9DEEC13A1BEDB426]) [    ] o.a.s.c.a.ScheduledTriggers Awaiting termination for scheduled thread pool executor
   [junit4]   2> 3209732 DEBUG (TEST-TriggerIntegrationTest.testEventQueue-seed#[9DEEC13A1BEDB426]) [    ] o.a.s.c.a.ScheduledTriggers ScheduledTriggers closed completely
   [junit4]   2> 3209732 DEBUG (TEST-TriggerIntegrationTest.testEventQueue-seed#[9DEEC13A1BEDB426]) [    ] o.a.s.c.a.OverseerTriggerThread OverseerTriggerThread has been closed explicitly
   [junit4]   2> 3209733 WARN  (NIOServerCxn.Factory:0.0.0.0/0.0.0.0:0) [    ] o.a.z.s.NIOServerCnxn Unable to read additional data from client sessionid 0x1000d10b01f0007, likely client has closed socket
   [junit4]   2> 3209734 INFO  (TEST-TriggerIntegrationTest.testEventQueue-seed#[9DEEC13A1BEDB426]) [    ] o.e.j.s.h.ContextHandler Stopped o.e.j.s.ServletContextHandler@338d7b73{/solr,null,UNAVAILABLE}
   [junit4]   2> 3209734 INFO  (zkCallback-11082-thread-1) [    ] o.a.s.c.OverseerElectionContext I am going to be the leader 127.0.0.1:64957_solr
   [junit4]   2> 3209734 INFO  (TEST-TriggerIntegrationTest.testEventQueue-seed#[9DEEC13A1BEDB426]) [    ] o.e.j.s.session node0 Stopped scavenging
   [junit4]   2> 3209736 INFO  (zkCallback-11082-thread-1) [n:127.0.0.1:64957_solr    ] o.a.s.c.Overseer Overseer (id=72071959363387406-127.0.0.1:64957_solr-n_0000000002) starting
   [junit4]   2> 3209741 INFO  (OverseerStateUpdate-72071959363387406-127.0.0.1:64957_solr-n_0000000002) [n:127.0.0.1:64957_solr    ] o.a.s.c.Overseer Starting to work on the main queue : 127.0.0.1:64957_solr
   [junit4]   2> 3209741 DEBUG (OverseerAutoScalingTriggerThread-72071959363387406-127.0.0.1:64957_solr-n_0000000002) [    ] o.a.s.c.a.OverseerTriggerThread Refreshing /autoscaling.json with znode version 5
   [junit4]   2> 3209741 INFO  (OverseerAutoScalingTriggerThread-72071959363387406-127.0.0.1:64957_solr-n_0000000002) [    ] o.a.s.c.a.TriggerIntegrationTest TestEventQueueAction instantiated
   [junit4]   2> 3209741 DEBUG (OverseerAutoScalingTriggerThread-72071959363387406-127.0.0.1:64957_solr-n_0000000002) [    ] o.a.s.c.a.OverseerTriggerThread Current znodeVersion 5, lastZnodeVersion -1
   [junit4]   2> 3209741 DEBUG (OverseerAutoScalingTriggerThread-72071959363387406-127.0.0.1:64957_solr-n_0000000002) [    ] o.a.s.c.a.OverseerTriggerThread Processed trigger updates upto znodeVersion 5
   [junit4]   2> 3209742 INFO  (OverseerAutoScalingTriggerThread-72071959363387406-127.0.0.1:64957_solr-n_0000000002) [    ] o.a.s.c.a.TriggerIntegrationTest TestEventQueueAction init
   [junit4]   2> 3209742 DEBUG (OverseerAutoScalingTriggerThread-72071959363387406-127.0.0.1:64957_solr-n_0000000002) [    ] o.a.s.c.a.NodeAddedTrigger NodeAddedTrigger node_added_triggerEQ - Initial livenodes: [127.0.0.1:64975_solr, 127.0.0.1:64957_solr]
   [junit4]   2> 3209742 DEBUG (OverseerAutoScalingTriggerThread-72071959363387406-127.0.0.1:64957_solr-n_0000000002) [    ] o.a.s.c.a.NodeAddedTrigger NodeAddedTrigger node_added_triggerEQ instantiated with properties: {event=nodeAdded, waitFor=1, actions=[{name=test, class=org.apache.solr.cloud.autoscaling.TriggerIntegrationTest$TestEventQueueAction}], enabled=true}
   [junit4]   2> 3209743 DEBUG (OverseerAutoScalingTriggerThread-72071959363387406-127.0.0.1:64957_solr-n_0000000002) [    ] o.a.s.c.a.NodeLostTrigger NodeLostTrigger .auto_add_replicas - Initial livenodes: [127.0.0.1:64975_solr, 127.0.0.1:64957_solr]
   [junit4]   2> 3209744 DEBUG (OverseerAutoScalingTriggerThread-72071959363387406-127.0.0.1:64957_solr-n_0000000002) [    ] o.a.s.c.a.NodeLostTrigger Adding lost node from marker path: 127.0.0.1:64913_solr
   [junit4]   2> 3209744 DEBUG (ScheduledTrigger-13491-thread-2) [    ] o.a.s.c.a.ScheduledTriggers ++++++++ Cooldown inactive - processing event: {
   [junit4]   2>   "id":"c75d8475c110Taf46cb68f1tjadhzpak9nodmi",
   [junit4]   2>   "source":"node_added_triggerEQ",
   [junit4]   2>   "eventTime":219204468195600,
   [junit4]   2>   "eventType":"NODEADDED",
   [junit4]   2>   "properties":{
   [junit4]   2>     "eventTimes":[219204468195600],
   [junit4]   2>     "_dequeue_time_":219205498503600,
   [junit4]   2>     "preferredOperation":"movereplica",
   [junit4]   2>     "_enqueue_time_":219205470281300,
   [junit4]   2>     "nodeNames":["127.0.0.1:64975_solr"],
   [junit4]   2>     "replaying":true}}
   [junit4]   2> 3209745 DEBUG (OverseerAutoScalingTriggerThread-72071959363387406-127.0.0.1:64957_solr-n_0000000002) [    ] o.a.s.c.a.OverseerTriggerThread Current znodeVersion 5, lastZnodeVersion 5
   [junit4]   2> 3209745 DEBUG (ScheduledTrigger-13491-thread-2) [    ] o.a.s.c.a.ScheduledTriggers Pausing all triggers: [.auto_add_replicas, .scheduled_maintenance, node_added_triggerEQ]
   [junit4]   2> 3209745 INFO  (ScheduledTrigger-13491-thread-2) [    ] o.a.s.c.a.SystemLogListener Collection .system does not exist, disabling logging.
   [junit4]   2> 3209745 DEBUG (AutoscalingActionExecutor-13492-thread-1) [    ] o.a.s.c.a.ScheduledTriggers -- processing actions for {
   [junit4]   2>   "id":"c75d8475c110Taf46cb68f1tjadhzpak9nodmi",
   [junit4]   2>   "source":"node_added_triggerEQ",
   [junit4]   2>   "eventTime":219204468195600,
   [junit4]   2>   "eventType":"NODEADDED",
   [junit4]   2>   "properties":{
   [junit4]   2>     "eventTimes":[219204468195600],
   [junit4]   2>     "_dequeue_time_":219205498503600,
   [junit4]   2>     "preferredOperation":"movereplica",
   [junit4]   2>     "_enqueue_time_":219205470281300,
   [junit4]   2>     "nodeNames":["127.0.0.1:64975_solr"],
   [junit4]   2>     "replaying":true}}
   [junit4]   2> 3209745 INFO  (AutoscalingActionExecutor-13492-thread-1) [    ] o.a.s.c.a.TriggerIntegrationTest -- event: {
   [junit4]   2>   "id":"c75d8475c110Taf46cb68f1tjadhzpak9nodmi",
   [junit4]   2>   "source":"node_added_triggerEQ",
   [junit4]   2>   "eventTime":219204468195600,
   [junit4]   2>   "eventType":"NODEADDED",
   [junit4]   2>   "properties":{
   [junit4]   2>     "eventTimes":[219204468195600],
   [junit4]   2>     "_dequeue_time_":219205498503600,
   [junit4]   2>     "preferredOperation":"movereplica",
   [junit4]   2>     "_enqueue_time_":219205470281300,
   [junit4]   2>     "nodeNames":["127.0.0.1:64975_solr"],
   [junit4]   2>     "replaying":true}}
   [junit4]   2> 3209745 INFO  (AutoscalingActionExecutor-13492-thread-1) [    ] o.a.s.c.a.TriggerIntegrationTest -- Going to sleep for 1 ms
   [junit4]   2> 3209746 DEBUG (ScheduledTrigger-13491-thread-2) [    ] o.a.s.c.a.NodeAddedTrigger Running NodeAddedTrigger node_added_triggerEQ
   [junit4]   2> 3209746 DEBUG (ScheduledTrigger-13491-thread-2) [    ] o.a.s.c.a.NodeAddedTrigger Found livenodes: 2
   [junit4]   2> 3209747 INFO  (AutoscalingActionExecutor-13492-thread-1) [    ] o.a.s.c.a.TriggerIntegrationTest -- Woke up after sleeping for 1 ms
   [junit4]   2> 3209747 DEBUG (AutoscalingActionExecutor-13492-thread-1) [    ] o.a.s.c.a.ScheduledTriggers Resuming trigger: .auto_add_replicas after 5000ms
   [junit4]   2> 3209747 DEBUG (AutoscalingActionExecutor-13492-thread-1) [    ] o.a.s.c.a.ScheduledTriggers Resuming trigger: .scheduled_maintenance after 5000ms
   [junit4]   2> 3209747 DEBUG (AutoscalingActionExecutor-13492-thread-1) [    ] o.a.s.c.a.ScheduledTriggers Resuming trigger: node_added_triggerEQ after 5000ms
   [junit4]   2> 3209747 DEBUG (AutoscalingActionExecutor-13492-thread-1) [    ] o.a.s.c.a.ScheduledTriggers -- processing took 1 ms for event id=c75d8475c110Taf46cb68f1tjadhzpak9nodmi
   [junit4]   2> 3214111 INFO  (TEST-TriggerIntegrationTest.testEventQueue-seed#[9DEEC13A1BEDB426]) [    ] o.a.s.SolrTestCaseJ4 ###Ending testEventQueue
   [junit4]   2> 3214121 DEBUG (ScheduledTrigger-13491-thread-4) [    ] o.a.s.c.a.NodeAddedTrigger Running NodeAddedTrigger node_added_triggerEQ
   [junit4]   2> 3214121 DEBUG (ScheduledTrigger-13491-thread-4) [    ] o.a.s.c.a.NodeAddedTrigger Found livenodes: 2
   [junit4]   2> 3214124 DEBUG (ScheduledTrigger-13491-thread-1) [    ] o.a.s.c.a.NodeLostTrigger Running NodeLostTrigger: .auto_add_replicas with currently live nodes: 2
   [junit4]   2> 3214124 DEBUG (ScheduledTrigger-13491-thread-1) [    ] o.a.s.c.a.NodeLostTrigger Tracking lost node: 127.0.0.1:64913_solr
   [junit4]   2> 3214124 INFO  (TEST-TriggerIntegrationTest.testListeners-seed#[9DEEC13A1BEDB426]) [    ] o.a.s.SolrTestCaseJ4 ###Starting testListeners
   [junit4]   2> 3214126 INFO  (zkConnectionManagerCallback-11109-thread-1) [    ] o.a.s.c.c.ConnectionManager zkClient has connected
   [junit4]   2> 3214129 INFO  (qtp440435584-35015) [n:127.0.0.1:64957_solr    ] o.a.s.h.a.CollectionsHandler Invoked Collection Action :overseerstatus with params action=OVERSEERSTATUS&wt=javabin&version=2 and sendToOCPQueue=true
   [junit4]   2> 3214133 INFO  (qtp440435584-35015) [n:127.0.0.1:64957_solr    ] o.a.s.s.HttpSolrCall [admin] webapp=null path=/admin/collections params={action=OVERSEERSTATUS&wt=javabin&version=2} status=0 QTime=4
   [junit4]   2> 3214133 INFO  (TEST-TriggerIntegrationTest.testListeners-seed#[9DEEC13A1BEDB426]) [    ] o.a.s.c.a.ScheduledTriggers -- removing trigger: .auto_add_replicas
   [junit4]   2> 3214134 INFO  (TEST-TriggerIntegrationTest.testListeners-seed#[9DEEC13A1BEDB426]) [    ] o.a.s.c.a.ScheduledTriggers -- removing trigger: .scheduled_maintenance
   [junit4]   2> 3214135 INFO  (TEST-TriggerIntegrationTest.testListeners-seed#[9DEEC13A1BEDB426]) [    ] o.a.s.c.a.ScheduledTriggers -- removing trigger: node_added_triggerEQ
   [junit4]   2> 3214136 INFO  (TEST-TriggerIntegrationTest.testListeners-seed#[9DEEC13A1BEDB426]) [    ] o.a.s.c.a.TriggerIntegrationTest /autoscaling.json reset, new znode version 6
   [junit4]   2> 3214136 DEBUG (zkCallback-11089-thread-1) [    ] o.a.s.c.a.OverseerTriggerThread Refreshing /autoscaling.json with znode version 6
   [junit4]   2> 3214136 DEBUG (OverseerAutoScalingTriggerThread-72071959363387406-127.0.0.1:64957_solr-n_0000000002) [    ] o.a.s.c.a.OverseerTriggerThread Processed trigger updates upto znodeVersion 6
   [junit4]   2> 3214136 DEBUG (OverseerAutoScalingTriggerThread-72071959363387406-127.0.0.1:64957_solr-n_0000000002) [    ] o.a.s.c.a.OverseerTriggerThread -- clean old nodeLost markers
   [junit4]   2> 3214137 DEBUG (OverseerAutoScalingTriggerThread-72071959363387406-127.0.0.1:64957_solr-n_0000000002) [    ] o.a.s.c.a.OverseerTriggerThread -- clean old nodeAdded markers
   [junit4]   2> 3214137 DEBUG (OverseerAutoScalingTriggerThread-72071959363387406-127.0.0.1:64957_solr-n_0000000002) [    ] o.a.s.c.a.OverseerTriggerThread Current znodeVersion 6, lastZnodeVersion 6
   [junit4]   2> 3214137 INFO  (TEST-TriggerIntegrationTest.testListeners-seed#[9DEEC13A1BEDB426]) [    ] o.a.s.c.c.ZkStateReader Updated live nodes from ZooKeeper... (0) -> (2)
   [junit4]   2> 3214139 INFO  (TEST-TriggerIntegrationTest.testListeners-seed#[9DEEC13A1BEDB426]) [    ] o.e.j.s.AbstractConnector Stopped ServerConnector@20bd523d{HTTP/1.1,[http/1.1]}{127.0.0.1:0}
   [junit4]   2> 3214139 INFO  (TEST-TriggerIntegrationTest.testListeners-seed#[9DEEC13A1BEDB426]) [    ] o.a.s.c.CoreContainer Shutting down CoreContainer instance=677796548
   [junit4]   2> 3214139 INFO  (TEST-TriggerIntegrationTest.testListeners-seed#[9DEEC13A1BEDB426]) [    ] o.a.s.m.SolrMetricManager Closing metric reporters for registry=solr.node, tag=null
   [junit4]   2> 3214139 INFO  (TEST-TriggerIntegrationTest.testListeners-seed#[9DEEC13A1BEDB426]) [    ] o.a.s.m.r.SolrJmxReporter Closing reporter [org.apache.solr.metrics.reporters.SolrJmxReporter@16694819: rootName = solr_64957, domain = solr.node, service url = null, agent id = null] for registry solr.node / com.codahale.metrics.MetricRegistry@1d8edc61
   [junit4]   2> 3214143 INFO  (TEST-TriggerIntegrationTest.testListeners-seed#[9DEEC13A1BEDB426]) [    ] o.a.s.m.SolrMetricManager Closing metric reporters for registry=solr.jvm, tag=null
   [junit4]   2> 3214143 INFO  (TEST-TriggerIntegrationTest.testListeners-seed#[9DEEC13A1BEDB426]) [    ] o.a.s.m.r.SolrJmxReporter Closing reporter [org.apache.solr.metrics.reporters.SolrJmxReporter@3a1e6c0b: rootName = solr_64957, domain = solr.jvm, service url = null, agent id = null] for registry solr.jvm / com.codahale.metrics.MetricRegistry@60eb32b9
   [junit4]   2> 3214146 INFO  (TEST-TriggerIntegrationTest.testListeners-seed#[9DEEC13A1BEDB426]) [    ] o.a.s.m.SolrMetricManager Closing metric reporters for registry=solr.jetty, tag=null
   [junit4]   2> 3214146 INFO  (TEST-TriggerIntegrationTest.testListeners-seed#[9DEEC13A1BEDB426]) [    ] o.a.s.m.r.SolrJmxReporter Closing reporter [org.apache.solr.metrics.reporters.SolrJmxReporter@69ea40b9: rootName = solr_64957, domain = solr.jetty, service url = null, agent id = null] for registry solr.jetty / com.codahale.metrics.MetricRegistry@5bc9d45f
   [junit4]   2> 3214147 INFO  (TEST-TriggerIntegrationTest.testListeners-seed#[9DEEC13A1BEDB426]) [    ] o.a.s.c.ZkController Remove node as live in ZooKeeper:/live_nodes/127.0.0.1:64957_solr
   [junit4]   2> 3214147 INFO  (TEST-TriggerIntegrationTest.testListeners-seed#[9DEEC13A1BEDB426]) [    ] o.a.s.m.SolrMetricManager Closing metric reporters for registry=solr.cluster, tag=null
   [junit4]   2> 3214147 INFO  (TEST-TriggerIntegrationTest.testListeners-seed#[9DEEC13A1BEDB426]) [    ] o.a.s.c.Overseer Overseer (id=72071959363387406-127.0.0.1:64957_solr-n_0000000002) closing
   [junit4]   2> 3214147 INFO  (zkCallback-11089-thread-1) [    ] o.a.s.c.c.ZkStateReader Updated live nodes from ZooKeeper... (2) -> (1)
   [junit4]   2> 3214147 INFO  (OverseerStateUpdate-72071959363387406-127.0.0.1:64957_solr-n_0000000002) [n:127.0.0.1:64957_solr    ] o.a.s.c.Overseer Overseer Loop exiting : 127.0.0.1:64957_solr
   [junit4]   2> 3214147 INFO  (zkCallback-11105-thread-1) [    ] o.a.s.c.c.ZkStateReader Updated live nodes from ZooKeeper... (2) -> (1)
   [junit4]   2> 3214148 DEBUG (TEST-TriggerIntegrationTest.testListeners-seed#[9DEEC13A1BEDB426]) [    ] o.a.s.c.a.ScheduledTriggers Shutting down scheduled thread pool executor now
   [junit4]   2> 3214148 DEBUG (TEST-TriggerIntegrationTest.testListeners-seed#[9DEEC13A1BEDB426]) [    ] o.a.s.c.a.ScheduledTriggers Shutting down action executor now
   [junit4]   2> 3214148 DEBUG (TEST-TriggerIntegrationTest.testListeners-seed#[9DEEC13A1BEDB426]) [    ] o.a.s.c.a.ScheduledTriggers Awaiting termination for action executor
   [junit4]   2> 3214148 WARN  (OverseerAutoScalingTriggerThread-72071959363387406-127.0.0.1:64957_solr-n_0000000002) [    ] o.a.s.c.a.OverseerTriggerThread OverseerTriggerThread woken up but we are closed, exiting.
   [junit4]   2> 3214148 DEBUG (TEST-TriggerIntegrationTest.testListeners-seed#[9DEEC13A1BEDB426]) [    ] o.a.s.c.a.ScheduledTriggers Awaiting termination for scheduled thread pool executor
   [junit4]   2> 3214148 INFO  (zkCallback-11070-thread-3) [    ] o.a.s.c.c.ZkStateReader Updated live nodes from ZooKeeper... (2) -> (1)
   [junit4]   2> 3214148 DEBUG (TEST-TriggerIntegrationTest.testListeners-seed#[9DEEC13A1BEDB426]) [    ] o.a.s.c.a.ScheduledTriggers ScheduledTriggers closed completely
   [junit4]   2> 3214148 DEBUG (TEST-TriggerIntegrationTest.testListeners-seed#[9DEEC13A1BEDB426]) [    ] o.a.s.c.a.OverseerTriggerThread OverseerTriggerThread has been closed explicitly
   [junit4]   2> 3214148 INFO  (zkCallback-11070-thread-2) [    ] o.a.s.c.c.ZkStateReader Updated live nodes from ZooKeeper... (2) -> (1)
   [junit4]   2> 3214149 INFO  (zkCallback-11098-thread-1) [    ] o.a.s.c.c.ZkStateReader Updated live nodes from ZooKeeper... (2) -> (1)
   [junit4]   2> 3214149 INFO  (zkCallback-11070-thread-1) [    ] o.a.s.c.c.ZkStateReader Updated live nodes from ZooKeeper... (2) -> (1)
   [junit4]   2> 3214149 INFO  (zkCallback-11082-thread-1) [    ] o.a.s.c.c.ZkStateReader Updated live nodes from ZooKeeper... (2) -> (1)
   [junit4]   2> 3214149 WARN  (NIOServerCxn.Factory:0.0.0.0/0.0.0.0:0) [    ] o.a.z.s.NIOServerCnxn Unable to read additional data from client sessionid 0x1000d10b01f000e, likely client has closed socket
   [junit4]   2> 3214149 INFO  (TEST-TriggerIntegrationTest.testListeners-seed#[9DEEC13A1BEDB426]) [    ] o.e.j.s.h.ContextHandler Stopped o.e.j.s.ServletContextHandler@351c0299{/solr,null,UNAVAILABLE}
   [junit4]   2> 3214149 INFO  (zkCallback-11098-thread-1) [    ] o.a.s.c.OverseerElectionContext I am going to be the leader 127.0.0.1:64975_solr
   [junit4]   2> 3214149 INFO  (TEST-TriggerIntegrationTest.testListeners-seed#[9DEEC13A1BEDB426]) [    ] o.e.j.s.session node0 Stopped scavenging
   [junit4]   2> 3214152 INFO  (zkCallback-11098-thread-1) [n:127.0.0.1:64975_solr    ] o.a.s.c.Overseer Overseer (id=72071959363387410-127.0.0.1:64975_solr-n_0000000003) starting
   [junit4]   2> 3214155 INFO  (OverseerStateUpdate-72071959363387410-127.0.0.1:64975_solr-n_0000000003) [n:127.0.0.1:64975_solr    ] o.a.s.c.Overseer Starting to work on the main queue : 127.0.0.1:64975_solr
   [junit4]   2> 3214155 DEBUG (OverseerAutoScalingTriggerThread-72071959363387410-127.0.0.1:64975_solr-n_0000000003) [    ] o.a.s.c.a.OverseerTriggerThread Adding .auto_add_replicas and .scheduled_maintenance triggers
   [junit4]   2> 3214156 DEBUG (OverseerAutoScalingTriggerThread-72071959363387410-127.0.0.1:64975_solr-n_0000000003) [    ] o.a.s.c.a.OverseerTriggerThread Refreshing /autoscaling.json with znode version 7
   [junit4]   2> 3214157 DEBUG (OverseerAutoScalingTriggerThread-72071959363387410-127.0.0.1:64975_solr-n_0000000003) [    ] o.a.s.c.a.OverseerTriggerThread Current znodeVersion 7, lastZnodeVersion -1
   [junit4]   2> 3214157 DEBUG (OverseerAutoScalingTriggerThread-72071959363387410-127.0.0.1:64975_solr-n_0000000003) [    ] o.a.s.c.a.OverseerTriggerThread Processed trigger updates upto znodeVersion 7
   [junit4]   2> 3214159 DEBUG (OverseerAutoScalingTriggerThread-72071959363387410-127.0.0.1:64975_solr-n_0000000003) [    ] o.a.s.c.a.NodeLostTrigger NodeLostTrigger .auto_add_replicas - Initial livenodes: [127.0.0.1:64975_solr]
   [junit4]   2> 3214160 DEBUG (OverseerAutoScalingTriggerThread-72071959363387410-127.0.0.1:64975_solr-n_0000000003) [    ] o.a.s.c.a.OverseerTriggerThread -- clean old nodeAdded markers
   [junit4]   2> 3214160 DEBUG (OverseerAutoScalingTriggerThread-72071959363387410-127.0.0.1:64975_solr-n_0000000003) [    ] o.a.s.c.a.OverseerTriggerThread Current znodeVersion 7, lastZnodeVersion 7
   [junit4]   2> 3214160 DEBUG (ScheduledTrigger-13496-thread-1) [    ] o.a.s.c.a.NodeLostTrigger Running NodeLostTrigger: .auto_add_replicas with currently live nodes: 1
   [junit4]   2> 3215025 DEBUG (ScheduledTrigger-13496-thread-1) [    ] o.a.s.c.a.NodeLostTrigger Running NodeLostTrigger: .auto_add_replicas with currently live nodes: 1
   [junit4]   2> 3215890 DEBUG (ScheduledTrigger-13496-thread-4) [    ] o.a.s.c.a.NodeLostTrigger Running NodeLostTrigger: .auto_add_replicas with currently live nodes: 1
   [junit4]   2> 3216756 DEBUG (ScheduledTrigger-13496-thread-1) [    ] o.a.s.c.a.NodeLostTrigger Running NodeLostTrigger: .auto_add_replicas with currently live nodes: 1
   [junit4]   2> 3217622 DEBUG (ScheduledTrigger-13496-thread-4) [    ] o.a.s.c.a.NodeLostTrigger Running NodeLostTrigger: .auto_add_replicas with currently live nodes: 1
   [junit4]   2> 3218474 INFO  (TEST-TriggerIntegrationTest.testListeners-seed#[9DEEC13A1BEDB426]) [    ] o.e.j.s.Server jetty-9.4.11.v20180605; built: 2018-06-05T18:24:03.829Z; git: d5fc0523cfa96bfebfbda19606cad384d772f04c; jvm 1.8.0_172-b11
   [junit4]   2> 3218474 INFO  (TEST-TriggerIntegrationTest.testListeners-seed#[9DEEC13A1BEDB426]) [    ] o.e.j.s.session DefaultSessionIdManager workerName=node0
   [junit4]   2> 3218474 INFO  (TEST-TriggerIntegrationTest.testListeners-seed#[9DEEC13A1BEDB426]) [    ] o.e.j.s.session No SessionScavenger set, using defaults
   [junit4]   2> 3218474 INFO  (TEST-TriggerIntegrationTest.testListeners-seed#[9DEEC13A1BEDB426]) [    ] o.e.j.s.session node0 Scavenging every 660000ms
   [junit4]   2> 3218474 INFO  (TEST-TriggerIntegrationTest.testListeners-seed#[9DEEC13A1BEDB426]) [    ] o.e.j.s.h.ContextHandler Started o.e.j.s.ServletContextHandler@66eec239{/solr,null,AVAILABLE}
   [junit4]   2> 3218475 INFO  (TEST-TriggerIntegrationTest.testListeners-seed#[9DEEC13A1BEDB426]) [    ] o.e.j.s.AbstractConnector Started ServerConnector@cb30ef3{HTTP/1.1,[http/1.1]}{127.0.0.1:65035}
   [junit4]   2> 3218476 INFO  (TEST-TriggerIntegrationTest.testListeners-seed#[9DEEC13A1BEDB426]) [    ] o.e.j.s.Server Started @3186426ms
   [junit4]   2> 3218476 INFO  (TEST-TriggerIntegrationTest.testListeners-seed#[9DEEC13A1BEDB426]) [    ] o.a.s.c.s.e.JettySolrRunner Jetty properties: {hostContext=/solr, hostPort=65035}
   [junit4]   2> 3218476 ERROR (TEST-TriggerIntegrationTest.testListeners-seed#[9DEEC13A1BEDB426]) [    ] o.a.s.u.StartupLoggingUtils Missing Java Option solr.log.dir. Logging may be missing or incomplete.
   [junit4]   2> 3218476 INFO  (TEST-TriggerIntegrationTest.testListeners-seed#[9DEEC13A1BEDB426]) [    ] o.a.s.s.SolrDispatchFilter Using logger factory org.apache.logging.slf4j.Log4jLoggerFactory
   [junit4]   2> 3218476 INFO  (TEST-TriggerIntegrationTest.testListeners-seed#[9DEEC13A1BEDB426]) [    ] o.a.s.s.SolrDispatchFilter  ___      _       Welcome to Apache Solr? version 7.7.0
   [junit4]   2> 3218476 INFO  (TEST-TriggerIntegrationTest.testListeners-seed#[9DEEC13A1BEDB426]) [    ] o.a.s.s.SolrDispatchFilter / __| ___| |_ _   Starting in cloud mode on port null
   [junit4]   2> 3218476 INFO  (TEST-TriggerIntegrationTest.testListeners-seed#[9DEEC13A1BEDB426]) [    ] o.a.s.s.SolrDispatchFilter \__ \/ _ \ | '_|  Install dir: null
   [junit4]   2> 3218476 INFO  (TEST-TriggerIntegrationTest.testListeners-seed#[9DEEC13A1BEDB426]) [    ] o.a.s.s.SolrDispatchFilter |___/\___/_|_|    Start time: 2018-11-17T07:08:53.424Z
   [junit4]   2> 3218479 INFO  (zkConnectionManagerCallback-11113-thread-1) [    ] o.a.s.c.c.ConnectionManager zkClient has connected
   [junit4]   2> 3218480 INFO  (TEST-TriggerIntegrationTest.testListeners-seed#[9DEEC13A1BEDB426]) [    ] o.a.s.s.SolrDispatchFilter solr.xml found in ZooKeeper. Loading...
   [junit4]   2> 3218487 DEBUG (ScheduledTrigger-13496-thread-1) [    ] o.a.s.c.a.NodeLostTrigger Running NodeLostTrigger: .auto_add_replicas with currently live nodes: 1
   [junit4]   2> 3218887 INFO  (TEST-TriggerIntegrationTest.testListeners-seed#[9DEEC13A1BEDB426]) [    ] o.a.s.c.ZkContainer Zookeeper client=127.0.0.1:64908/solr
   [junit4]   2> 3218888 INFO  (zkConnectionManagerCallback-11117-thread-1) [    ] o.a.s.c.c.ConnectionManager zkClient has connected
   [junit4]   2> 3218890 INFO  (zkConnectionManagerCallback-11119-thread-1) [    ] o.a.s.c.c.ConnectionManager zkClient has connected
   [junit4]   2> 3218896 INFO  (TEST-TriggerIntegrationTest.testListeners-seed#[9DEEC13A1BEDB426]) [    ] o.a.s.c.c.ZkStateReader Updated live nodes from ZooKeeper... (0) -> (1)
   [junit4]   2> 3218900 INFO  (TEST-TriggerIntegrationTest.testListeners-seed#[9DEEC13A1BEDB426]) [    ] o.a.s.c.TransientSolrCoreCacheDefault Allocating transient cache for 2147483647 transient cores
   [junit4]   2> 3218900 INFO  (TEST-TriggerIntegrationTest.testListeners-seed#[9DEEC13A1BEDB426]) [    ] o.a.s.c.ZkController Register node as live in ZooKeeper:/live_nodes/127.0.0.1:65035_solr
   [junit4]   2> 3218901 INFO  (zkCallback-11105-thread-1) [    ] o.a.s.c.c.ZkStateReader Updated live nodes from ZooKeeper... (1) -> (2)
   [junit4]   2> 3218901 INFO  (zkCallback-11098-thread-1) [    ] o.a.s.c.c.ZkStateReader Updated live nodes from ZooKeeper... (1) -> (2)
   [junit4]   2> 3218901 INFO  (zkCallback-11070-thread-1) [    ] o.a.s.c.c.ZkStateReader Updated live nodes from ZooKeeper... (1) -> (2)
   [junit4]   2> 3218901 INFO  (zkCallback-11070-thread-2) [    ] o.a.s.c.c.ZkStateReader Updated live nodes from ZooKeeper... (1) -> (2)
   [junit4]   2> 3218901 INFO  (zkCallback-11070-thread-3) [    ] o.a.s.c.c.ZkStateReader Updated live nodes from ZooKeeper... (1) -> (2)
   [junit4]   2> 3218902 INFO  (zkCallback-11118-thread-1) [    ] o.a.s.c.c.ZkStateReader Updated live nodes from ZooKeeper... (1) -> (2)
   [junit4]   2> 3218955 INFO  (zkConnectionManagerCallback-11126-thread-1) [    ] o.a.s.c.c.ConnectionManager zkClient has connected
   [junit4]   2> 3218957 INFO  (TEST-TriggerIntegrationTest.testListeners-seed#[9DEEC13A1BEDB426]) [    ] o.a.s.c.c.ZkStateReader Updated live nodes from ZooKeeper... (0) -> (2)
   [junit4]   2> 3218957 INFO  (TEST-TriggerIntegrationTest.testListeners-seed#[9DEEC13A1BEDB426]) [    ] o.a.s.c.s.i.ZkClientClusterStateProvider Cluster at 127.0.0.1:64908/solr ready
   [junit4]   2> 3218958 INFO  (TEST-TriggerIntegrationTest.testListeners-seed#[9DEEC13A1BEDB426]) [    ] o.a.s.h.a.MetricsHistoryHandler No .system collection, keeping metrics history in memory.
   [junit4]   2> 3218985 INFO  (TEST-TriggerIntegrationTest.testListeners-seed#[9DEEC13A1BEDB426]) [    ] o.a.s.m.r.SolrJmxReporter JMX monitoring for 'solr_65035.solr.node' (registry 'solr.node') enabled at server: com.sun.jmx.mbeanserver.JmxMBeanServer@6ea14ee4
   [junit4]   2> 3218994 INFO  (TEST-TriggerIntegrationTest.testListeners-seed#[9DEEC13A1BEDB426]) [    ] o.a.s.m.r.SolrJmxReporter JMX monitoring for 'solr_65035.solr.jvm' (registry 'solr.jvm') enabled at server: com.sun.jmx.mbeanserver.JmxMBeanServer@6ea14ee4
   [junit4]   2> 3218994 INFO  (TEST-Tr

[...truncated too long message...]


   [junit4]   2> 115031 INFO  (jetty-closer-2-thread-1) [    ] o.a.s.c.Overseer Overseer (id=72072124678864936-127.0.0.1:59865_solr-n_0000000008) closing
   [junit4]   2> 115032 DEBUG (jetty-closer-2-thread-1) [    ] o.a.s.c.a.ScheduledTriggers Shutting down scheduled thread pool executor now
   [junit4]   2> 115032 DEBUG (jetty-closer-2-thread-1) [    ] o.a.s.c.a.ScheduledTriggers Shutting down action executor now
   [junit4]   2> 115032 DEBUG (jetty-closer-2-thread-1) [    ] o.a.s.c.a.ScheduledTriggers Awaiting termination for action executor
   [junit4]   2> 115034 DEBUG (jetty-closer-2-thread-1) [    ] o.a.s.c.a.ScheduledTriggers Awaiting termination for scheduled thread pool executor
   [junit4]   2> 115034 INFO  (zkCallback-158-thread-2) [    ] o.a.s.c.c.ZkStateReader Updated live nodes from ZooKeeper... (1) -> (0)
   [junit4]   2> 115034 INFO  (zkCallback-165-thread-1) [    ] o.a.s.c.c.ZkStateReader Updated live nodes from ZooKeeper... (1) -> (0)
   [junit4]   2> 115035 WARN  (OverseerAutoScalingTriggerThread-72072124678864936-127.0.0.1:59865_solr-n_0000000008) [    ] o.a.s.c.a.OverseerTriggerThread OverseerTriggerThread woken up but we are closed, exiting.
   [junit4]   2> 115035 DEBUG (jetty-closer-2-thread-1) [    ] o.a.s.c.a.ScheduledTriggers ScheduledTriggers closed completely
   [junit4]   2> 115035 DEBUG (jetty-closer-2-thread-1) [    ] o.a.s.c.a.OverseerTriggerThread OverseerTriggerThread has been closed explicitly
   [junit4]   2> 115035 INFO  (OverseerStateUpdate-72072124678864936-127.0.0.1:59865_solr-n_0000000008) [n:127.0.0.1:59865_solr    ] o.a.s.c.Overseer Overseer Loop exiting : 127.0.0.1:59865_solr
   [junit4]   2> 115037 WARN  (NIOServerCxn.Factory:0.0.0.0/0.0.0.0:0) [    ] o.a.z.s.NIOServerCnxn Unable to read additional data from client sessionid 0x1000d372db10029, likely client has closed socket
   [junit4]   2> 115038 WARN  (NIOServerCxn.Factory:0.0.0.0/0.0.0.0:0) [    ] o.a.z.s.NIOServerCnxn Unable to read additional data from client sessionid 0x1000d372db10028, likely client has closed socket
   [junit4]   2> 115039 INFO  (jetty-closer-2-thread-1) [    ] o.e.j.s.h.ContextHandler Stopped o.e.j.s.ServletContextHandler@334a6c1a{/solr,null,UNAVAILABLE}
   [junit4]   2> 115039 INFO  (jetty-closer-2-thread-1) [    ] o.e.j.s.session node0 Stopped scavenging
   [junit4]   2> 116650 WARN  (zkCallback-178-thread-1) [    ] o.a.s.c.c.ZkStateReader ZooKeeper watch triggered, but Solr cannot talk to ZK: [KeeperErrorCode = Session expired for /live_nodes]
   [junit4]   2> 116654 INFO  (jetty-closer-2-thread-2) [    ] o.e.j.s.h.ContextHandler Stopped o.e.j.s.ServletContextHandler@7a95f633{/solr,null,UNAVAILABLE}
   [junit4]   2> 116655 INFO  (jetty-closer-2-thread-2) [    ] o.e.j.s.session node0 Stopped scavenging
   [junit4]   2> 116661 ERROR (SUITE-TriggerIntegrationTest-seed#[9DEEC13A1BEDB426]-worker) [    ] o.a.z.s.ZooKeeperServer ZKShutdownHandler is not registered, so ZooKeeper server won't take any action on ERROR or SHUTDOWN server state changes
   [junit4]   2> 116672 INFO  (SUITE-TriggerIntegrationTest-seed#[9DEEC13A1BEDB426]-worker) [    ] o.a.s.c.ZkTestServer connecting to 127.0.0.1:59547 59547
   [junit4]   2> 116675 INFO  (Thread-1) [    ] o.a.s.c.ZkTestServer connecting to 127.0.0.1:59547 59547
   [junit4]   2> 116675 WARN  (Thread-1) [    ] o.a.s.c.ZkTestServer Watch limit violations: 
   [junit4]   2> Maximum concurrent create/delete watches above limit:
   [junit4]   2> 
   [junit4]   2> 	27	/solr/aliases.json
   [junit4]   2> 	27	/solr/clusterprops.json
   [junit4]   2> 	11	/solr/security.json
   [junit4]   2> 
   [junit4]   2> Maximum concurrent data watches above limit:
   [junit4]   2> 
   [junit4]   2> 	27	/solr/clusterstate.json
   [junit4]   2> 	10	/solr/aliases.json
   [junit4]   2> 	7	/solr/autoscaling.json
   [junit4]   2> 	3	/solr/overseer_elect/election/72072124678864919-127.0.0.1:59722_solr-n_0000000004
   [junit4]   2> 
   [junit4]   2> Maximum concurrent children watches above limit:
   [junit4]   2> 
   [junit4]   2> 	70	/solr/live_nodes
   [junit4]   2> 	27	/solr/collections
   [junit4]   2> 	7	/solr/autoscaling/events/.auto_add_replicas
   [junit4]   2> 	7	/solr/overseer/queue
   [junit4]   2> 	7	/solr/autoscaling/events/.scheduled_maintenance
   [junit4]   2> 	7	/solr/overseer/collection-queue-work
   [junit4]   2> 	7	/solr/overseer/queue-work
   [junit4]   2> 	2	/solr/autoscaling/events/node_added_triggerCTOOR
   [junit4]   2> 
   [junit4]   2> NOTE: leaving temporary files on disk at: C:\Users\jenkins\workspace\Lucene-Solr-7.x-Windows\solr\build\solr-core\test\J1\temp\solr.cloud.autoscaling.TriggerIntegrationTest_9DEEC13A1BEDB426-001
   [junit4]   2> Nov 17, 2018 7:52:47 AM com.carrotsearch.randomizedtesting.ThreadLeakControl checkThreadLeaks
   [junit4]   2> WARNING: Will linger awaiting termination of 1 leaked thread(s).
   [junit4]   2> NOTE: test params are: codec=Asserting(Lucene70): {}, docValues:{}, maxPointsInLeafNode=966, maxMBSortInHeap=7.325778761137342, sim=RandomSimilarity(queryNorm=true): {}, locale=el, timezone=Etc/GMT-14
   [junit4]   2> NOTE: Windows 10 10.0 amd64/Oracle Corporation 1.8.0_172 (64-bit)/cpus=3,threads=1,free=110136272,total=162004992
   [junit4]   2> NOTE: All tests run in this JVM: [TriggerIntegrationTest]
   [junit4] Completed [2/5 (2!)] on J1 in 114.53s, 4 tests, 1 failure <<< FAILURES!
   [junit4] 
   [junit4] Duplicate suite name used with XML reports: org.apache.solr.cloud.autoscaling.TriggerIntegrationTest. This may confuse tools that process XML reports. Set 'ignoreDuplicateSuites' to true to skip this message.
   [junit4] Suite: org.apache.solr.cloud.autoscaling.TriggerIntegrationTest
   [junit4] OK      14.5s J0 | TriggerIntegrationTest.testEventQueue
   [junit4] OK      18.0s J0 | TriggerIntegrationTest.testListeners
   [junit4] OK      18.0s J0 | TriggerIntegrationTest.testContinueTriggersOnOverseerRestart
   [junit4] OK      18.0s J0 | TriggerIntegrationTest.testTriggerThrottling
   [junit4] Completed [3/5 (2!)] on J0 in 70.64s, 4 tests
   [junit4] 
   [junit4] Suite: org.apache.solr.cloud.autoscaling.TriggerIntegrationTest
   [junit4] OK      14.6s J1 | TriggerIntegrationTest.testEventQueue
   [junit4] OK      18.6s J1 | TriggerIntegrationTest.testListeners
   [junit4] OK      18.0s J1 | TriggerIntegrationTest.testContinueTriggersOnOverseerRestart
   [junit4] OK      18.0s J1 | TriggerIntegrationTest.testTriggerThrottling
   [junit4] Completed [4/5 (2!)] on J1 in 70.58s, 4 tests
   [junit4] 
   [junit4] Suite: org.apache.solr.cloud.autoscaling.TriggerIntegrationTest
   [junit4] OK      12.9s J0 | TriggerIntegrationTest.testEventQueue
   [junit4] OK      16.2s J0 | TriggerIntegrationTest.testListeners
   [junit4] OK      21.0s J0 | TriggerIntegrationTest.testContinueTriggersOnOverseerRestart
   [junit4] OK      19.0s J0 | TriggerIntegrationTest.testTriggerThrottling
   [junit4] Completed [5/5 (2!)] on J0 in 70.99s, 4 tests
   [junit4] 
   [junit4] 
   [junit4] Tests with failures [seed: 9DEEC13A1BEDB426]:
   [junit4]   - org.apache.solr.cloud.autoscaling.TriggerIntegrationTest.testTriggerThrottling
   [junit4]   - org.apache.solr.cloud.autoscaling.TriggerIntegrationTest.testTriggerThrottling
   [junit4] 
   [junit4] 
   [junit4] JVM J0:     1.07 ..   258.72 =   257.65s
   [junit4] JVM J1:     1.06 ..   188.66 =   187.59s
   [junit4] Execution time total: 4 minutes 18 seconds
   [junit4] Tests summary: 5 suites, 20 tests, 2 failures

BUILD FAILED
C:\Users\jenkins\workspace\Lucene-Solr-7.x-Windows\lucene\common-build.xml:1567: The following error occurred while executing this line:
C:\Users\jenkins\workspace\Lucene-Solr-7.x-Windows\lucene\common-build.xml:1092: There were test failures: 5 suites, 20 tests, 2 failures [seed: 9DEEC13A1BEDB426]

Total time: 4 minutes 21 seconds

[repro] Setting last failure code to 1

[repro] Failures:
[repro]   2/5 failed: org.apache.solr.cloud.autoscaling.TriggerIntegrationTest
[repro] Exiting with code 1

C:\Users\jenkins\workspace\Lucene-Solr-7.x-Windows>IF EXIST lucene\build move /y lucene\build lucene\build.repro 
        1 dir(s) moved.

C:\Users\jenkins\workspace\Lucene-Solr-7.x-Windows>IF EXIST solr\build move /y solr\build solr\build.repro 
        1 dir(s) moved.

C:\Users\jenkins\workspace\Lucene-Solr-7.x-Windows>IF EXIST lucene\build.orig move /y lucene\build.orig lucene\build 
        1 dir(s) moved.

C:\Users\jenkins\workspace\Lucene-Solr-7.x-Windows>IF EXIST solr\build.orig move /y solr\build.orig solr\build 
        1 dir(s) moved.

C:\Users\jenkins\workspace\Lucene-Solr-7.x-Windows>exit 0 
Archiving artifacts
Setting ANT_1_8_2_HOME=C:\Users\jenkins\tools\hudson.tasks.Ant_AntInstallation\ANT_1.8.2
[WARNINGS] Parsing warnings in console log with parser Java Compiler (javac)
Setting ANT_1_8_2_HOME=C:\Users\jenkins\tools\hudson.tasks.Ant_AntInstallation\ANT_1.8.2
Setting ANT_1_8_2_HOME=C:\Users\jenkins\tools\hudson.tasks.Ant_AntInstallation\ANT_1.8.2
<Git Blamer> Using GitBlamer to create author and commit information for all warnings.
<Git Blamer> GIT_COMMIT=0ed5cd5c3f97775567696f473579d0ad0623d749, workspace=C:\Users\jenkins\workspace\Lucene-Solr-7.x-Windows
[WARNINGS] Computing warning deltas based on reference build #888
Recording test results
Setting ANT_1_8_2_HOME=C:\Users\jenkins\tools\hudson.tasks.Ant_AntInstallation\ANT_1.8.2
Build step 'Publish JUnit test result report' changed build result to UNSTABLE
Email was triggered for: Unstable (Test Failures)
Sending email for trigger: Unstable (Test Failures)
Setting ANT_1_8_2_HOME=C:\Users\jenkins\tools\hudson.tasks.Ant_AntInstallation\ANT_1.8.2
Setting ANT_1_8_2_HOME=C:\Users\jenkins\tools\hudson.tasks.Ant_AntInstallation\ANT_1.8.2
Setting ANT_1_8_2_HOME=C:\Users\jenkins\tools\hudson.tasks.Ant_AntInstallation\ANT_1.8.2
Setting ANT_1_8_2_HOME=C:\Users\jenkins\tools\hudson.tasks.Ant_AntInstallation\ANT_1.8.2