You are viewing a plain text version of this content. The canonical link for it is here.
Posted to dev@zookeeper.apache.org by Apache Jenkins Server <je...@builds.apache.org> on 2017/02/09 17:50:28 UTC
Failed: ZOOKEEPER- PreCommit Build #288
Build: https://builds.apache.org/job/PreCommit-ZOOKEEPER-github-pr-build/288/
###################################################################################
########################## LAST 60 LINES OF THE CONSOLE ###########################
[...truncated 25 lines...]
Getting sizes
Done: 9
Compressing objects
Done: 0
Writing objects
Done: 10
remote: Updating references
Merging refs/tags/changes/288
> git rev-parse refs/tags/changes/288^{commit} # timeout=10
> git merge 84d1259a47ca37e4351a2824bc6a40011acd2da3 # timeout=10
> git rev-parse branch-3.4^{commit} # timeout=10
Checking out Revision 84d1259a47ca37e4351a2824bc6a40011acd2da3 (branch-3.4)
> git config core.sparsecheckout # timeout=10
> git checkout -f 84d1259a47ca37e4351a2824bc6a40011acd2da3
> git rev-parse origin/branch-3.4^{commit} # timeout=10
> git rev-list 053a9d29973a22ca60a02614911fc6e164d52244 # timeout=10
No emails were triggered.
Setting JDK_1_7_LATEST__HOME=/home/jenkins/tools/java/latest1.7
[PreCommit-ZOOKEEPER-github-pr-build] $ /bin/bash /tmp/hudson3466166601282492057.sh
/home/jenkins/tools/java/latest1.7/bin/java
java version "1.7.0_80"
Java(TM) SE Runtime Environment (build 1.7.0_80-b15)
Java HotSpot(TM) 64-Bit Server VM (build 24.80-b11, mixed mode)
core file size (blocks, -c) 0
data seg size (kbytes, -d) unlimited
scheduling priority (-e) 0
file size (blocks, -f) unlimited
pending signals (-i) 386178
max locked memory (kbytes, -l) 64
max memory size (kbytes, -m) unlimited
open files (-n) 60000
pipe size (512 bytes, -p) 8
POSIX message queues (bytes, -q) 819200
real-time priority (-r) 0
stack size (kbytes, -s) 8192
cpu time (seconds, -t) unlimited
max user processes (-u) 10240
virtual memory (kbytes, -v) unlimited
file locks (-x) unlimited
Buildfile: /home/jenkins/jenkins-slave/workspace/PreCommit-ZOOKEEPER-github-pr-build/build.xml
BUILD FAILED
Target "qa-test-pullrequest" does not exist in the project "ZooKeeper".
Total time: 0 seconds
Build step 'Execute shell' marked build as failure
Archiving artifacts
Setting JDK_1_7_LATEST__HOME=/home/jenkins/tools/java/latest1.7
Recording test results
Setting JDK_1_7_LATEST__HOME=/home/jenkins/tools/java/latest1.7
ERROR: Step ?Publish JUnit test result report? failed: No test report files were found. Configuration error?
[description-setter] Could not determine description.
Putting comment on the pull request
Setting JDK_1_7_LATEST__HOME=/home/jenkins/tools/java/latest1.7
Email was triggered for: Failure - Any
Sending email for trigger: Failure - Any
Setting JDK_1_7_LATEST__HOME=/home/jenkins/tools/java/latest1.7
Setting JDK_1_7_LATEST__HOME=/home/jenkins/tools/java/latest1.7
Setting JDK_1_7_LATEST__HOME=/home/jenkins/tools/java/latest1.7
###################################################################################
############################## FAILED TESTS (if any) ##############################
No tests ran.
Success: ZOOKEEPER- PreCommit Build #290
Posted by Apache Jenkins Server <je...@builds.apache.org>.
Build: https://builds.apache.org/job/PreCommit-ZOOKEEPER-github-pr-build/290/
###################################################################################
########################## LAST 60 LINES OF THE CONSOLE ###########################
[...truncated 482021 lines...]
[exec]
[exec]
[exec] +1 @author. The patch does not contain any @author tags.
[exec]
[exec] +1 tests included. The patch appears to include 3 new or modified tests.
[exec]
[exec] +1 javadoc. The javadoc tool did not generate any warning messages.
[exec]
[exec] +1 javac. The applied patch does not increase the total number of javac compiler warnings.
[exec]
[exec] +1 findbugs. The patch does not introduce any new Findbugs (version 3.0.1) warnings.
[exec]
[exec] +1 release audit. The applied patch does not increase the total number of release audit warnings.
[exec]
[exec] +1 core tests. The patch passed core unit tests.
[exec]
[exec] +1 contrib tests. The patch passed contrib unit tests.
[exec]
[exec] Test results: https://builds.apache.org/job/PreCommit-ZOOKEEPER-github-pr-build/290//testReport/
[exec] Findbugs warnings: https://builds.apache.org/job/PreCommit-ZOOKEEPER-github-pr-build/290//artifact/trunk/build/test/findbugs/newPatchFindbugsWarnings.html
[exec] Console output: https://builds.apache.org/job/PreCommit-ZOOKEEPER-github-pr-build/290//console
[exec]
[exec] This message is automatically generated.
[exec]
[exec]
[exec] ======================================================================
[exec] ======================================================================
[exec] Adding comment to Jira.
[exec] ======================================================================
[exec] ======================================================================
[exec]
[exec]
[exec] Error: No value specified for option "issue"
[exec] e5005f24a6d708cfd7bef8debbc6f820836f39eb logged out
[exec]
[exec]
[exec] ======================================================================
[exec] ======================================================================
[exec] Finished build.
[exec] ======================================================================
[exec] ======================================================================
[exec]
[exec]
[exec] mv: ‘/home/jenkins/jenkins-slave/workspace/PreCommit-ZOOKEEPER-github-pr-build/patchprocess’ and ‘/home/jenkins/jenkins-slave/workspace/PreCommit-ZOOKEEPER-github-pr-build/patchprocess’ are the same file
BUILD SUCCESSFUL
Total time: 18 minutes 56 seconds
Archiving artifacts
Setting JDK_1_7_LATEST__HOME=/home/jenkins/tools/java/latest1.7
Recording test results
Setting JDK_1_7_LATEST__HOME=/home/jenkins/tools/java/latest1.7
[description-setter] Could not determine description.
Putting comment on the pull request
Setting JDK_1_7_LATEST__HOME=/home/jenkins/tools/java/latest1.7
Email was triggered for: Success
Sending email for trigger: Success
Setting JDK_1_7_LATEST__HOME=/home/jenkins/tools/java/latest1.7
Setting JDK_1_7_LATEST__HOME=/home/jenkins/tools/java/latest1.7
Setting JDK_1_7_LATEST__HOME=/home/jenkins/tools/java/latest1.7
###################################################################################
############################## FAILED TESTS (if any) ##############################
All tests passed
Failed: ZOOKEEPER- PreCommit Build #289
Posted by Apache Jenkins Server <je...@builds.apache.org>.
Build: https://builds.apache.org/job/PreCommit-ZOOKEEPER-github-pr-build/289/
###################################################################################
########################## LAST 60 LINES OF THE CONSOLE ###########################
[...truncated 73 lines...]
[exec] ----- Going to parser args -----
[exec] Pull request id: 167
[exec] Pull request title: commitProcessor does not crash when an unseen commit somes
[exec] Defect number:
[exec] ----- Parsed args, going to checkout -----
[exec]
[exec]
[exec] ======================================================================
[exec] ======================================================================
[exec] Testing patch for pull request 167.
[exec] ======================================================================
[exec] ======================================================================
[exec]
[exec]
[exec]
[exec] % Total % Received % Xferd Average Speed Time Time Time Current
[exec] Dload Upload Total Spent Left Speed
[exec]
[exec] 0 0 0 0 0 0 0 0 --:--:-- --:--:-- --:--:-- 0 0 0 0 0 0 0 0 0 --:--:-- --:--:-- --:--:-- 0100 141 0 141 0 0 362 0 --:--:-- --:--:-- --:--:-- 362
[exec]
[exec]
[exec] ======================================================================
[exec] ======================================================================
[exec] Pre-build trunk to verify trunk stability and javac warnings
[exec] ======================================================================
[exec] ======================================================================
[exec]
[exec]
[exec] /home/jenkins/tools/ant/latest/bin/ant -Djavac.args=-Xlint -Xmaxwarns 1000 -Djava5.home=/home/jenkins/tools/java5/latest -Dforrest.home=/home/jenkins/tools/forrest/latest -DZookeeperPatchProcess= clean tar > /home/jenkins/jenkins-slave/workspace/PreCommit-ZOOKEEPER-github-pr-build/patchprocess/trunkJavacWarnings.txt 2>&1
[exec] Trunk compilation is broken?
[exec]
[exec]
[exec] ======================================================================
[exec] ======================================================================
[exec] Finished build.
[exec] ======================================================================
[exec] ======================================================================
[exec]
[exec]
[exec] 0 0 0 7146 0 0 8477 0 --:--:-- --:--:-- --:--:-- 8477mv: '/home/jenkins/jenkins-slave/workspace/PreCommit-ZOOKEEPER-github-pr-build/patchprocess' and '/home/jenkins/jenkins-slave/workspace/PreCommit-ZOOKEEPER-github-pr-build/patchprocess' are the same file
BUILD FAILED
/home/jenkins/jenkins-slave/workspace/PreCommit-ZOOKEEPER-github-pr-build/build.xml:1635: exec returned: 1
Total time: 24 seconds
Build step 'Execute shell' marked build as failure
Archiving artifacts
Setting JDK_1_7_LATEST__HOME=/home/jenkins/tools/java/latest1.7
Recording test results
Setting JDK_1_7_LATEST__HOME=/home/jenkins/tools/java/latest1.7
ERROR: Step ?Publish JUnit test result report? failed: No test report files were found. Configuration error?
[description-setter] Could not determine description.
Putting comment on the pull request
Setting JDK_1_7_LATEST__HOME=/home/jenkins/tools/java/latest1.7
Email was triggered for: Failure - Any
Sending email for trigger: Failure - Any
Setting JDK_1_7_LATEST__HOME=/home/jenkins/tools/java/latest1.7
Setting JDK_1_7_LATEST__HOME=/home/jenkins/tools/java/latest1.7
Setting JDK_1_7_LATEST__HOME=/home/jenkins/tools/java/latest1.7
###################################################################################
############################## FAILED TESTS (if any) ##############################
No tests ran.