You are viewing a plain text version of this content. The canonical link for it is here.
Posted to dev@hbase.apache.org by Apache Jenkins Server <je...@builds.apache.org> on 2012/05/23 01:10:21 UTC

Build failed in Jenkins: HBase-0.94-security #28

See <https://builds.apache.org/job/HBase-0.94-security/28/changes>

Changes:

[tedyu] HBASE-6061 Fix ACL "Admin" Table inconsistent permission check (Matteo Bertozzi)

[jmhsieh] HBASE-6044 copytable: remove rs.* parameters

[jmhsieh] HBASE-5757 TableInputFormat should handle as many errors as possible (Jan Lukavsky)

[ramkrishna] HBASE-5840 Open Region FAILED_OPEN doesn't clear the TaskMonitor Status, keeps showing the old status (Rajesh)

[stack] HBASE-6056 Restore hbase-default version check

------------------------------------------
[...truncated 7201 lines...]
Running org.apache.hadoop.hbase.coprocessor.TestRegionServerCoprocessorExceptionWithRemove
Tests run: 1, Failures: 0, Errors: 0, Skipped: 0, Time elapsed: 15.461 sec
Forking command line: /bin/sh -c cd <https://builds.apache.org/job/HBase-0.94-security/ws/trunk> && /home/jenkins/tools/java/jdk1.6.0_27-32/jre/bin/java -enableassertions -Xmx1900m -Djava.security.egd=file:/dev/./urandom -jar <https://builds.apache.org/job/HBase-0.94-security/ws/trunk/target/surefire/surefirebooter8081051101954185971.jar> <https://builds.apache.org/job/HBase-0.94-security/ws/trunk/target/surefire/surefire1121769773204832791tmp> <https://builds.apache.org/job/HBase-0.94-security/ws/trunk/target/surefire/surefire_651584970820785001256tmp>
Running org.apache.hadoop.hbase.coprocessor.TestMasterObserver
Tests run: 3, Failures: 0, Errors: 0, Skipped: 0, Time elapsed: 29.002 sec
Forking command line: /bin/sh -c cd <https://builds.apache.org/job/HBase-0.94-security/ws/trunk> && /home/jenkins/tools/java/jdk1.6.0_27-32/jre/bin/java -enableassertions -Xmx1900m -Djava.security.egd=file:/dev/./urandom -jar <https://builds.apache.org/job/HBase-0.94-security/ws/trunk/target/surefire/surefirebooter9004210845409288585.jar> <https://builds.apache.org/job/HBase-0.94-security/ws/trunk/target/surefire/surefire698527326172179985tmp> <https://builds.apache.org/job/HBase-0.94-security/ws/trunk/target/surefire/surefire_667408794281992679255tmp>
Running org.apache.hadoop.hbase.coprocessor.TestCoprocessorEndpoint
Tests run: 3, Failures: 0, Errors: 0, Skipped: 1, Time elapsed: 29.203 sec
Forking command line: /bin/sh -c cd <https://builds.apache.org/job/HBase-0.94-security/ws/trunk> && /home/jenkins/tools/java/jdk1.6.0_27-32/jre/bin/java -enableassertions -Xmx1900m -Djava.security.egd=file:/dev/./urandom -jar <https://builds.apache.org/job/HBase-0.94-security/ws/trunk/target/surefire/surefirebooter7254952723626430159.jar> <https://builds.apache.org/job/HBase-0.94-security/ws/trunk/target/surefire/surefire7251954514605573025tmp> <https://builds.apache.org/job/HBase-0.94-security/ws/trunk/target/surefire/surefire_677649706038865564848tmp>
Running org.apache.hadoop.hbase.coprocessor.TestMasterCoprocessorExceptionWithAbort
Tests run: 1, Failures: 0, Errors: 0, Skipped: 0, Time elapsed: 10.45 sec
Forking command line: /bin/sh -c cd <https://builds.apache.org/job/HBase-0.94-security/ws/trunk> && /home/jenkins/tools/java/jdk1.6.0_27-32/jre/bin/java -enableassertions -Xmx1900m -Djava.security.egd=file:/dev/./urandom -jar <https://builds.apache.org/job/HBase-0.94-security/ws/trunk/target/surefire/surefirebooter4489471843292358295.jar> <https://builds.apache.org/job/HBase-0.94-security/ws/trunk/target/surefire/surefire2884124940829760171tmp> <https://builds.apache.org/job/HBase-0.94-security/ws/trunk/target/surefire/surefire_683117308194622039866tmp>
Running org.apache.hadoop.hbase.coprocessor.TestWALObserver
Tests run: 3, Failures: 0, Errors: 0, Skipped: 0, Time elapsed: 14.538 sec
Forking command line: /bin/sh -c cd <https://builds.apache.org/job/HBase-0.94-security/ws/trunk> && /home/jenkins/tools/java/jdk1.6.0_27-32/jre/bin/java -enableassertions -Xmx1900m -Djava.security.egd=file:/dev/./urandom -jar <https://builds.apache.org/job/HBase-0.94-security/ws/trunk/target/surefire/surefirebooter2569161716734441253.jar> <https://builds.apache.org/job/HBase-0.94-security/ws/trunk/target/surefire/surefire7444848165365505865tmp> <https://builds.apache.org/job/HBase-0.94-security/ws/trunk/target/surefire/surefire_697778750940063206069tmp>
Running org.apache.hadoop.hbase.coprocessor.TestRegionObserverInterface
Tests run: 6, Failures: 0, Errors: 0, Skipped: 0, Time elapsed: 33.72 sec
Forking command line: /bin/sh -c cd <https://builds.apache.org/job/HBase-0.94-security/ws/trunk> && /home/jenkins/tools/java/jdk1.6.0_27-32/jre/bin/java -enableassertions -Xmx1900m -Djava.security.egd=file:/dev/./urandom -jar <https://builds.apache.org/job/HBase-0.94-security/ws/trunk/target/surefire/surefirebooter2918334462227161782.jar> <https://builds.apache.org/job/HBase-0.94-security/ws/trunk/target/surefire/surefire8353134741846918798tmp> <https://builds.apache.org/job/HBase-0.94-security/ws/trunk/target/surefire/surefire_706850812299772465800tmp>
Running org.apache.hadoop.hbase.coprocessor.TestMasterCoprocessorExceptionWithRemove
Tests run: 1, Failures: 0, Errors: 0, Skipped: 0, Time elapsed: 15.474 sec
Forking command line: /bin/sh -c cd <https://builds.apache.org/job/HBase-0.94-security/ws/trunk> && /home/jenkins/tools/java/jdk1.6.0_27-32/jre/bin/java -enableassertions -Xmx1900m -Djava.security.egd=file:/dev/./urandom -jar <https://builds.apache.org/job/HBase-0.94-security/ws/trunk/target/surefire/surefirebooter8884415382791822777.jar> <https://builds.apache.org/job/HBase-0.94-security/ws/trunk/target/surefire/surefire7853427337510699405tmp> <https://builds.apache.org/job/HBase-0.94-security/ws/trunk/target/surefire/surefire_715831942530148788840tmp>
Running org.apache.hadoop.hbase.coprocessor.TestRegionObserverBypass
Tests run: 2, Failures: 0, Errors: 0, Skipped: 0, Time elapsed: 10.913 sec
Forking command line: /bin/sh -c cd <https://builds.apache.org/job/HBase-0.94-security/ws/trunk> && /home/jenkins/tools/java/jdk1.6.0_27-32/jre/bin/java -enableassertions -Xmx1900m -Djava.security.egd=file:/dev/./urandom -jar <https://builds.apache.org/job/HBase-0.94-security/ws/trunk/target/surefire/surefirebooter6333797212263162739.jar> <https://builds.apache.org/job/HBase-0.94-security/ws/trunk/target/surefire/surefire5794988788243828417tmp> <https://builds.apache.org/job/HBase-0.94-security/ws/trunk/target/surefire/surefire_721937665237982067656tmp>
Running org.apache.hadoop.hbase.mapreduce.TestHLogRecordReader
Tests run: 2, Failures: 0, Errors: 0, Skipped: 0, Time elapsed: 4.919 sec
Forking command line: /bin/sh -c cd <https://builds.apache.org/job/HBase-0.94-security/ws/trunk> && /home/jenkins/tools/java/jdk1.6.0_27-32/jre/bin/java -enableassertions -Xmx1900m -Djava.security.egd=file:/dev/./urandom -jar <https://builds.apache.org/job/HBase-0.94-security/ws/trunk/target/surefire/surefirebooter7495864109331691633.jar> <https://builds.apache.org/job/HBase-0.94-security/ws/trunk/target/surefire/surefire4198839616407337395tmp> <https://builds.apache.org/job/HBase-0.94-security/ws/trunk/target/surefire/surefire_735298471037588020352tmp>
Running org.apache.hadoop.hbase.TestGlobalMemStoreSize
Tests run: 1, Failures: 0, Errors: 0, Skipped: 0, Time elapsed: 15.426 sec
Forking command line: /bin/sh -c cd <https://builds.apache.org/job/HBase-0.94-security/ws/trunk> && /home/jenkins/tools/java/jdk1.6.0_27-32/jre/bin/java -enableassertions -Xmx1900m -Djava.security.egd=file:/dev/./urandom -jar <https://builds.apache.org/job/HBase-0.94-security/ws/trunk/target/surefire/surefirebooter5039994001204355831.jar> <https://builds.apache.org/job/HBase-0.94-security/ws/trunk/target/surefire/surefire7925950515630814534tmp> <https://builds.apache.org/job/HBase-0.94-security/ws/trunk/target/surefire/surefire_741185407087417989637tmp>
Running org.apache.hadoop.hbase.mapreduce.TestImportExport
Tests run: 2, Failures: 0, Errors: 0, Skipped: 0, Time elapsed: 48.292 sec
Forking command line: /bin/sh -c cd <https://builds.apache.org/job/HBase-0.94-security/ws/trunk> && /home/jenkins/tools/java/jdk1.6.0_27-32/jre/bin/java -enableassertions -Xmx1900m -Djava.security.egd=file:/dev/./urandom -jar <https://builds.apache.org/job/HBase-0.94-security/ws/trunk/target/surefire/surefirebooter7595328938497944613.jar> <https://builds.apache.org/job/HBase-0.94-security/ws/trunk/target/surefire/surefire1798892332229157606tmp> <https://builds.apache.org/job/HBase-0.94-security/ws/trunk/target/surefire/surefire_756620778022329856622tmp>
Running org.apache.hadoop.hbase.mapreduce.TestImportTsv
Tests run: 9, Failures: 0, Errors: 0, Skipped: 0, Time elapsed: 142.528 sec
Forking command line: /bin/sh -c cd <https://builds.apache.org/job/HBase-0.94-security/ws/trunk> && /home/jenkins/tools/java/jdk1.6.0_27-32/jre/bin/java -enableassertions -Xmx1900m -Djava.security.egd=file:/dev/./urandom -jar <https://builds.apache.org/job/HBase-0.94-security/ws/trunk/target/surefire/surefirebooter5749286734815523135.jar> <https://builds.apache.org/job/HBase-0.94-security/ws/trunk/target/surefire/surefire486024584996193134tmp> <https://builds.apache.org/job/HBase-0.94-security/ws/trunk/target/surefire/surefire_761616077034444106782tmp>
Running org.apache.hadoop.hbase.TestAcidGuarantees
Tests run: 3, Failures: 0, Errors: 0, Skipped: 0, Time elapsed: 96.356 sec
Forking command line: /bin/sh -c cd <https://builds.apache.org/job/HBase-0.94-security/ws/trunk> && /home/jenkins/tools/java/jdk1.6.0_27-32/jre/bin/java -enableassertions -Xmx1900m -Djava.security.egd=file:/dev/./urandom -jar <https://builds.apache.org/job/HBase-0.94-security/ws/trunk/target/surefire/surefirebooter2447005343362731402.jar> <https://builds.apache.org/job/HBase-0.94-security/ws/trunk/target/surefire/surefire3596403774098448362tmp> <https://builds.apache.org/job/HBase-0.94-security/ws/trunk/target/surefire/surefire_775314701583574702288tmp>
Running org.apache.hadoop.hbase.catalog.TestMetaReaderEditorNoCluster
Tests run: 1, Failures: 0, Errors: 0, Skipped: 0, Time elapsed: 4.072 sec
Forking command line: /bin/sh -c cd <https://builds.apache.org/job/HBase-0.94-security/ws/trunk> && /home/jenkins/tools/java/jdk1.6.0_27-32/jre/bin/java -enableassertions -Xmx1900m -Djava.security.egd=file:/dev/./urandom -jar <https://builds.apache.org/job/HBase-0.94-security/ws/trunk/target/surefire/surefirebooter7997050813010532701.jar> <https://builds.apache.org/job/HBase-0.94-security/ws/trunk/target/surefire/surefire2637721387621376053tmp> <https://builds.apache.org/job/HBase-0.94-security/ws/trunk/target/surefire/surefire_7861992592493774872tmp>
Running org.apache.hadoop.hbase.thrift2.TestThriftHBaseServiceHandler
Tests run: 12, Failures: 0, Errors: 0, Skipped: 0, Time elapsed: 11.674 sec
Forking command line: /bin/sh -c cd <https://builds.apache.org/job/HBase-0.94-security/ws/trunk> && /home/jenkins/tools/java/jdk1.6.0_27-32/jre/bin/java -enableassertions -Xmx1900m -Djava.security.egd=file:/dev/./urandom -jar <https://builds.apache.org/job/HBase-0.94-security/ws/trunk/target/surefire/surefirebooter3562361486934319868.jar> <https://builds.apache.org/job/HBase-0.94-security/ws/trunk/target/surefire/surefire6681822996011531540tmp> <https://builds.apache.org/job/HBase-0.94-security/ws/trunk/target/surefire/surefire_792509964268335785843tmp>
Running org.apache.hadoop.hbase.catalog.TestCatalogTracker
Tests run: 9, Failures: 0, Errors: 0, Skipped: 1, Time elapsed: 6.25 sec
Forking command line: /bin/sh -c cd <https://builds.apache.org/job/HBase-0.94-security/ws/trunk> && /home/jenkins/tools/java/jdk1.6.0_27-32/jre/bin/java -enableassertions -Xmx1900m -Djava.security.egd=file:/dev/./urandom -jar <https://builds.apache.org/job/HBase-0.94-security/ws/trunk/target/surefire/surefirebooter2015753785988887546.jar> <https://builds.apache.org/job/HBase-0.94-security/ws/trunk/target/surefire/surefire1658253692057893204tmp> <https://builds.apache.org/job/HBase-0.94-security/ws/trunk/target/surefire/surefire_808518912049018202226tmp>
Running org.apache.hadoop.hbase.catalog.TestMetaReaderEditor
Tests run: 5, Failures: 0, Errors: 0, Skipped: 0, Time elapsed: 20.658 sec
Forking command line: /bin/sh -c cd <https://builds.apache.org/job/HBase-0.94-security/ws/trunk> && /home/jenkins/tools/java/jdk1.6.0_27-32/jre/bin/java -enableassertions -Xmx1900m -Djava.security.egd=file:/dev/./urandom -jar <https://builds.apache.org/job/HBase-0.94-security/ws/trunk/target/surefire/surefirebooter5266885104969536137.jar> <https://builds.apache.org/job/HBase-0.94-security/ws/trunk/target/surefire/surefire3085762102076201197tmp> <https://builds.apache.org/job/HBase-0.94-security/ws/trunk/target/surefire/surefire_814486069946112812845tmp>
Running org.apache.hadoop.hbase.client.TestTimestampsFilter
Tests run: 3, Failures: 0, Errors: 0, Skipped: 0, Time elapsed: 20.631 sec
Forking command line: /bin/sh -c cd <https://builds.apache.org/job/HBase-0.94-security/ws/trunk> && /home/jenkins/tools/java/jdk1.6.0_27-32/jre/bin/java -enableassertions -Xmx1900m -Djava.security.egd=file:/dev/./urandom -jar <https://builds.apache.org/job/HBase-0.94-security/ws/trunk/target/surefire/surefirebooter3246317087393341636.jar> <https://builds.apache.org/job/HBase-0.94-security/ws/trunk/target/surefire/surefire1015682181407558277tmp> <https://builds.apache.org/job/HBase-0.94-security/ws/trunk/target/surefire/surefire_828730619681120162710tmp>
Running org.apache.hadoop.hbase.client.TestHCM
Tests run: 6, Failures: 0, Errors: 0, Skipped: 0, Time elapsed: 15.971 sec
Forking command line: /bin/sh -c cd <https://builds.apache.org/job/HBase-0.94-security/ws/trunk> && /home/jenkins/tools/java/jdk1.6.0_27-32/jre/bin/java -enableassertions -Xmx1900m -Djava.security.egd=file:/dev/./urandom -jar <https://builds.apache.org/job/HBase-0.94-security/ws/trunk/target/surefire/surefirebooter4431813274430757363.jar> <https://builds.apache.org/job/HBase-0.94-security/ws/trunk/target/surefire/surefire1577269271873946793tmp> <https://builds.apache.org/job/HBase-0.94-security/ws/trunk/target/surefire/surefire_83794994302965566337tmp>
Running org.apache.hadoop.hbase.client.TestMetaScanner
Tests run: 1, Failures: 0, Errors: 0, Skipped: 0, Time elapsed: 13.301 sec
Forking command line: /bin/sh -c cd <https://builds.apache.org/job/HBase-0.94-security/ws/trunk> && /home/jenkins/tools/java/jdk1.6.0_27-32/jre/bin/java -enableassertions -Xmx1900m -Djava.security.egd=file:/dev/./urandom -jar <https://builds.apache.org/job/HBase-0.94-security/ws/trunk/target/surefire/surefirebooter5778355262130245351.jar> <https://builds.apache.org/job/HBase-0.94-security/ws/trunk/target/surefire/surefire1023906624391753121tmp> <https://builds.apache.org/job/HBase-0.94-security/ws/trunk/target/surefire/surefire_848196815434288478857tmp>
Running org.apache.hadoop.hbase.client.TestHTableUtil
Tests run: 2, Failures: 0, Errors: 0, Skipped: 0, Time elapsed: 13.223 sec
Forking command line: /bin/sh -c cd <https://builds.apache.org/job/HBase-0.94-security/ws/trunk> && /home/jenkins/tools/java/jdk1.6.0_27-32/jre/bin/java -enableassertions -Xmx1900m -Djava.security.egd=file:/dev/./urandom -jar <https://builds.apache.org/job/HBase-0.94-security/ws/trunk/target/surefire/surefirebooter8207878341330798762.jar> <https://builds.apache.org/job/HBase-0.94-security/ws/trunk/target/surefire/surefire5711011036815761676tmp> <https://builds.apache.org/job/HBase-0.94-security/ws/trunk/target/surefire/surefire_851290676530106626814tmp>
Running org.apache.hadoop.hbase.client.TestMetaMigrationRemovingHTD
Tests run: 3, Failures: 0, Errors: 0, Skipped: 0, Time elapsed: 21.403 sec
Forking command line: /bin/sh -c cd <https://builds.apache.org/job/HBase-0.94-security/ws/trunk> && /home/jenkins/tools/java/jdk1.6.0_27-32/jre/bin/java -enableassertions -Xmx1900m -Djava.security.egd=file:/dev/./urandom -jar <https://builds.apache.org/job/HBase-0.94-security/ws/trunk/target/surefire/surefirebooter7700794987424754400.jar> <https://builds.apache.org/job/HBase-0.94-security/ws/trunk/target/surefire/surefire4376275774179679455tmp> <https://builds.apache.org/job/HBase-0.94-security/ws/trunk/target/surefire/surefire_866260469248120227634tmp>
Running org.apache.hadoop.hbase.client.replication.TestReplicationAdmin
Tests run: 1, Failures: 0, Errors: 0, Skipped: 0, Time elapsed: 0.797 sec
Forking command line: /bin/sh -c cd <https://builds.apache.org/job/HBase-0.94-security/ws/trunk> && /home/jenkins/tools/java/jdk1.6.0_27-32/jre/bin/java -enableassertions -Xmx1900m -Djava.security.egd=file:/dev/./urandom -jar <https://builds.apache.org/job/HBase-0.94-security/ws/trunk/target/surefire/surefirebooter6307530628391642564.jar> <https://builds.apache.org/job/HBase-0.94-security/ws/trunk/target/surefire/surefire3418882281063053952tmp> <https://builds.apache.org/job/HBase-0.94-security/ws/trunk/target/surefire/surefire_871734522514878379193tmp>
Running org.apache.hadoop.hbase.client.TestHTablePool$TestHTableReusablePool
Tests run: 9, Failures: 0, Errors: 0, Skipped: 0, Time elapsed: 5.138 sec
Running org.apache.hadoop.hbase.client.TestHTablePool$TestHTableThreadLocalPool
Tests run: 9, Failures: 0, Errors: 0, Skipped: 0, Time elapsed: 22.067 sec
Forking command line: /bin/sh -c cd <https://builds.apache.org/job/HBase-0.94-security/ws/trunk> && /home/jenkins/tools/java/jdk1.6.0_27-32/jre/bin/java -enableassertions -Xmx1900m -Djava.security.egd=file:/dev/./urandom -jar <https://builds.apache.org/job/HBase-0.94-security/ws/trunk/target/surefire/surefirebooter2996635812417586293.jar> <https://builds.apache.org/job/HBase-0.94-security/ws/trunk/target/surefire/surefire8045658756139498421tmp> <https://builds.apache.org/job/HBase-0.94-security/ws/trunk/target/surefire/surefire_887129015598974127333tmp>
Running org.apache.hadoop.hbase.metrics.TestMetricsMBeanBase
Tests run: 2, Failures: 0, Errors: 0, Skipped: 0, Time elapsed: 1.125 sec
Forking command line: /bin/sh -c cd <https://builds.apache.org/job/HBase-0.94-security/ws/trunk> && /home/jenkins/tools/java/jdk1.6.0_27-32/jre/bin/java -enableassertions -Xmx1900m -Djava.security.egd=file:/dev/./urandom -jar <https://builds.apache.org/job/HBase-0.94-security/ws/trunk/target/surefire/surefirebooter9027449669963185033.jar> <https://builds.apache.org/job/HBase-0.94-security/ws/trunk/target/surefire/surefire1831137536885980218tmp> <https://builds.apache.org/job/HBase-0.94-security/ws/trunk/target/surefire/surefire_893252222081431854254tmp>
Running org.apache.hadoop.hbase.client.TestMultiParallel
Tests run: 11, Failures: 0, Errors: 0, Skipped: 0, Time elapsed: 34.164 sec
Forking command line: /bin/sh -c cd <https://builds.apache.org/job/HBase-0.94-security/ws/trunk> && /home/jenkins/tools/java/jdk1.6.0_27-32/jre/bin/java -enableassertions -Xmx1900m -Djava.security.egd=file:/dev/./urandom -jar <https://builds.apache.org/job/HBase-0.94-security/ws/trunk/target/surefire/surefirebooter5055725761675834474.jar> <https://builds.apache.org/job/HBase-0.94-security/ws/trunk/target/surefire/surefire7512538857839959741tmp> <https://builds.apache.org/job/HBase-0.94-security/ws/trunk/target/surefire/surefire_908539166489385087984tmp>
Running org.apache.hadoop.hbase.constraint.TestConstraint
Tests run: 5, Failures: 0, Errors: 0, Skipped: 0, Time elapsed: 30.303 sec
Forking command line: /bin/sh -c cd <https://builds.apache.org/job/HBase-0.94-security/ws/trunk> && /home/jenkins/tools/java/jdk1.6.0_27-32/jre/bin/java -enableassertions -Xmx1900m -Djava.security.egd=file:/dev/./urandom -jar <https://builds.apache.org/job/HBase-0.94-security/ws/trunk/target/surefire/surefirebooter2678049390298964696.jar> <https://builds.apache.org/job/HBase-0.94-security/ws/trunk/target/surefire/surefire6911245047337327960tmp> <https://builds.apache.org/job/HBase-0.94-security/ws/trunk/target/surefire/surefire_917191200169669648317tmp>
Running org.apache.hadoop.hbase.rest.TestGzipFilter
Tests run: 3, Failures: 0, Errors: 0, Skipped: 0, Time elapsed: 14.254 sec
Forking command line: /bin/sh -c cd <https://builds.apache.org/job/HBase-0.94-security/ws/trunk> && /home/jenkins/tools/java/jdk1.6.0_27-32/jre/bin/java -enableassertions -Xmx1900m -Djava.security.egd=file:/dev/./urandom -jar <https://builds.apache.org/job/HBase-0.94-security/ws/trunk/target/surefire/surefirebooter3401775838513680543.jar> <https://builds.apache.org/job/HBase-0.94-security/ws/trunk/target/surefire/surefire338337363553038720tmp> <https://builds.apache.org/job/HBase-0.94-security/ws/trunk/target/surefire/surefire_926839695420420157140tmp>
Running org.apache.hadoop.hbase.rest.TestMultiRowResource
Tests run: 3, Failures: 0, Errors: 0, Skipped: 0, Time elapsed: 13.344 sec
Forking command line: /bin/sh -c cd <https://builds.apache.org/job/HBase-0.94-security/ws/trunk> && /home/jenkins/tools/java/jdk1.6.0_27-32/jre/bin/java -enableassertions -Xmx1900m -Djava.security.egd=file:/dev/./urandom -jar <https://builds.apache.org/job/HBase-0.94-security/ws/trunk/target/surefire/surefirebooter3415084787896288308.jar> <https://builds.apache.org/job/HBase-0.94-security/ws/trunk/target/surefire/surefire6442269689866569989tmp> <https://builds.apache.org/job/HBase-0.94-security/ws/trunk/target/surefire/surefire_931638934677649058346tmp>
Running org.apache.hadoop.hbase.rest.TestScannersWithFilters
Tests run: 10, Failures: 0, Errors: 0, Skipped: 0, Time elapsed: 16.402 sec
Forking command line: /bin/sh -c cd <https://builds.apache.org/job/HBase-0.94-security/ws/trunk> && /home/jenkins/tools/java/jdk1.6.0_27-32/jre/bin/java -enableassertions -Xmx1900m -Djava.security.egd=file:/dev/./urandom -jar <https://builds.apache.org/job/HBase-0.94-security/ws/trunk/target/surefire/surefirebooter7143712485967483240.jar> <https://builds.apache.org/job/HBase-0.94-security/ws/trunk/target/surefire/surefire4080571605931231230tmp> <https://builds.apache.org/job/HBase-0.94-security/ws/trunk/target/surefire/surefire_946783533147283389756tmp>
Running org.apache.hadoop.hbase.rest.TestRowResource
Tests run: 11, Failures: 0, Errors: 0, Skipped: 0, Time elapsed: 14.794 sec
Forking command line: /bin/sh -c cd <https://builds.apache.org/job/HBase-0.94-security/ws/trunk> && /home/jenkins/tools/java/jdk1.6.0_27-32/jre/bin/java -enableassertions -Xmx1900m -Djava.security.egd=file:/dev/./urandom -jar <https://builds.apache.org/job/HBase-0.94-security/ws/trunk/target/surefire/surefirebooter4073855331867473615.jar> <https://builds.apache.org/job/HBase-0.94-security/ws/trunk/target/surefire/surefire2931912448765418510tmp> <https://builds.apache.org/job/HBase-0.94-security/ws/trunk/target/surefire/surefire_957182893729105311553tmp>
Running org.apache.hadoop.hbase.rest.client.TestRemoteAdmin
Tests run: 1, Failures: 0, Errors: 0, Skipped: 0, Time elapsed: 14.061 sec
Forking command line: /bin/sh -c cd <https://builds.apache.org/job/HBase-0.94-security/ws/trunk> && /home/jenkins/tools/java/jdk1.6.0_27-32/jre/bin/java -enableassertions -Xmx1900m -Djava.security.egd=file:/dev/./urandom -jar <https://builds.apache.org/job/HBase-0.94-security/ws/trunk/target/surefire/surefirebooter4962906805608019075.jar> <https://builds.apache.org/job/HBase-0.94-security/ws/trunk/target/surefire/surefire1421266248784814482tmp> <https://builds.apache.org/job/HBase-0.94-security/ws/trunk/target/surefire/surefire_965146870672534701088tmp>
Running org.apache.hadoop.hbase.rest.client.TestRemoteTable
Tests run: 3, Failures: 0, Errors: 0, Skipped: 0, Time elapsed: 13.666 sec
Forking command line: /bin/sh -c cd <https://builds.apache.org/job/HBase-0.94-security/ws/trunk> && /home/jenkins/tools/java/jdk1.6.0_27-32/jre/bin/java -enableassertions -Xmx1900m -Djava.security.egd=file:/dev/./urandom -jar <https://builds.apache.org/job/HBase-0.94-security/ws/trunk/target/surefire/surefirebooter3272765363579951031.jar> <https://builds.apache.org/job/HBase-0.94-security/ws/trunk/target/surefire/surefire1376815320897802933tmp> <https://builds.apache.org/job/HBase-0.94-security/ws/trunk/target/surefire/surefire_974114686743147764518tmp>
Running org.apache.hadoop.hbase.rest.TestVersionResource
Tests run: 7, Failures: 0, Errors: 0, Skipped: 0, Time elapsed: 11.749 sec
Forking command line: /bin/sh -c cd <https://builds.apache.org/job/HBase-0.94-security/ws/trunk> && /home/jenkins/tools/java/jdk1.6.0_27-32/jre/bin/java -enableassertions -Xmx1900m -Djava.security.egd=file:/dev/./urandom -jar <https://builds.apache.org/job/HBase-0.94-security/ws/trunk/target/surefire/surefirebooter1030933471186284061.jar> <https://builds.apache.org/job/HBase-0.94-security/ws/trunk/target/surefire/surefire5455710719201918052tmp> <https://builds.apache.org/job/HBase-0.94-security/ws/trunk/target/surefire/surefire_987086796581939959018tmp>
Running org.apache.hadoop.hbase.rest.TestScannerResource
Tests run: 5, Failures: 0, Errors: 0, Skipped: 0, Time elapsed: 28.001 sec
Forking command line: /bin/sh -c cd <https://builds.apache.org/job/HBase-0.94-security/ws/trunk> && /home/jenkins/tools/java/jdk1.6.0_27-32/jre/bin/java -enableassertions -Xmx1900m -Djava.security.egd=file:/dev/./urandom -jar <https://builds.apache.org/job/HBase-0.94-security/ws/trunk/target/surefire/surefirebooter5691064699397687283.jar> <https://builds.apache.org/job/HBase-0.94-security/ws/trunk/target/surefire/surefire6119501837055865834tmp> <https://builds.apache.org/job/HBase-0.94-security/ws/trunk/target/surefire/surefire_992584287147989513110tmp>
Running org.apache.hadoop.hbase.rest.TestTableResource
Tests run: 8, Failures: 0, Errors: 0, Skipped: 0, Time elapsed: 21.787 sec
Forking command line: /bin/sh -c cd <https://builds.apache.org/job/HBase-0.94-security/ws/trunk> && /home/jenkins/tools/java/jdk1.6.0_27-32/jre/bin/java -enableassertions -Xmx1900m -Djava.security.egd=file:/dev/./urandom -jar <https://builds.apache.org/job/HBase-0.94-security/ws/trunk/target/surefire/surefirebooter7033022751562361477.jar> <https://builds.apache.org/job/HBase-0.94-security/ws/trunk/target/surefire/surefire5271973133883529251tmp> <https://builds.apache.org/job/HBase-0.94-security/ws/trunk/target/surefire/surefire_1006876801474320755786tmp>
Running org.apache.hadoop.hbase.rest.TestStatusResource
Tests run: 2, Failures: 0, Errors: 0, Skipped: 0, Time elapsed: 11.128 sec
Forking command line: /bin/sh -c cd <https://builds.apache.org/job/HBase-0.94-security/ws/trunk> && /home/jenkins/tools/java/jdk1.6.0_27-32/jre/bin/java -enableassertions -Xmx1900m -Djava.security.egd=file:/dev/./urandom -jar <https://builds.apache.org/job/HBase-0.94-security/ws/trunk/target/surefire/surefirebooter5388606155925881090.jar> <https://builds.apache.org/job/HBase-0.94-security/ws/trunk/target/surefire/surefire3937786551984236710tmp> <https://builds.apache.org/job/HBase-0.94-security/ws/trunk/target/surefire/surefire_1013909728580081693869tmp>
Running org.apache.hadoop.hbase.rest.TestSchemaResource
Tests run: 2, Failures: 0, Errors: 0, Skipped: 0, Time elapsed: 18.37 sec
Forking command line: /bin/sh -c cd <https://builds.apache.org/job/HBase-0.94-security/ws/trunk> && /home/jenkins/tools/java/jdk1.6.0_27-32/jre/bin/java -enableassertions -Xmx1900m -Djava.security.egd=file:/dev/./urandom -jar <https://builds.apache.org/job/HBase-0.94-security/ws/trunk/target/surefire/surefirebooter8083503476165221094.jar> <https://builds.apache.org/job/HBase-0.94-security/ws/trunk/target/surefire/surefire716798833656905792tmp> <https://builds.apache.org/job/HBase-0.94-security/ws/trunk/target/surefire/surefire_1024033841307934292981tmp>
Running org.apache.hadoop.hbase.io.encoding.TestLoadAndSwitchEncodeOnDisk
Tests run: 1, Failures: 0, Errors: 0, Skipped: 0, Time elapsed: 26.729 sec
Forking command line: /bin/sh -c cd <https://builds.apache.org/job/HBase-0.94-security/ws/trunk> && /home/jenkins/tools/java/jdk1.6.0_27-32/jre/bin/java -enableassertions -Xmx1900m -Djava.security.egd=file:/dev/./urandom -jar <https://builds.apache.org/job/HBase-0.94-security/ws/trunk/target/surefire/surefirebooter8182903690311136919.jar> <https://builds.apache.org/job/HBase-0.94-security/ws/trunk/target/surefire/surefire3721215877523424575tmp> <https://builds.apache.org/job/HBase-0.94-security/ws/trunk/target/surefire/surefire_1035320224500849634407tmp>
Running org.apache.hadoop.hbase.thrift.TestThriftServer
Tests run: 1, Failures: 0, Errors: 0, Skipped: 0, Time elapsed: 43.649 sec
Forking command line: /bin/sh -c cd <https://builds.apache.org/job/HBase-0.94-security/ws/trunk> && /home/jenkins/tools/java/jdk1.6.0_27-32/jre/bin/java -enableassertions -Xmx1900m -Djava.security.egd=file:/dev/./urandom -jar <https://builds.apache.org/job/HBase-0.94-security/ws/trunk/target/surefire/surefirebooter2448803047219637282.jar> <https://builds.apache.org/job/HBase-0.94-security/ws/trunk/target/surefire/surefire1923471334944453101tmp> <https://builds.apache.org/job/HBase-0.94-security/ws/trunk/target/surefire/surefire_1046821541413724367513tmp>
Running org.apache.hadoop.hbase.io.hfile.TestHFileSeek
Tests run: 1, Failures: 0, Errors: 0, Skipped: 0, Time elapsed: 8.266 sec
Forking command line: /bin/sh -c cd <https://builds.apache.org/job/HBase-0.94-security/ws/trunk> && /home/jenkins/tools/java/jdk1.6.0_27-32/jre/bin/java -enableassertions -Xmx1900m -Djava.security.egd=file:/dev/./urandom -jar <https://builds.apache.org/job/HBase-0.94-security/ws/trunk/target/surefire/surefirebooter4450112586812197597.jar> <https://builds.apache.org/job/HBase-0.94-security/ws/trunk/target/surefire/surefire7224599775013590945tmp> <https://builds.apache.org/job/HBase-0.94-security/ws/trunk/target/surefire/surefire_1055282269140854284442tmp>
Running org.apache.hadoop.hbase.io.hfile.slab.TestSlabCache
Tests run: 7, Failures: 0, Errors: 0, Skipped: 0, Time elapsed: 18.806 sec
Forking command line: /bin/sh -c cd <https://builds.apache.org/job/HBase-0.94-security/ws/trunk> && /home/jenkins/tools/java/jdk1.6.0_27-32/jre/bin/java -enableassertions -Xmx1900m -Djava.security.egd=file:/dev/./urandom -jar <https://builds.apache.org/job/HBase-0.94-security/ws/trunk/target/surefire/surefirebooter5229867413280752220.jar> <https://builds.apache.org/job/HBase-0.94-security/ws/trunk/target/surefire/surefire263930428425020681tmp> <https://builds.apache.org/job/HBase-0.94-security/ws/trunk/target/surefire/surefire_1064860841906124795852tmp>
Running org.apache.hadoop.hbase.io.hfile.TestChecksum
Tests run: 3, Failures: 0, Errors: 0, Skipped: 0, Time elapsed: 1.027 sec
Forking command line: /bin/sh -c cd <https://builds.apache.org/job/HBase-0.94-security/ws/trunk> && /home/jenkins/tools/java/jdk1.6.0_27-32/jre/bin/java -enableassertions -Xmx1900m -Djava.security.egd=file:/dev/./urandom -jar <https://builds.apache.org/job/HBase-0.94-security/ws/trunk/target/surefire/surefirebooter3495068816375855848.jar> <https://builds.apache.org/job/HBase-0.94-security/ws/trunk/target/surefire/surefire8399668277311929987tmp> <https://builds.apache.org/job/HBase-0.94-security/ws/trunk/target/surefire/surefire_1078001810820886386807tmp>
Running org.apache.hadoop.hbase.io.hfile.TestHFileBlockIndex
Tests run: 10, Failures: 0, Errors: 0, Skipped: 0, Time elapsed: 10.523 sec
Forking command line: /bin/sh -c cd <https://builds.apache.org/job/HBase-0.94-security/ws/trunk> && /home/jenkins/tools/java/jdk1.6.0_27-32/jre/bin/java -enableassertions -Xmx1900m -Djava.security.egd=file:/dev/./urandom -jar <https://builds.apache.org/job/HBase-0.94-security/ws/trunk/target/surefire/surefirebooter9015909497985933689.jar> <https://builds.apache.org/job/HBase-0.94-security/ws/trunk/target/surefire/surefire6939816981563478416tmp> <https://builds.apache.org/job/HBase-0.94-security/ws/trunk/target/surefire/surefire_1086262002893160160092tmp>
Running org.apache.hadoop.hbase.io.hfile.slab.TestSingleSizeCache
Tests run: 5, Failures: 0, Errors: 0, Skipped: 0, Time elapsed: 29.578 sec
Forking command line: /bin/sh -c cd <https://builds.apache.org/job/HBase-0.94-security/ws/trunk> && /home/jenkins/tools/java/jdk1.6.0_27-32/jre/bin/java -enableassertions -Xmx1900m -Djava.security.egd=file:/dev/./urandom -jar <https://builds.apache.org/job/HBase-0.94-security/ws/trunk/target/surefire/surefirebooter2041505284986910313.jar> <https://builds.apache.org/job/HBase-0.94-security/ws/trunk/target/surefire/surefire1019124846366597899tmp> <https://builds.apache.org/job/HBase-0.94-security/ws/trunk/target/surefire/surefire_1094471127151732182831tmp>
Running org.apache.hadoop.hbase.io.hfile.TestLruBlockCache
Tests run: 16, Failures: 0, Errors: 0, Skipped: 0, Time elapsed: 0.742 sec
Forking command line: /bin/sh -c cd <https://builds.apache.org/job/HBase-0.94-security/ws/trunk> && /home/jenkins/tools/java/jdk1.6.0_27-32/jre/bin/java -enableassertions -Xmx1900m -Djava.security.egd=file:/dev/./urandom -jar <https://builds.apache.org/job/HBase-0.94-security/ws/trunk/target/surefire/surefirebooter3482399539354568147.jar> <https://builds.apache.org/job/HBase-0.94-security/ws/trunk/target/surefire/surefire244295705256899849tmp> <https://builds.apache.org/job/HBase-0.94-security/ws/trunk/target/surefire/surefire_1106566761655782133625tmp>
Running org.apache.hadoop.hbase.io.hfile.TestFixedFileTrailer
Tests run: 2, Failures: 0, Errors: 0, Skipped: 0, Time elapsed: 0.581 sec
Forking command line: /bin/sh -c cd <https://builds.apache.org/job/HBase-0.94-security/ws/trunk> && /home/jenkins/tools/java/jdk1.6.0_27-32/jre/bin/java -enableassertions -Xmx1900m -Djava.security.egd=file:/dev/./urandom -jar <https://builds.apache.org/job/HBase-0.94-security/ws/trunk/target/surefire/surefirebooter2425603236002837629.jar> <https://builds.apache.org/job/HBase-0.94-security/ws/trunk/target/surefire/surefire2995820512982302336tmp> <https://builds.apache.org/job/HBase-0.94-security/ws/trunk/target/surefire/surefire_1112223716047207877220tmp>
Running org.apache.hadoop.hbase.io.hfile.TestHFileBlockCompatibility
Tests run: 10, Failures: 0, Errors: 0, Skipped: 0, Time elapsed: 1.161 sec
Forking command line: /bin/sh -c cd <https://builds.apache.org/job/HBase-0.94-security/ws/trunk> && /home/jenkins/tools/java/jdk1.6.0_27-32/jre/bin/java -enableassertions -Xmx1900m -Djava.security.egd=file:/dev/./urandom -jar <https://builds.apache.org/job/HBase-0.94-security/ws/trunk/target/surefire/surefirebooter338968878410191063.jar> <https://builds.apache.org/job/HBase-0.94-security/ws/trunk/target/surefire/surefire7552110788588771789tmp> <https://builds.apache.org/job/HBase-0.94-security/ws/trunk/target/surefire/surefire_1124085771346911709090tmp>
Running org.apache.hadoop.hbase.io.hfile.TestHFilePerformance
Tests run: 1, Failures: 0, Errors: 0, Skipped: 0, Time elapsed: 6.757 sec
Forking command line: /bin/sh -c cd <https://builds.apache.org/job/HBase-0.94-security/ws/trunk> && /home/jenkins/tools/java/jdk1.6.0_27-32/jre/bin/java -enableassertions -Xmx1900m -Djava.security.egd=file:/dev/./urandom -jar <https://builds.apache.org/job/HBase-0.94-security/ws/trunk/target/surefire/surefirebooter830638112808633506.jar> <https://builds.apache.org/job/HBase-0.94-security/ws/trunk/target/surefire/surefire4509034379849079927tmp> <https://builds.apache.org/job/HBase-0.94-security/ws/trunk/target/surefire/surefire_1135576157974529714248tmp>
Running org.apache.hadoop.hbase.io.hfile.TestHFileBlock
Tests run: 16, Failures: 0, Errors: 0, Skipped: 0, Time elapsed: 49.05 sec
Forking command line: /bin/sh -c cd <https://builds.apache.org/job/HBase-0.94-security/ws/trunk> && /home/jenkins/tools/java/jdk1.6.0_27-32/jre/bin/java -enableassertions -Xmx1900m -Djava.security.egd=file:/dev/./urandom -jar <https://builds.apache.org/job/HBase-0.94-security/ws/trunk/target/surefire/surefirebooter2674345376942687660.jar> <https://builds.apache.org/job/HBase-0.94-security/ws/trunk/target/surefire/surefire6005240555349444873tmp> <https://builds.apache.org/job/HBase-0.94-security/ws/trunk/target/surefire/surefire_1143623757753254894533tmp>
Running org.apache.hadoop.hbase.io.hfile.TestForceCacheImportantBlocks
Tests run: 4, Failures: 0, Errors: 0, Skipped: 0, Time elapsed: 61.568 sec
Forking command line: /bin/sh -c cd <https://builds.apache.org/job/HBase-0.94-security/ws/trunk> && /home/jenkins/tools/java/jdk1.6.0_27-32/jre/bin/java -enableassertions -Xmx1900m -Djava.security.egd=file:/dev/./urandom -jar <https://builds.apache.org/job/HBase-0.94-security/ws/trunk/target/surefire/surefirebooter8397078309799521888.jar> <https://builds.apache.org/job/HBase-0.94-security/ws/trunk/target/surefire/surefire1277657903067716691tmp> <https://builds.apache.org/job/HBase-0.94-security/ws/trunk/target/surefire/surefire_115807084411692410746tmp>
Running org.apache.hadoop.hbase.io.hfile.TestCacheOnWrite
Tests run: 36, Failures: 0, Errors: 0, Skipped: 0, Time elapsed: 35.569 sec
Forking command line: /bin/sh -c cd <https://builds.apache.org/job/HBase-0.94-security/ws/trunk> && /home/jenkins/tools/java/jdk1.6.0_27-32/jre/bin/java -enableassertions -Xmx1900m -Djava.security.egd=file:/dev/./urandom -jar <https://builds.apache.org/job/HBase-0.94-security/ws/trunk/target/surefire/surefirebooter5838435160791213669.jar> <https://builds.apache.org/job/HBase-0.94-security/ws/trunk/target/surefire/surefire7952908709586473350tmp> <https://builds.apache.org/job/HBase-0.94-security/ws/trunk/target/surefire/surefire_1165606157241280128177tmp>
Running org.apache.hadoop.hbase.TestClusterBootOrder
Tests run: 2, Failures: 0, Errors: 0, Skipped: 0, Time elapsed: 28.219 sec
Forking command line: /bin/sh -c cd <https://builds.apache.org/job/HBase-0.94-security/ws/trunk> && /home/jenkins/tools/java/jdk1.6.0_27-32/jre/bin/java -enableassertions -Xmx1900m -Djava.security.egd=file:/dev/./urandom -jar <https://builds.apache.org/job/HBase-0.94-security/ws/trunk/target/surefire/surefirebooter6654316453108428313.jar> <https://builds.apache.org/job/HBase-0.94-security/ws/trunk/target/surefire/surefire7549789008294769246tmp> <https://builds.apache.org/job/HBase-0.94-security/ws/trunk/target/surefire/surefire_1174318116974424768162tmp>
Running org.apache.hadoop.hbase.replication.regionserver.TestReplicationSourceManager
Tests run: 1, Failures: 0, Errors: 0, Skipped: 0, Time elapsed: 0.986 sec
Forking command line: /bin/sh -c cd <https://builds.apache.org/job/HBase-0.94-security/ws/trunk> && /home/jenkins/tools/java/jdk1.6.0_27-32/jre/bin/java -enableassertions -Xmx1900m -Djava.security.egd=file:/dev/./urandom -jar <https://builds.apache.org/job/HBase-0.94-security/ws/trunk/target/surefire/surefirebooter4820372066478297607.jar> <https://builds.apache.org/job/HBase-0.94-security/ws/trunk/target/surefire/surefire3730650441944195439tmp> <https://builds.apache.org/job/HBase-0.94-security/ws/trunk/target/surefire/surefire_1183660905777267378072tmp>
Running org.apache.hadoop.hbase.replication.regionserver.TestReplicationSink
Tests run: 5, Failures: 0, Errors: 0, Skipped: 0, Time elapsed: 16.396 sec
Forking command line: /bin/sh -c cd <https://builds.apache.org/job/HBase-0.94-security/ws/trunk> && /home/jenkins/tools/java/jdk1.6.0_27-32/jre/bin/java -enableassertions -Xmx1900m -Djava.security.egd=file:/dev/./urandom -jar <https://builds.apache.org/job/HBase-0.94-security/ws/trunk/target/surefire/surefirebooter1253222369959353945.jar> <https://builds.apache.org/job/HBase-0.94-security/ws/trunk/target/surefire/surefire7624628749904748791tmp> <https://builds.apache.org/job/HBase-0.94-security/ws/trunk/target/surefire/surefire_1191152308363253932706tmp>
Running org.apache.hadoop.hbase.replication.TestReplicationSource
Tests run: 1, Failures: 0, Errors: 0, Skipped: 0, Time elapsed: 2.649 sec
Forking command line: /bin/sh -c cd <https://builds.apache.org/job/HBase-0.94-security/ws/trunk> && /home/jenkins/tools/java/jdk1.6.0_27-32/jre/bin/java -enableassertions -Xmx1900m -Djava.security.egd=file:/dev/./urandom -jar <https://builds.apache.org/job/HBase-0.94-security/ws/trunk/target/surefire/surefirebooter7622502448682888819.jar> <https://builds.apache.org/job/HBase-0.94-security/ws/trunk/target/surefire/surefire512493739906715156tmp> <https://builds.apache.org/job/HBase-0.94-security/ws/trunk/target/surefire/surefire_1204428116378971862224tmp>
Running org.apache.hadoop.hbase.avro.TestAvroServer
Tests run: 3, Failures: 0, Errors: 0, Skipped: 0, Time elapsed: 25.414 sec
Forking command line: /bin/sh -c cd <https://builds.apache.org/job/HBase-0.94-security/ws/trunk> && /home/jenkins/tools/java/jdk1.6.0_27-32/jre/bin/java -enableassertions -Xmx1900m -Djava.security.egd=file:/dev/./urandom -jar <https://builds.apache.org/job/HBase-0.94-security/ws/trunk/target/surefire/surefirebooter6272294807511009089.jar> <https://builds.apache.org/job/HBase-0.94-security/ws/trunk/target/surefire/surefire370157540372637883tmp> <https://builds.apache.org/job/HBase-0.94-security/ws/trunk/target/surefire/surefire_1214472397615728277381tmp>
Running org.apache.hadoop.hbase.replication.TestReplicationZookeeper
Tests run: 1, Failures: 0, Errors: 0, Skipped: 0, Time elapsed: 0.582 sec
Forking command line: /bin/sh -c cd <https://builds.apache.org/job/HBase-0.94-security/ws/trunk> && /home/jenkins/tools/java/jdk1.6.0_27-32/jre/bin/java -enableassertions -Xmx1900m -Djava.security.egd=file:/dev/./urandom -jar <https://builds.apache.org/job/HBase-0.94-security/ws/trunk/target/surefire/surefirebooter6300150867204898006.jar> <https://builds.apache.org/job/HBase-0.94-security/ws/trunk/target/surefire/surefire3951335702496482718tmp> <https://builds.apache.org/job/HBase-0.94-security/ws/trunk/target/surefire/surefire_1227609370475662517247tmp>
Running org.apache.hadoop.hbase.ipc.TestDelayedRpc
Tests run: 4, Failures: 0, Errors: 0, Skipped: 0, Time elapsed: 2.285 sec
Running org.apache.hadoop.hbase.replication.TestReplicationPeer
Tests run: 1, Failures: 0, Errors: 0, Skipped: 0, Time elapsed: 7.591 sec

Results :

Tests in error: 
  testLocalHBaseCluster(org.apache.hadoop.hbase.TestLocalHBaseCluster): Master not initialized after 200 seconds

Tests run: 632, Failures: 0, Errors: 1, Skipped: 2

[INFO] ------------------------------------------------------------------------
[INFO] BUILD FAILURE
[INFO] ------------------------------------------------------------------------
[INFO] Total time: 26:55.586s
[INFO] Finished at: Tue May 22 23:09:55 UTC 2012
[INFO] Final Memory: 47M/472M
[INFO] ------------------------------------------------------------------------
[ERROR] Failed to execute goal org.apache.maven.plugins:maven-surefire-plugin:2.12-TRUNK-HBASE-2:test (secondPartTestsExecution) on project hbase: There are test failures.
[ERROR] 
[ERROR] Please refer to <https://builds.apache.org/job/HBase-0.94-security/ws/trunk/target/surefire-reports> for the individual test results.
[ERROR] -> [Help 1]
org.apache.maven.lifecycle.LifecycleExecutionException: Failed to execute goal org.apache.maven.plugins:maven-surefire-plugin:2.12-TRUNK-HBASE-2:test (secondPartTestsExecution) on project hbase: There are test failures.

Please refer to <https://builds.apache.org/job/HBase-0.94-security/ws/trunk/target/surefire-reports> for the individual test results.
	at org.apache.maven.lifecycle.internal.MojoExecutor.execute(MojoExecutor.java:213)
	at org.apache.maven.lifecycle.internal.MojoExecutor.execute(MojoExecutor.java:153)
	at org.apache.maven.lifecycle.internal.MojoExecutor.execute(MojoExecutor.java:145)
	at org.apache.maven.lifecycle.internal.MojoExecutor.executeForkedExecutions(MojoExecutor.java:365)
	at org.apache.maven.lifecycle.internal.MojoExecutor.execute(MojoExecutor.java:199)
	at org.apache.maven.lifecycle.internal.MojoExecutor.execute(MojoExecutor.java:153)
	at org.apache.maven.lifecycle.internal.MojoExecutor.execute(MojoExecutor.java:145)
	at org.apache.maven.lifecycle.internal.LifecycleModuleBuilder.buildProject(LifecycleModuleBuilder.java:84)
	at org.apache.maven.lifecycle.internal.LifecycleModuleBuilder.buildProject(LifecycleModuleBuilder.java:59)
	at org.apache.maven.lifecycle.internal.LifecycleStarter.singleThreadedBuild(LifecycleStarter.java:183)
	at org.apache.maven.lifecycle.internal.LifecycleStarter.execute(LifecycleStarter.java:161)
	at org.apache.maven.DefaultMaven.doExecute(DefaultMaven.java:319)
	at org.apache.maven.DefaultMaven.execute(DefaultMaven.java:156)
	at org.apache.maven.cli.MavenCli.execute(MavenCli.java:537)
	at org.apache.maven.cli.MavenCli.doMain(MavenCli.java:196)
	at org.apache.maven.cli.MavenCli.main(MavenCli.java:141)
	at sun.reflect.NativeMethodAccessorImpl.invoke0(Native Method)
	at sun.reflect.NativeMethodAccessorImpl.invoke(NativeMethodAccessorImpl.java:39)
	at sun.reflect.DelegatingMethodAccessorImpl.invoke(DelegatingMethodAccessorImpl.java:25)
	at java.lang.reflect.Method.invoke(Method.java:597)
	at org.codehaus.plexus.classworlds.launcher.Launcher.launchEnhanced(Launcher.java:290)
	at org.codehaus.plexus.classworlds.launcher.Launcher.launch(Launcher.java:230)
	at org.codehaus.plexus.classworlds.launcher.Launcher.mainWithExitCode(Launcher.java:409)
	at org.codehaus.plexus.classworlds.launcher.Launcher.main(Launcher.java:352)
Caused by: org.apache.maven.plugin.MojoFailureException: There are test failures.

Please refer to <https://builds.apache.org/job/HBase-0.94-security/ws/trunk/target/surefire-reports> for the individual test results.
	at org.apache.maven.plugin.surefire.SurefireHelper.reportExecution(SurefireHelper.java:87)
	at org.apache.maven.plugin.surefire.SurefirePlugin.writeSummary(SurefirePlugin.java:651)
	at org.apache.maven.plugin.surefire.SurefirePlugin.handleSummary(SurefirePlugin.java:625)
	at org.apache.maven.plugin.surefire.AbstractSurefireMojo.executeAfterPreconditionsChecked(AbstractSurefireMojo.java:137)
	at org.apache.maven.plugin.surefire.AbstractSurefireMojo.execute(AbstractSurefireMojo.java:98)
	at org.apache.maven.plugin.DefaultBuildPluginManager.executeMojo(DefaultBuildPluginManager.java:101)
	at org.apache.maven.lifecycle.internal.MojoExecutor.execute(MojoExecutor.java:209)
	... 23 more
[ERROR] 
[ERROR] 
[ERROR] For more information about the errors and possible solutions, please read the following articles:
[ERROR] [Help 1] http://cwiki.apache.org/confluence/display/MAVEN/MojoFailureException
Build step 'Invoke top-level Maven targets' marked build as failure
Archiving artifacts
Updating HBASE-6044
Updating HBASE-5757
Updating HBASE-5840
Updating HBASE-6061
Updating HBASE-6056
Recording test results

Jenkins build is back to normal : HBase-0.94-security #32

Posted by Apache Jenkins Server <je...@builds.apache.org>.
See <https://builds.apache.org/job/HBase-0.94-security/32/changes>


Build failed in Jenkins: HBase-0.94-security #31

Posted by Apache Jenkins Server <je...@builds.apache.org>.
See <https://builds.apache.org/job/HBase-0.94-security/31/changes>

Changes:

[apurtell] Amend HBASE-6077. Replace HTML formatting that does not work with Docbook

------------------------------------------
[...truncated 1895 lines...]
[DEBUG]   (s) outputDir = <https://builds.apache.org/job/HBase-0.94-security/ws/trunk/target/site>
[DEBUG]   (f) transformationSets = [org.codehaus.mojo.xml.transformer.TransformationSet@1875da7]
[DEBUG] -- end configuration --
[DEBUG] Depends <https://builds.apache.org/job/HBase-0.94-security/ws/trunk/pom.xml>: Fri May 25 08:59:41 UTC 2012
[DEBUG] Depends <https://builds.apache.org/job/HBase-0.94-security/ws/trunk/src/main/xslt/configuration_to_docbook_section.xsl>: Fri May 25 08:59:41 UTC 2012
[DEBUG] Depends []: Thu Jan 01 00:00:00 UTC 1970
[DEBUG] Depends <https://builds.apache.org/job/HBase-0.94-security/ws/trunk/src/main/resources/hbase-default.xml>: Fri May 25 08:59:41 UTC 2012
[DEBUG] Produces <https://builds.apache.org/job/HBase-0.94-security/31/artifact/trunk/target/site/hbase-default.xml>: Thu Jan 01 00:00:00 UTC 1970
[DEBUG] Depends timeStamp: 1337936381000, produces timestamp: 0
[INFO] Transforming file: <https://builds.apache.org/job/HBase-0.94-security/ws/trunk/src/main/resources/hbase-default.xml>
[INFO] Transformed 1 file(s).
[INFO] 
[INFO] --- docbkx-maven-plugin:2.0.13:generate-html (multipage) @ hbase ---
[DEBUG] com.agilejava.docbkx:docbkx-maven-plugin:jar:2.0.13:
[DEBUG]    org.docbook:docbook-xml:jar:4.4:runtime
[DEBUG]    antlr:stringtemplate:jar:2.2:compile
[DEBUG]       antlr:antlr:jar:2.7.2:compile
[DEBUG]    xerces:xercesImpl:jar:2.8.0:runtime
[DEBUG]       xml-apis:xml-apis:jar:1.3.03:compile
[DEBUG]    xerces:xmlParserAPIs:jar:2.6.2:runtime
[DEBUG]    org.apache.xmlgraphics:fop:jar:1.0:compile
[DEBUG]       org.apache.xmlgraphics:xmlgraphics-commons:jar:1.4:compile
[DEBUG]       org.apache.xmlgraphics:batik-svg-dom:jar:1.7:compile
[DEBUG]          org.apache.xmlgraphics:batik-anim:jar:1.7:compile
[DEBUG]          org.apache.xmlgraphics:batik-css:jar:1.7:compile
[DEBUG]          org.apache.xmlgraphics:batik-dom:jar:1.7:compile
[DEBUG]          org.apache.xmlgraphics:batik-parser:jar:1.7:compile
[DEBUG]          org.apache.xmlgraphics:batik-util:jar:1.7:compile
[DEBUG]          xml-apis:xml-apis-ext:jar:1.3.04:compile
[DEBUG]       org.apache.xmlgraphics:batik-bridge:jar:1.7:compile
[DEBUG]          org.apache.xmlgraphics:batik-script:jar:1.7:compile
[DEBUG]             org.apache.xmlgraphics:batik-js:jar:1.7:compile
[DEBUG]          org.apache.xmlgraphics:batik-xml:jar:1.7:compile
[DEBUG]       org.apache.xmlgraphics:batik-awt-util:jar:1.7:compile
[DEBUG]       org.apache.xmlgraphics:batik-gvt:jar:1.7:compile
[DEBUG]       org.apache.xmlgraphics:batik-transcoder:jar:1.7:compile
[DEBUG]          org.apache.xmlgraphics:batik-svggen:jar:1.7:compile
[DEBUG]       org.apache.xmlgraphics:batik-extension:jar:1.7:compile
[DEBUG]       org.apache.xmlgraphics:batik-ext:jar:1.7:compile
[DEBUG]       commons-logging:commons-logging:jar:1.0.4:compile
[DEBUG]       commons-io:commons-io:jar:1.3.1:compile
[DEBUG]       org.apache.avalon.framework:avalon-framework-api:jar:4.3.1:compile
[DEBUG]    org.apache.avalon.framework:avalon-framework-impl:jar:4.3.1:compile
[DEBUG]    xalan:xalan:jar:2.7.0:compile
[DEBUG]    org.apache.maven:maven-plugin-api:jar:2.0:compile
[DEBUG]    org.apache.maven:maven-project:jar:2.0.4:compile
[DEBUG]       org.apache.maven:maven-settings:jar:2.0.4:compile
[DEBUG]       org.apache.maven:maven-profile:jar:2.0.4:compile
[DEBUG]       org.apache.maven:maven-model:jar:2.0.4:compile
[DEBUG]       org.apache.maven:maven-artifact-manager:jar:2.0.4:compile
[DEBUG]          org.apache.maven:maven-repository-metadata:jar:2.0.4:compile
[DEBUG]       org.codehaus.plexus:plexus-utils:jar:1.1:compile
[DEBUG]       org.apache.maven:maven-artifact:jar:2.0.4:compile
[DEBUG]       org.codehaus.plexus:plexus-container-default:jar:1.0-alpha-9:compile
[DEBUG]          junit:junit:jar:3.8.1:compile
[DEBUG]          classworlds:classworlds:jar:1.1-alpha-2:compile
[DEBUG]    com.agilejava.docbkx:docbkx-maven-base:jar:2.0.13:compile
[DEBUG]       commons-el:commons-el:jar:1.0:compile
[DEBUG]       javax.servlet.jsp:jsp-api:jar:2.0:compile
[DEBUG]       jaxen:jaxen:jar:1.0-FCS:compile
[DEBUG]       saxpath:saxpath:jar:1.0-FCS:compile
[DEBUG]       xom:xom:jar:1.1:compile
[DEBUG]       saxon:saxon:jar:6.5.3:compile
[DEBUG]       xml-resolver:xml-resolver:jar:1.1:compile
[DEBUG]       plexus:plexus-utils:jar:1.0.1:compile
[DEBUG]       org.codehaus.plexus:plexus-archiver:jar:1.0-alpha-5:compile
[DEBUG]       org.apache.maven.plugins:maven-antrun-plugin:jar:1.1:compile
[DEBUG]          ant:ant-launcher:jar:1.6.5:runtime
[DEBUG]          ant:ant:jar:1.6.5:compile
[DEBUG]    net.sf.xslthl:xslthl:jar:2.0.1:compile
[DEBUG]    net.sf.docbook:docbook-xsl:zip:ns-resources:1.76.1:compile
[DEBUG]    net.sf.docbook:docbook-xsl-saxon:jar:1.0.0:compile
[DEBUG]    net.sf.docbook:docbook-xsl-webhelpindexer:jar:1.0.0:compile
[DEBUG]       org.apache.lucene:lucene-core:jar:3.0.0:compile
[DEBUG]       org.apache.lucene:lucene-analyzers:jar:3.0.0:compile
[DEBUG]       org.apache.ant:ant:jar:1.7.0:compile
[DEBUG]          org.apache.ant:ant-launcher:jar:1.7.0:compile
[DEBUG] Created new class realm plugin>com.agilejava.docbkx:docbkx-maven-plugin:2.0.13
[DEBUG] Importing foreign packages into class realm plugin>com.agilejava.docbkx:docbkx-maven-plugin:2.0.13
[DEBUG]   Imported:  < maven.api
[DEBUG] Populating class realm plugin>com.agilejava.docbkx:docbkx-maven-plugin:2.0.13
[DEBUG]   Included: com.agilejava.docbkx:docbkx-maven-plugin:jar:2.0.13
[DEBUG]   Included: org.docbook:docbook-xml:jar:4.4
[DEBUG]   Included: antlr:stringtemplate:jar:2.2
[DEBUG]   Included: antlr:antlr:jar:2.7.2
[DEBUG]   Included: xerces:xercesImpl:jar:2.8.0
[DEBUG]   Included: xml-apis:xml-apis:jar:1.3.03
[DEBUG]   Included: xerces:xmlParserAPIs:jar:2.6.2
[DEBUG]   Included: org.apache.xmlgraphics:fop:jar:1.0
[DEBUG]   Included: org.apache.xmlgraphics:xmlgraphics-commons:jar:1.4
[DEBUG]   Included: org.apache.xmlgraphics:batik-svg-dom:jar:1.7
[DEBUG]   Included: org.apache.xmlgraphics:batik-anim:jar:1.7
[DEBUG]   Included: org.apache.xmlgraphics:batik-css:jar:1.7
[DEBUG]   Included: org.apache.xmlgraphics:batik-dom:jar:1.7
[DEBUG]   Included: org.apache.xmlgraphics:batik-parser:jar:1.7
[DEBUG]   Included: org.apache.xmlgraphics:batik-util:jar:1.7
[DEBUG]   Included: xml-apis:xml-apis-ext:jar:1.3.04
[DEBUG]   Included: org.apache.xmlgraphics:batik-bridge:jar:1.7
[DEBUG]   Included: org.apache.xmlgraphics:batik-script:jar:1.7
[DEBUG]   Included: org.apache.xmlgraphics:batik-js:jar:1.7
[DEBUG]   Included: org.apache.xmlgraphics:batik-xml:jar:1.7
[DEBUG]   Included: org.apache.xmlgraphics:batik-awt-util:jar:1.7
[DEBUG]   Included: org.apache.xmlgraphics:batik-gvt:jar:1.7
[DEBUG]   Included: org.apache.xmlgraphics:batik-transcoder:jar:1.7
[DEBUG]   Included: org.apache.xmlgraphics:batik-svggen:jar:1.7
[DEBUG]   Included: org.apache.xmlgraphics:batik-extension:jar:1.7
[DEBUG]   Included: org.apache.xmlgraphics:batik-ext:jar:1.7
[DEBUG]   Included: commons-logging:commons-logging:jar:1.0.4
[DEBUG]   Included: commons-io:commons-io:jar:1.3.1
[DEBUG]   Included: org.apache.avalon.framework:avalon-framework-api:jar:4.3.1
[DEBUG]   Included: org.apache.avalon.framework:avalon-framework-impl:jar:4.3.1
[DEBUG]   Included: xalan:xalan:jar:2.7.0
[DEBUG]   Included: org.codehaus.plexus:plexus-utils:jar:1.1
[DEBUG]   Included: junit:junit:jar:3.8.1
[DEBUG]   Included: com.agilejava.docbkx:docbkx-maven-base:jar:2.0.13
[DEBUG]   Included: commons-el:commons-el:jar:1.0
[DEBUG]   Included: javax.servlet.jsp:jsp-api:jar:2.0
[DEBUG]   Included: jaxen:jaxen:jar:1.0-FCS
[DEBUG]   Included: saxpath:saxpath:jar:1.0-FCS
[DEBUG]   Included: xom:xom:jar:1.1
[DEBUG]   Included: saxon:saxon:jar:6.5.3
[DEBUG]   Included: xml-resolver:xml-resolver:jar:1.1
[DEBUG]   Included: plexus:plexus-utils:jar:1.0.1
[DEBUG]   Included: org.codehaus.plexus:plexus-archiver:jar:1.0-alpha-5
[DEBUG]   Included: org.apache.maven.plugins:maven-antrun-plugin:jar:1.1
[DEBUG]   Included: ant:ant-launcher:jar:1.6.5
[DEBUG]   Included: ant:ant:jar:1.6.5
[DEBUG]   Included: net.sf.xslthl:xslthl:jar:2.0.1
[DEBUG]   Included: net.sf.docbook:docbook-xsl:zip:ns-resources:1.76.1
[DEBUG]   Included: net.sf.docbook:docbook-xsl-saxon:jar:1.0.0
[DEBUG]   Included: net.sf.docbook:docbook-xsl-webhelpindexer:jar:1.0.0
[DEBUG]   Included: org.apache.lucene:lucene-core:jar:3.0.0
[DEBUG]   Included: org.apache.lucene:lucene-analyzers:jar:3.0.0
[DEBUG]   Included: org.apache.ant:ant:jar:1.7.0
[DEBUG]   Included: org.apache.ant:ant-launcher:jar:1.7.0
[DEBUG]   Excluded: org.apache.maven:maven-plugin-api:jar:2.0
[DEBUG]   Excluded: org.apache.maven:maven-project:jar:2.0.4
[DEBUG]   Excluded: org.apache.maven:maven-settings:jar:2.0.4
[DEBUG]   Excluded: org.apache.maven:maven-profile:jar:2.0.4
[DEBUG]   Excluded: org.apache.maven:maven-model:jar:2.0.4
[DEBUG]   Excluded: org.apache.maven:maven-artifact-manager:jar:2.0.4
[DEBUG]   Excluded: org.apache.maven:maven-repository-metadata:jar:2.0.4
[DEBUG]   Excluded: org.apache.maven:maven-artifact:jar:2.0.4
[DEBUG]   Excluded: org.codehaus.plexus:plexus-container-default:jar:1.0-alpha-9
[DEBUG]   Excluded: classworlds:classworlds:jar:1.1-alpha-2
[DEBUG] Configuring mojo com.agilejava.docbkx:docbkx-maven-plugin:2.0.13:generate-html from plugin realm ClassRealm[plugin>com.agilejava.docbkx:docbkx-maven-plugin:2.0.13, parent: sun.misc.Launcher$AppClassLoader@192d342]
[DEBUG] Configuring mojo 'com.agilejava.docbkx:docbkx-maven-plugin:2.0.13:generate-html' with override configurator -->
[DEBUG]   (f) artifacts = [com.agilejava.docbkx:docbkx-maven-plugin:maven-plugin:2.0.13:, org.docbook:docbook-xml:jar:4.4:runtime, antlr:stringtemplate:jar:2.2:compile, antlr:antlr:jar:2.7.2:compile, xerces:xercesImpl:jar:2.8.0:runtime, xml-apis:xml-apis:jar:1.3.03:compile, xerces:xmlParserAPIs:jar:2.6.2:runtime, org.apache.xmlgraphics:fop:jar:1.0:compile, org.apache.xmlgraphics:xmlgraphics-commons:jar:1.4:compile, org.apache.xmlgraphics:batik-svg-dom:jar:1.7:compile, org.apache.xmlgraphics:batik-anim:jar:1.7:compile, org.apache.xmlgraphics:batik-css:jar:1.7:compile, org.apache.xmlgraphics:batik-dom:jar:1.7:compile, org.apache.xmlgraphics:batik-parser:jar:1.7:compile, org.apache.xmlgraphics:batik-util:jar:1.7:compile, xml-apis:xml-apis-ext:jar:1.3.04:compile, org.apache.xmlgraphics:batik-bridge:jar:1.7:compile, org.apache.xmlgraphics:batik-script:jar:1.7:compile, org.apache.xmlgraphics:batik-js:jar:1.7:compile, org.apache.xmlgraphics:batik-xml:jar:1.7:compile, org.apache.xmlgraphics:batik-awt-util:jar:1.7:compile, org.apache.xmlgraphics:batik-gvt:jar:1.7:compile, org.apache.xmlgraphics:batik-transcoder:jar:1.7:compile, org.apache.xmlgraphics:batik-svggen:jar:1.7:compile, org.apache.xmlgraphics:batik-extension:jar:1.7:compile, org.apache.xmlgraphics:batik-ext:jar:1.7:compile, commons-logging:commons-logging:jar:1.0.4:compile, commons-io:commons-io:jar:1.3.1:compile, org.apache.avalon.framework:avalon-framework-api:jar:4.3.1:compile, org.apache.avalon.framework:avalon-framework-impl:jar:4.3.1:compile, xalan:xalan:jar:2.7.0:compile, org.codehaus.plexus:plexus-utils:jar:1.1:compile, junit:junit:jar:3.8.1:compile, com.agilejava.docbkx:docbkx-maven-base:jar:2.0.13:compile, commons-el:commons-el:jar:1.0:compile, javax.servlet.jsp:jsp-api:jar:2.0:compile, jaxen:jaxen:jar:1.0-FCS:compile, saxpath:saxpath:jar:1.0-FCS:compile, xom:xom:jar:1.1:compile, saxon:saxon:jar:6.5.3:compile, xml-resolver:xml-resolver:jar:1.1:compile, plexus:plexus-utils:jar:1.0.1:compile, org.codehaus.plexus:plexus-archiver:jar:1.0-alpha-5:compile, org.apache.maven.plugins:maven-antrun-plugin:jar:1.1:compile, ant:ant-launcher:jar:1.6.5:runtime, ant:ant:jar:1.6.5:compile, net.sf.xslthl:xslthl:jar:2.0.1:compile, net.sf.docbook:docbook-xsl:zip:ns-resources:1.76.1:compile, net.sf.docbook:docbook-xsl-saxon:jar:1.0.0:compile, net.sf.docbook:docbook-xsl-webhelpindexer:jar:1.0.0:compile, org.apache.lucene:lucene-core:jar:3.0.0:compile, org.apache.lucene:lucene-analyzers:jar:3.0.0:compile, org.apache.ant:ant:jar:1.7.0:compile, org.apache.ant:ant-launcher:jar:1.7.0:compile]
[DEBUG]   (f) chunkedOutput = true
[DEBUG]   (f) htmlCustomization = src/docbkx/customization.xsl
[DEBUG]   (f) htmlStylesheet = ../css/freebsd_docbook.css
[DEBUG]   (f) imgSrcPath = ../images/
[DEBUG]   (f) includes = *.xml
[DEBUG]   (f) insertXrefPageNumber = yes
[DEBUG]   (f) navigShowtitles = true
[DEBUG]   (f) project = MavenProject: org.apache.hbase:hbase:0.94.1-SNAPSHOT @ <https://builds.apache.org/job/HBase-0.94-security/ws/trunk/pom.xml>
[DEBUG]   (f) sectionAutolabel = true
[DEBUG]   (f) sectionAutolabelMaxDepth = 100
[DEBUG]   (f) sectionLabelIncludesComponentLabel = true
[DEBUG]   (f) sourceDirectory = <https://builds.apache.org/job/HBase-0.94-security/ws/trunk/src/docbkx>
[DEBUG]   (f) targetDirectory = <https://builds.apache.org/job/HBase-0.94-security/31/artifact/trunk/target/site/book>
[DEBUG]   (s) targetFileExtension = html
[DEBUG]   (f) tocMaxDepth = 2
[DEBUG]   (f) useIdAsFilename = true
[DEBUG]   (f) xincludeSupported = true
[DEBUG] -- end configuration --
[DEBUG] Catalogs to load: jar:file:/home/jenkins/.m2/repository/org/docbook/docbook-xml/4.4/docbook-xml-4.4.jar!/catalog.xml;jar:file:/home/jenkins/.m2/repository/net/sf/docbook/docbook-xsl/1.76.1/docbook-xsl-1.76.1-ns-resources.zip!/docbook/catalog.xml
[DEBUG] Using stylesheet: jar:file:/home/jenkins/.m2/repository/net/sf/docbook/docbook-xsl/1.76.1/docbook-xsl-1.76.1-ns-resources.zip!/docbook/html/chunk.xsl
[DEBUG] SourceFile: <https://builds.apache.org/job/HBase-0.94-security/ws/trunk/src/docbkx/troubleshooting.xml>
[DEBUG] TargetDirectory: <https://builds.apache.org/job/HBase-0.94-security/31/artifact/trunk/target/site/book>
[INFO] Processing input file: troubleshooting.xml
[DEBUG] Xerces XInclude mode entered
[DEBUG] Customization: src/docbkx/customization.xsl
[DEBUG] Customization: src/docbkx/customization.xsl
[DEBUG] Customization: src/docbkx/customization.xsl
[DEBUG] Configure the transformer.
[INFO] Chunking output.
Error on line 620 column 396 of file://<https://builds.apache.org/job/HBase-0.94-security/ws/trunk/src/docbkx/troubleshooting.xml>:
  Error reported by XML parser: The element type "para" must be terminated by the matching end-tag "</para>".
[INFO]                                                                         
[INFO] ------------------------------------------------------------------------
[INFO] Skipping HBase
[INFO] This project has been banned from the build due to previous failures.
[INFO] ------------------------------------------------------------------------
[INFO] ------------------------------------------------------------------------
[INFO] BUILD FAILURE
[INFO] ------------------------------------------------------------------------
[INFO] Total time: 10.737s
[INFO] Finished at: Fri May 25 09:07:27 UTC 2012
[INFO] Final Memory: 11M/110M
[INFO] ------------------------------------------------------------------------
[ERROR] Failed to execute goal com.agilejava.docbkx:docbkx-maven-plugin:2.0.13:generate-html (multipage) on project hbase: Failed to transform troubleshooting.xml. org.xml.sax.SAXParseException: The element type "para" must be terminated by the matching end-tag "</para>". -> [Help 1]
org.apache.maven.lifecycle.LifecycleExecutionException: Failed to execute goal com.agilejava.docbkx:docbkx-maven-plugin:2.0.13:generate-html (multipage) on project hbase: Failed to transform troubleshooting.xml.
	at org.apache.maven.lifecycle.internal.MojoExecutor.execute(MojoExecutor.java:217)
	at org.apache.maven.lifecycle.internal.MojoExecutor.execute(MojoExecutor.java:153)
	at org.apache.maven.lifecycle.internal.MojoExecutor.execute(MojoExecutor.java:145)
	at org.apache.maven.lifecycle.internal.LifecycleModuleBuilder.buildProject(LifecycleModuleBuilder.java:84)
	at org.apache.maven.lifecycle.internal.LifecycleModuleBuilder.buildProject(LifecycleModuleBuilder.java:59)
	at org.apache.maven.lifecycle.internal.LifecycleStarter.singleThreadedBuild(LifecycleStarter.java:183)
	at org.apache.maven.lifecycle.internal.LifecycleStarter.execute(LifecycleStarter.java:161)
	at org.apache.maven.DefaultMaven.doExecute(DefaultMaven.java:319)
	at org.apache.maven.DefaultMaven.execute(DefaultMaven.java:156)
	at org.apache.maven.cli.MavenCli.execute(MavenCli.java:537)
	at org.apache.maven.cli.MavenCli.doMain(MavenCli.java:196)
	at org.apache.maven.cli.MavenCli.main(MavenCli.java:141)
	at sun.reflect.NativeMethodAccessorImpl.invoke0(Native Method)
	at sun.reflect.NativeMethodAccessorImpl.invoke(NativeMethodAccessorImpl.java:39)
	at sun.reflect.DelegatingMethodAccessorImpl.invoke(DelegatingMethodAccessorImpl.java:25)
	at java.lang.reflect.Method.invoke(Method.java:597)
	at org.codehaus.plexus.classworlds.launcher.Launcher.launchEnhanced(Launcher.java:290)
	at org.codehaus.plexus.classworlds.launcher.Launcher.launch(Launcher.java:230)
	at org.codehaus.plexus.classworlds.launcher.Launcher.mainWithExitCode(Launcher.java:409)
	at org.codehaus.plexus.classworlds.launcher.Launcher.main(Launcher.java:352)
Caused by: org.apache.maven.plugin.MojoExecutionException: Failed to transform troubleshooting.xml.
	at com.agilejava.docbkx.maven.AbstractTransformerMojo.execute(AbstractTransformerMojo.java:179)
	at com.agilejava.docbkx.maven.AbstractHtmlMojo.execute(AbstractHtmlMojo.java:58)
	at org.apache.maven.plugin.DefaultBuildPluginManager.executeMojo(DefaultBuildPluginManager.java:101)
	at org.apache.maven.lifecycle.internal.MojoExecutor.execute(MojoExecutor.java:209)
	... 19 more
Caused by: javax.xml.transform.TransformerException: org.xml.sax.SAXParseException: The element type "para" must be terminated by the matching end-tag "</para>".
	at com.icl.saxon.om.Builder.build(Builder.java:273)
	at com.icl.saxon.Controller.transform(Controller.java:936)
	at com.agilejava.docbkx.maven.AbstractTransformerMojo.execute(AbstractTransformerMojo.java:163)
	... 22 more
Caused by: org.xml.sax.SAXParseException: The element type "para" must be terminated by the matching end-tag "</para>".
	at org.apache.xerces.util.ErrorHandlerWrapper.createSAXParseException(Unknown Source)
	at org.apache.xerces.util.ErrorHandlerWrapper.fatalError(Unknown Source)
	at org.apache.xerces.impl.XMLErrorReporter.reportError(Unknown Source)
	at org.apache.xerces.impl.XMLErrorReporter.reportError(Unknown Source)
	at org.apache.xerces.impl.XMLScanner.reportFatalError(Unknown Source)
	at org.apache.xerces.impl.XMLNSDocumentScannerImpl.scanEndElement(Unknown Source)
	at org.apache.xerces.impl.XMLDocumentFragmentScannerImpl$FragmentContentDispatcher.dispatch(Unknown Source)
	at org.apache.xerces.impl.XMLDocumentFragmentScannerImpl.scanDocument(Unknown Source)
	at org.apache.xerces.parsers.XML11Configuration.parse(Unknown Source)
	at org.apache.xerces.parsers.XML11Configuration.parse(Unknown Source)
	at org.apache.xerces.parsers.XMLParser.parse(Unknown Source)
	at org.apache.xerces.parsers.AbstractSAXParser.parse(Unknown Source)
	at org.apache.xerces.jaxp.SAXParserImpl$JAXPSAXParser.parse(Unknown Source)
	at org.xml.sax.helpers.XMLFilterImpl.parse(XMLFilterImpl.java:333)
	at com.icl.saxon.om.Builder.build(Builder.java:265)
	... 24 more
[ERROR] 
[ERROR] 
[ERROR] For more information about the errors and possible solutions, please read the following articles:
[ERROR] [Help 1] http://cwiki.apache.org/confluence/display/MAVEN/MojoExecutionException
Build step 'Invoke top-level Maven targets' marked build as failure
Archiving artifacts
Updating HBASE-6077
Recording test results

Build failed in Jenkins: HBase-0.94-security #30

Posted by Apache Jenkins Server <je...@builds.apache.org>.
See <https://builds.apache.org/job/HBase-0.94-security/30/changes>

Changes:

[apurtell] HBASE-6077. Document the most common secure RPC troubleshooting resolutions

[tedyu] HBASE-6065 Log for flush would append a non-sequential edit in the hlog, leading to possible data loss (Chunhui)

[tedyu] HBASE-6069 TableInputFormatBase#createRecordReader() doesn't initialize TableRecordReader which causes NPE (Jie Huang)

------------------------------------------
[...truncated 7241 lines...]
Tests run: 2, Failures: 0, Errors: 0, Skipped: 0, Time elapsed: 1.125 sec
Forking command line: /bin/sh -c cd <https://builds.apache.org/job/HBase-0.94-security/ws/trunk> && /home/jenkins/tools/java/jdk1.6.0_27-32/jre/bin/java -enableassertions -Xmx1900m -Djava.security.egd=file:/dev/./urandom -jar <https://builds.apache.org/job/HBase-0.94-security/ws/trunk/target/surefire/surefirebooter4332558064004423359.jar> <https://builds.apache.org/job/HBase-0.94-security/ws/trunk/target/surefire/surefire9192458130045746925tmp> <https://builds.apache.org/job/HBase-0.94-security/ws/trunk/target/surefire/surefire_635350055939603042425tmp>
Running org.apache.hadoop.hbase.rest.TestScannersWithFilters
Tests run: 10, Failures: 0, Errors: 0, Skipped: 0, Time elapsed: 16.881 sec
Forking command line: /bin/sh -c cd <https://builds.apache.org/job/HBase-0.94-security/ws/trunk> && /home/jenkins/tools/java/jdk1.6.0_27-32/jre/bin/java -enableassertions -Xmx1900m -Djava.security.egd=file:/dev/./urandom -jar <https://builds.apache.org/job/HBase-0.94-security/ws/trunk/target/surefire/surefirebooter6216728836468832003.jar> <https://builds.apache.org/job/HBase-0.94-security/ws/trunk/target/surefire/surefire7536457173064555028tmp> <https://builds.apache.org/job/HBase-0.94-security/ws/trunk/target/surefire/surefire_648681789582623904781tmp>
Running org.apache.hadoop.hbase.regionserver.TestServerCustomProtocol
Tests run: 7, Failures: 0, Errors: 0, Skipped: 0, Time elapsed: 15.146 sec
Forking command line: /bin/sh -c cd <https://builds.apache.org/job/HBase-0.94-security/ws/trunk> && /home/jenkins/tools/java/jdk1.6.0_27-32/jre/bin/java -enableassertions -Xmx1900m -Djava.security.egd=file:/dev/./urandom -jar <https://builds.apache.org/job/HBase-0.94-security/ws/trunk/target/surefire/surefirebooter4439763018308117150.jar> <https://builds.apache.org/job/HBase-0.94-security/ws/trunk/target/surefire/surefire6919242621590810303tmp> <https://builds.apache.org/job/HBase-0.94-security/ws/trunk/target/surefire/surefire_656822131257309282305tmp>
Running org.apache.hadoop.hbase.regionserver.TestAtomicOperation
Tests run: 5, Failures: 0, Errors: 0, Skipped: 0, Time elapsed: 32.388 sec
Forking command line: /bin/sh -c cd <https://builds.apache.org/job/HBase-0.94-security/ws/trunk> && /home/jenkins/tools/java/jdk1.6.0_27-32/jre/bin/java -enableassertions -Xmx1900m -Djava.security.egd=file:/dev/./urandom -jar <https://builds.apache.org/job/HBase-0.94-security/ws/trunk/target/surefire/surefirebooter8879779210362577927.jar> <https://builds.apache.org/job/HBase-0.94-security/ws/trunk/target/surefire/surefire4987476700738005387tmp> <https://builds.apache.org/job/HBase-0.94-security/ws/trunk/target/surefire/surefire_664372054643893123267tmp>
Running org.apache.hadoop.hbase.regionserver.TestHRegion
Tests run: 62, Failures: 0, Errors: 0, Skipped: 0, Time elapsed: 36.607 sec
Forking command line: /bin/sh -c cd <https://builds.apache.org/job/HBase-0.94-security/ws/trunk> && /home/jenkins/tools/java/jdk1.6.0_27-32/jre/bin/java -enableassertions -Xmx1900m -Djava.security.egd=file:/dev/./urandom -jar <https://builds.apache.org/job/HBase-0.94-security/ws/trunk/target/surefire/surefirebooter1762482322045801549.jar> <https://builds.apache.org/job/HBase-0.94-security/ws/trunk/target/surefire/surefire5833421171219231790tmp> <https://builds.apache.org/job/HBase-0.94-security/ws/trunk/target/surefire/surefire_677434925538386822983tmp>
Running org.apache.hadoop.hbase.regionserver.wal.TestWALReplayCompressed
Tests run: 5, Failures: 0, Errors: 0, Skipped: 0, Time elapsed: 28.627 sec
Running org.apache.hadoop.hbase.regionserver.wal.TestLogRollAbort
Tests run: 1, Failures: 0, Errors: 0, Skipped: 0, Time elapsed: 17.693 sec
Forking command line: /bin/sh -c cd <https://builds.apache.org/job/HBase-0.94-security/ws/trunk> && /home/jenkins/tools/java/jdk1.6.0_27-32/jre/bin/java -enableassertions -Xmx1900m -Djava.security.egd=file:/dev/./urandom -jar <https://builds.apache.org/job/HBase-0.94-security/ws/trunk/target/surefire/surefirebooter875207261262691739.jar> <https://builds.apache.org/job/HBase-0.94-security/ws/trunk/target/surefire/surefire3229755188786705310tmp> <https://builds.apache.org/job/HBase-0.94-security/ws/trunk/target/surefire/surefire_685741943659774401552tmp>
Running org.apache.hadoop.hbase.regionserver.wal.TestWALReplay
Tests run: 5, Failures: 0, Errors: 0, Skipped: 0, Time elapsed: 28.443 sec
Forking command line: /bin/sh -c cd <https://builds.apache.org/job/HBase-0.94-security/ws/trunk> && /home/jenkins/tools/java/jdk1.6.0_27-32/jre/bin/java -enableassertions -Xmx1900m -Djava.security.egd=file:/dev/./urandom -jar <https://builds.apache.org/job/HBase-0.94-security/ws/trunk/target/surefire/surefirebooter5076124849081301435.jar> <https://builds.apache.org/job/HBase-0.94-security/ws/trunk/target/surefire/surefire3582805236780125302tmp> <https://builds.apache.org/job/HBase-0.94-security/ws/trunk/target/surefire/surefire_699020493952127721794tmp>
Running org.apache.hadoop.hbase.regionserver.wal.TestLogRollingNoCluster
Tests run: 1, Failures: 0, Errors: 0, Skipped: 0, Time elapsed: 2.112 sec
Forking command line: /bin/sh -c cd <https://builds.apache.org/job/HBase-0.94-security/ws/trunk> && /home/jenkins/tools/java/jdk1.6.0_27-32/jre/bin/java -enableassertions -Xmx1900m -Djava.security.egd=file:/dev/./urandom -jar <https://builds.apache.org/job/HBase-0.94-security/ws/trunk/target/surefire/surefirebooter8058510154170518201.jar> <https://builds.apache.org/job/HBase-0.94-security/ws/trunk/target/surefire/surefire8223453973819436643tmp> <https://builds.apache.org/job/HBase-0.94-security/ws/trunk/target/surefire/surefire_708094894538445879019tmp>
Running org.apache.hadoop.hbase.regionserver.wal.TestHLogBench
Tests run: 1, Failures: 0, Errors: 0, Skipped: 0, Time elapsed: 1.438 sec
Forking command line: /bin/sh -c cd <https://builds.apache.org/job/HBase-0.94-security/ws/trunk> && /home/jenkins/tools/java/jdk1.6.0_27-32/jre/bin/java -enableassertions -Xmx1900m -Djava.security.egd=file:/dev/./urandom -jar <https://builds.apache.org/job/HBase-0.94-security/ws/trunk/target/surefire/surefirebooter1032171978774841605.jar> <https://builds.apache.org/job/HBase-0.94-security/ws/trunk/target/surefire/surefire9062042086576999977tmp> <https://builds.apache.org/job/HBase-0.94-security/ws/trunk/target/surefire/surefire_713620373707314776908tmp>
Running org.apache.hadoop.hbase.regionserver.TestStore
Tests run: 12, Failures: 0, Errors: 0, Skipped: 0, Time elapsed: 9.505 sec
Forking command line: /bin/sh -c cd <https://builds.apache.org/job/HBase-0.94-security/ws/trunk> && /home/jenkins/tools/java/jdk1.6.0_27-32/jre/bin/java -enableassertions -Xmx1900m -Djava.security.egd=file:/dev/./urandom -jar <https://builds.apache.org/job/HBase-0.94-security/ws/trunk/target/surefire/surefirebooter8612584292107827235.jar> <https://builds.apache.org/job/HBase-0.94-security/ws/trunk/target/surefire/surefire6078456526323834697tmp> <https://builds.apache.org/job/HBase-0.94-security/ws/trunk/target/surefire/surefire_722124029416875319416tmp>
Running org.apache.hadoop.hbase.regionserver.TestRpcMetrics
Tests run: 1, Failures: 0, Errors: 0, Skipped: 0, Time elapsed: 1.764 sec
Forking command line: /bin/sh -c cd <https://builds.apache.org/job/HBase-0.94-security/ws/trunk> && /home/jenkins/tools/java/jdk1.6.0_27-32/jre/bin/java -enableassertions -Xmx1900m -Djava.security.egd=file:/dev/./urandom -jar <https://builds.apache.org/job/HBase-0.94-security/ws/trunk/target/surefire/surefirebooter8620669501368889235.jar> <https://builds.apache.org/job/HBase-0.94-security/ws/trunk/target/surefire/surefire7301143584900198244tmp> <https://builds.apache.org/job/HBase-0.94-security/ws/trunk/target/surefire/surefire_736970071982055321327tmp>
Running org.apache.hadoop.hbase.regionserver.TestBlocksRead
Tests run: 4, Failures: 0, Errors: 0, Skipped: 0, Time elapsed: 1.026 sec
Forking command line: /bin/sh -c cd <https://builds.apache.org/job/HBase-0.94-security/ws/trunk> && /home/jenkins/tools/java/jdk1.6.0_27-32/jre/bin/java -enableassertions -Xmx1900m -Djava.security.egd=file:/dev/./urandom -jar <https://builds.apache.org/job/HBase-0.94-security/ws/trunk/target/surefire/surefirebooter5518696287596700148.jar> <https://builds.apache.org/job/HBase-0.94-security/ws/trunk/target/surefire/surefire3693276838907669926tmp> <https://builds.apache.org/job/HBase-0.94-security/ws/trunk/target/surefire/surefire_748702955354214210099tmp>
Forking command line: /bin/sh -c cd <https://builds.apache.org/job/HBase-0.94-security/ws/trunk> && /home/jenkins/tools/java/jdk1.6.0_27-32/jre/bin/java -enableassertions -Xmx1900m -Djava.security.egd=file:/dev/./urandom -jar <https://builds.apache.org/job/HBase-0.94-security/ws/trunk/target/surefire/surefirebooter2024285244065161731.jar> <https://builds.apache.org/job/HBase-0.94-security/ws/trunk/target/surefire/surefire3555376189343798142tmp> <https://builds.apache.org/job/HBase-0.94-security/ws/trunk/target/surefire/surefire_753461665687363613782tmp>
Running org.apache.hadoop.hbase.regionserver.TestRegionServerMetrics
Tests run: 3, Failures: 0, Errors: 0, Skipped: 0, Time elapsed: 55.77 sec
Forking command line: /bin/sh -c cd <https://builds.apache.org/job/HBase-0.94-security/ws/trunk> && /home/jenkins/tools/java/jdk1.6.0_27-32/jre/bin/java -enableassertions -Xmx1900m -Djava.security.egd=file:/dev/./urandom -jar <https://builds.apache.org/job/HBase-0.94-security/ws/trunk/target/surefire/surefirebooter7898802565828814521.jar> <https://builds.apache.org/job/HBase-0.94-security/ws/trunk/target/surefire/surefire3264248573140888212tmp> <https://builds.apache.org/job/HBase-0.94-security/ws/trunk/target/surefire/surefire_762749298819125162705tmp>
Running org.apache.hadoop.hbase.regionserver.TestHRegionOnCluster
Tests run: 1, Failures: 0, Errors: 0, Skipped: 0, Time elapsed: 52.926 sec
Running org.apache.hadoop.hbase.regionserver.metrics.TestSchemaMetrics
Forking command line: /bin/sh -c cd <https://builds.apache.org/job/HBase-0.94-security/ws/trunk> && /home/jenkins/tools/java/jdk1.6.0_27-32/jre/bin/java -enableassertions -Xmx1900m -Djava.security.egd=file:/dev/./urandom -jar <https://builds.apache.org/job/HBase-0.94-security/ws/trunk/target/surefire/surefirebooter431758240877045472.jar> <https://builds.apache.org/job/HBase-0.94-security/ws/trunk/target/surefire/surefire5693403016148527157tmp> <https://builds.apache.org/job/HBase-0.94-security/ws/trunk/target/surefire/surefire_77568217226420578544tmp>
Tests run: 6, Failures: 0, Errors: 0, Skipped: 0, Time elapsed: 15.226 sec
Forking command line: /bin/sh -c cd <https://builds.apache.org/job/HBase-0.94-security/ws/trunk> && /home/jenkins/tools/java/jdk1.6.0_27-32/jre/bin/java -enableassertions -Xmx1900m -Djava.security.egd=file:/dev/./urandom -jar <https://builds.apache.org/job/HBase-0.94-security/ws/trunk/target/surefire/surefirebooter6520799292491393744.jar> <https://builds.apache.org/job/HBase-0.94-security/ws/trunk/target/surefire/surefire752661893363759313tmp> <https://builds.apache.org/job/HBase-0.94-security/ws/trunk/target/surefire/surefire_783701436387168118207tmp>
Running org.apache.hadoop.hbase.regionserver.TestStoreScanner
Tests run: 16, Failures: 0, Errors: 0, Skipped: 0, Time elapsed: 0.075 sec
Forking command line: /bin/sh -c cd <https://builds.apache.org/job/HBase-0.94-security/ws/trunk> && /home/jenkins/tools/java/jdk1.6.0_27-32/jre/bin/java -enableassertions -Xmx1900m -Djava.security.egd=file:/dev/./urandom -jar <https://builds.apache.org/job/HBase-0.94-security/ws/trunk/target/surefire/surefirebooter2416826597414633209.jar> <https://builds.apache.org/job/HBase-0.94-security/ws/trunk/target/surefire/surefire310540536542465894tmp> <https://builds.apache.org/job/HBase-0.94-security/ws/trunk/target/surefire/surefire_797451741797501654449tmp>
Running org.apache.hadoop.hbase.regionserver.TestParallelPut
Tests run: 2, Failures: 0, Errors: 0, Skipped: 0, Time elapsed: 5.491 sec
Forking command line: /bin/sh -c cd <https://builds.apache.org/job/HBase-0.94-security/ws/trunk> && /home/jenkins/tools/java/jdk1.6.0_27-32/jre/bin/java -enableassertions -Xmx1900m -Djava.security.egd=file:/dev/./urandom -jar <https://builds.apache.org/job/HBase-0.94-security/ws/trunk/target/surefire/surefirebooter5162467980929868508.jar> <https://builds.apache.org/job/HBase-0.94-security/ws/trunk/target/surefire/surefire4975438360123629922tmp> <https://builds.apache.org/job/HBase-0.94-security/ws/trunk/target/surefire/surefire_805905907073569550049tmp>
Running org.apache.hadoop.hbase.regionserver.TestStoreFileBlockCacheSummary
Tests run: 1, Failures: 0, Errors: 0, Skipped: 0, Time elapsed: 14.554 sec
Forking command line: /bin/sh -c cd <https://builds.apache.org/job/HBase-0.94-security/ws/trunk> && /home/jenkins/tools/java/jdk1.6.0_27-32/jre/bin/java -enableassertions -Xmx1900m -Djava.security.egd=file:/dev/./urandom -jar <https://builds.apache.org/job/HBase-0.94-security/ws/trunk/target/surefire/surefirebooter5954432888794029761.jar> <https://builds.apache.org/job/HBase-0.94-security/ws/trunk/target/surefire/surefire1287799106795329948tmp> <https://builds.apache.org/job/HBase-0.94-security/ws/trunk/target/surefire/surefire_814573060979893099981tmp>
Running org.apache.hadoop.hbase.regionserver.handler.TestCloseRegionHandler
Tests run: 3, Failures: 0, Errors: 0, Skipped: 0, Time elapsed: 1.271 sec
Forking command line: /bin/sh -c cd <https://builds.apache.org/job/HBase-0.94-security/ws/trunk> && /home/jenkins/tools/java/jdk1.6.0_27-32/jre/bin/java -enableassertions -Xmx1900m -Djava.security.egd=file:/dev/./urandom -jar <https://builds.apache.org/job/HBase-0.94-security/ws/trunk/target/surefire/surefirebooter4617328940042367507.jar> <https://builds.apache.org/job/HBase-0.94-security/ws/trunk/target/surefire/surefire2266561231147277899tmp> <https://builds.apache.org/job/HBase-0.94-security/ws/trunk/target/surefire/surefire_827487742924882505548tmp>
Running org.apache.hadoop.hbase.regionserver.handler.TestOpenRegionHandler
Tests run: 3, Failures: 0, Errors: 0, Skipped: 0, Time elapsed: 0.956 sec
Forking command line: /bin/sh -c cd <https://builds.apache.org/job/HBase-0.94-security/ws/trunk> && /home/jenkins/tools/java/jdk1.6.0_27-32/jre/bin/java -enableassertions -Xmx1900m -Djava.security.egd=file:/dev/./urandom -jar <https://builds.apache.org/job/HBase-0.94-security/ws/trunk/target/surefire/surefirebooter6949279600429041685.jar> <https://builds.apache.org/job/HBase-0.94-security/ws/trunk/target/surefire/surefire4580073053245696255tmp> <https://builds.apache.org/job/HBase-0.94-security/ws/trunk/target/surefire/surefire_837798397536690888347tmp>
Running org.apache.hadoop.hbase.regionserver.TestMasterAddressManager
Tests run: 1, Failures: 0, Errors: 0, Skipped: 0, Time elapsed: 0.591 sec
Forking command line: /bin/sh -c cd <https://builds.apache.org/job/HBase-0.94-security/ws/trunk> && /home/jenkins/tools/java/jdk1.6.0_27-32/jre/bin/java -enableassertions -Xmx1900m -Djava.security.egd=file:/dev/./urandom -jar <https://builds.apache.org/job/HBase-0.94-security/ws/trunk/target/surefire/surefirebooter7234898789708274658.jar> <https://builds.apache.org/job/HBase-0.94-security/ws/trunk/target/surefire/surefire3983560704800859606tmp> <https://builds.apache.org/job/HBase-0.94-security/ws/trunk/target/surefire/surefire_844352373899668737533tmp>
Running org.apache.hadoop.hbase.regionserver.TestSplitLogWorker
Tests run: 5, Failures: 0, Errors: 0, Skipped: 0, Time elapsed: 2.118 sec
Forking command line: /bin/sh -c cd <https://builds.apache.org/job/HBase-0.94-security/ws/trunk> && /home/jenkins/tools/java/jdk1.6.0_27-32/jre/bin/java -enableassertions -Xmx1900m -Djava.security.egd=file:/dev/./urandom -jar <https://builds.apache.org/job/HBase-0.94-security/ws/trunk/target/surefire/surefirebooter5260053816974791690.jar> <https://builds.apache.org/job/HBase-0.94-security/ws/trunk/target/surefire/surefire4902463139434512198tmp> <https://builds.apache.org/job/HBase-0.94-security/ws/trunk/target/surefire/surefire_852124943358090759548tmp>
Running org.apache.hadoop.hbase.regionserver.TestSeekOptimizations
Tests run: 6, Failures: 0, Errors: 0, Skipped: 0, Time elapsed: 2.818 sec
Forking command line: /bin/sh -c cd <https://builds.apache.org/job/HBase-0.94-security/ws/trunk> && /home/jenkins/tools/java/jdk1.6.0_27-32/jre/bin/java -enableassertions -Xmx1900m -Djava.security.egd=file:/dev/./urandom -jar <https://builds.apache.org/job/HBase-0.94-security/ws/trunk/target/surefire/surefirebooter6838902678248062847.jar> <https://builds.apache.org/job/HBase-0.94-security/ws/trunk/target/surefire/surefire5236598586927879244tmp> <https://builds.apache.org/job/HBase-0.94-security/ws/trunk/target/surefire/surefire_865243375546738354754tmp>
Running org.apache.hadoop.hbase.regionserver.TestMultiColumnScanner
Tests run: 12, Failures: 0, Errors: 0, Skipped: 0, Time elapsed: 41.97 sec
Forking command line: /bin/sh -c cd <https://builds.apache.org/job/HBase-0.94-security/ws/trunk> && /home/jenkins/tools/java/jdk1.6.0_27-32/jre/bin/java -enableassertions -Xmx1900m -Djava.security.egd=file:/dev/./urandom -jar <https://builds.apache.org/job/HBase-0.94-security/ws/trunk/target/surefire/surefirebooter9144744676683343049.jar> <https://builds.apache.org/job/HBase-0.94-security/ws/trunk/target/surefire/surefire6124617968157063704tmp> <https://builds.apache.org/job/HBase-0.94-security/ws/trunk/target/surefire/surefire_87191070787056276064tmp>
Running org.apache.hadoop.hbase.regionserver.TestFSErrorsExposed
Tests run: 3, Failures: 0, Errors: 0, Skipped: 0, Time elapsed: 27.167 sec
Forking command line: /bin/sh -c cd <https://builds.apache.org/job/HBase-0.94-security/ws/trunk> && /home/jenkins/tools/java/jdk1.6.0_27-32/jre/bin/java -enableassertions -Xmx1900m -Djava.security.egd=file:/dev/./urandom -jar <https://builds.apache.org/job/HBase-0.94-security/ws/trunk/target/surefire/surefirebooter2783096111365465860.jar> <https://builds.apache.org/job/HBase-0.94-security/ws/trunk/target/surefire/surefire7605525604137033158tmp> <https://builds.apache.org/job/HBase-0.94-security/ws/trunk/target/surefire/surefire_888841471706878898939tmp>
Running org.apache.hadoop.hbase.filter.TestColumnRangeFilter
Tests run: 1, Failures: 0, Errors: 0, Skipped: 0, Time elapsed: 16.622 sec
Forking command line: /bin/sh -c cd <https://builds.apache.org/job/HBase-0.94-security/ws/trunk> && /home/jenkins/tools/java/jdk1.6.0_27-32/jre/bin/java -enableassertions -Xmx1900m -Djava.security.egd=file:/dev/./urandom -jar <https://builds.apache.org/job/HBase-0.94-security/ws/trunk/target/surefire/surefirebooter4515052131197598739.jar> <https://builds.apache.org/job/HBase-0.94-security/ws/trunk/target/surefire/surefire6569252282668787982tmp> <https://builds.apache.org/job/HBase-0.94-security/ws/trunk/target/surefire/surefire_898440617151364865729tmp>
Running org.apache.hadoop.hbase.TestGlobalMemStoreSize
Tests run: 1, Failures: 0, Errors: 0, Skipped: 0, Time elapsed: 15.281 sec
Forking command line: /bin/sh -c cd <https://builds.apache.org/job/HBase-0.94-security/ws/trunk> && /home/jenkins/tools/java/jdk1.6.0_27-32/jre/bin/java -enableassertions -Xmx1900m -Djava.security.egd=file:/dev/./urandom -jar <https://builds.apache.org/job/HBase-0.94-security/ws/trunk/target/surefire/surefirebooter2887672016633899068.jar> <https://builds.apache.org/job/HBase-0.94-security/ws/trunk/target/surefire/surefire4540426674829749400tmp> <https://builds.apache.org/job/HBase-0.94-security/ws/trunk/target/surefire/surefire_907121260228522537555tmp>
Running org.apache.hadoop.hbase.thrift2.TestThriftHBaseServiceHandler
Tests run: 12, Failures: 0, Errors: 0, Skipped: 0, Time elapsed: 12.259 sec
Forking command line: /bin/sh -c cd <https://builds.apache.org/job/HBase-0.94-security/ws/trunk> && /home/jenkins/tools/java/jdk1.6.0_27-32/jre/bin/java -enableassertions -Xmx1900m -Djava.security.egd=file:/dev/./urandom -jar <https://builds.apache.org/job/HBase-0.94-security/ws/trunk/target/surefire/surefirebooter5340040661419475241.jar> <https://builds.apache.org/job/HBase-0.94-security/ws/trunk/target/surefire/surefire7860581866791674489tmp> <https://builds.apache.org/job/HBase-0.94-security/ws/trunk/target/surefire/surefire_913087168085393360285tmp>
Running org.apache.hadoop.hbase.replication.TestReplicationZookeeper
Tests run: 1, Failures: 0, Errors: 0, Skipped: 0, Time elapsed: 0.582 sec
Forking command line: /bin/sh -c cd <https://builds.apache.org/job/HBase-0.94-security/ws/trunk> && /home/jenkins/tools/java/jdk1.6.0_27-32/jre/bin/java -enableassertions -Xmx1900m -Djava.security.egd=file:/dev/./urandom -jar <https://builds.apache.org/job/HBase-0.94-security/ws/trunk/target/surefire/surefirebooter6684201516930692224.jar> <https://builds.apache.org/job/HBase-0.94-security/ws/trunk/target/surefire/surefire1407154612581955092tmp> <https://builds.apache.org/job/HBase-0.94-security/ws/trunk/target/surefire/surefire_923210896914393119455tmp>
Running org.apache.hadoop.hbase.replication.regionserver.TestReplicationSourceManager
Tests run: 1, Failures: 0, Errors: 0, Skipped: 0, Time elapsed: 0.961 sec
Forking command line: /bin/sh -c cd <https://builds.apache.org/job/HBase-0.94-security/ws/trunk> && /home/jenkins/tools/java/jdk1.6.0_27-32/jre/bin/java -enableassertions -Xmx1900m -Djava.security.egd=file:/dev/./urandom -jar <https://builds.apache.org/job/HBase-0.94-security/ws/trunk/target/surefire/surefirebooter8316114226730667048.jar> <https://builds.apache.org/job/HBase-0.94-security/ws/trunk/target/surefire/surefire5201900874527887939tmp> <https://builds.apache.org/job/HBase-0.94-security/ws/trunk/target/surefire/surefire_932492871692381077522tmp>
Running org.apache.hadoop.hbase.TestMultiVersions
Tests run: 3, Failures: 0, Errors: 0, Skipped: 0, Time elapsed: 20.825 sec
Forking command line: /bin/sh -c cd <https://builds.apache.org/job/HBase-0.94-security/ws/trunk> && /home/jenkins/tools/java/jdk1.6.0_27-32/jre/bin/java -enableassertions -Xmx1900m -Djava.security.egd=file:/dev/./urandom -jar <https://builds.apache.org/job/HBase-0.94-security/ws/trunk/target/surefire/surefirebooter6693173524712948602.jar> <https://builds.apache.org/job/HBase-0.94-security/ws/trunk/target/surefire/surefire3056818931517615900tmp> <https://builds.apache.org/job/HBase-0.94-security/ws/trunk/target/surefire/surefire_942744044157553513648tmp>
Running org.apache.hadoop.hbase.replication.TestReplicationPeer
Tests run: 1, Failures: 0, Errors: 0, Skipped: 0, Time elapsed: 7.577 sec
Forking command line: /bin/sh -c cd <https://builds.apache.org/job/HBase-0.94-security/ws/trunk> && /home/jenkins/tools/java/jdk1.6.0_27-32/jre/bin/java -enableassertions -Xmx1900m -Djava.security.egd=file:/dev/./urandom -jar <https://builds.apache.org/job/HBase-0.94-security/ws/trunk/target/surefire/surefirebooter276807953023957566.jar> <https://builds.apache.org/job/HBase-0.94-security/ws/trunk/target/surefire/surefire134315511439651764tmp> <https://builds.apache.org/job/HBase-0.94-security/ws/trunk/target/surefire/surefire_954714863063198481072tmp>
Running org.apache.hadoop.hbase.replication.TestReplicationSource
Tests run: 1, Failures: 0, Errors: 0, Skipped: 0, Time elapsed: 2.458 sec
Running org.apache.hadoop.hbase.replication.regionserver.TestReplicationSink
Tests run: 5, Failures: 0, Errors: 0, Skipped: 0, Time elapsed: 13.289 sec
Forking command line: /bin/sh -c cd <https://builds.apache.org/job/HBase-0.94-security/ws/trunk> && /home/jenkins/tools/java/jdk1.6.0_27-32/jre/bin/java -enableassertions -Xmx1900m -Djava.security.egd=file:/dev/./urandom -jar <https://builds.apache.org/job/HBase-0.94-security/ws/trunk/target/surefire/surefirebooter5710350498738253808.jar> <https://builds.apache.org/job/HBase-0.94-security/ws/trunk/target/surefire/surefire7612255468404933067tmp> <https://builds.apache.org/job/HBase-0.94-security/ws/trunk/target/surefire/surefire_966022288806653413137tmp>
Forking command line: /bin/sh -c cd <https://builds.apache.org/job/HBase-0.94-security/ws/trunk> && /home/jenkins/tools/java/jdk1.6.0_27-32/jre/bin/java -enableassertions -Xmx1900m -Djava.security.egd=file:/dev/./urandom -jar <https://builds.apache.org/job/HBase-0.94-security/ws/trunk/target/surefire/surefirebooter723330096072489837.jar> <https://builds.apache.org/job/HBase-0.94-security/ws/trunk/target/surefire/surefire9083344262613139422tmp> <https://builds.apache.org/job/HBase-0.94-security/ws/trunk/target/surefire/surefire_978539375283272278090tmp>
Running org.apache.hadoop.hbase.avro.TestAvroServer
Tests run: 3, Failures: 0, Errors: 0, Skipped: 0, Time elapsed: 23.115 sec
Forking command line: /bin/sh -c cd <https://builds.apache.org/job/HBase-0.94-security/ws/trunk> && /home/jenkins/tools/java/jdk1.6.0_27-32/jre/bin/java -enableassertions -Xmx1900m -Djava.security.egd=file:/dev/./urandom -jar <https://builds.apache.org/job/HBase-0.94-security/ws/trunk/target/surefire/surefirebooter6226294235939797017.jar> <https://builds.apache.org/job/HBase-0.94-security/ws/trunk/target/surefire/surefire5188287872524947869tmp> <https://builds.apache.org/job/HBase-0.94-security/ws/trunk/target/surefire/surefire_987221979169382894934tmp>
Running org.apache.hadoop.hbase.TestAcidGuarantees
Tests run: 3, Failures: 0, Errors: 0, Skipped: 0, Time elapsed: 93.018 sec
Forking command line: /bin/sh -c cd <https://builds.apache.org/job/HBase-0.94-security/ws/trunk> && /home/jenkins/tools/java/jdk1.6.0_27-32/jre/bin/java -enableassertions -Xmx1900m -Djava.security.egd=file:/dev/./urandom -jar <https://builds.apache.org/job/HBase-0.94-security/ws/trunk/target/surefire/surefirebooter6019206616128789272.jar> <https://builds.apache.org/job/HBase-0.94-security/ws/trunk/target/surefire/surefire6237874810106695282tmp> <https://builds.apache.org/job/HBase-0.94-security/ws/trunk/target/surefire/surefire_991610973534558132373tmp>
Running org.apache.hadoop.hbase.coprocessor.TestRegionServerCoprocessorExceptionWithRemove
Tests run: 1, Failures: 0, Errors: 0, Skipped: 0, Time elapsed: 14.786 sec
Forking command line: /bin/sh -c cd <https://builds.apache.org/job/HBase-0.94-security/ws/trunk> && /home/jenkins/tools/java/jdk1.6.0_27-32/jre/bin/java -enableassertions -Xmx1900m -Djava.security.egd=file:/dev/./urandom -jar <https://builds.apache.org/job/HBase-0.94-security/ws/trunk/target/surefire/surefirebooter7529352109654865880.jar> <https://builds.apache.org/job/HBase-0.94-security/ws/trunk/target/surefire/surefire7497648824713714708tmp> <https://builds.apache.org/job/HBase-0.94-security/ws/trunk/target/surefire/surefire_1004026432805457420381tmp>
Running org.apache.hadoop.hbase.coprocessor.TestRegionObserverInterface
Tests run: 6, Failures: 0, Errors: 0, Skipped: 0, Time elapsed: 31.698 sec
Forking command line: /bin/sh -c cd <https://builds.apache.org/job/HBase-0.94-security/ws/trunk> && /home/jenkins/tools/java/jdk1.6.0_27-32/jre/bin/java -enableassertions -Xmx1900m -Djava.security.egd=file:/dev/./urandom -jar <https://builds.apache.org/job/HBase-0.94-security/ws/trunk/target/surefire/surefirebooter1514104840777263384.jar> <https://builds.apache.org/job/HBase-0.94-security/ws/trunk/target/surefire/surefire1933651830053779697tmp> <https://builds.apache.org/job/HBase-0.94-security/ws/trunk/target/surefire/surefire_1018460793413425030513tmp>
Running org.apache.hadoop.hbase.coprocessor.TestMasterObserver
Tests run: 3, Failures: 0, Errors: 0, Skipped: 0, Time elapsed: 26.579 sec
Forking command line: /bin/sh -c cd <https://builds.apache.org/job/HBase-0.94-security/ws/trunk> && /home/jenkins/tools/java/jdk1.6.0_27-32/jre/bin/java -enableassertions -Xmx1900m -Djava.security.egd=file:/dev/./urandom -jar <https://builds.apache.org/job/HBase-0.94-security/ws/trunk/target/surefire/surefirebooter2911363869263025142.jar> <https://builds.apache.org/job/HBase-0.94-security/ws/trunk/target/surefire/surefire5698081927633745965tmp> <https://builds.apache.org/job/HBase-0.94-security/ws/trunk/target/surefire/surefire_1022639511592898788132tmp>
Running org.apache.hadoop.hbase.coprocessor.TestCoprocessorEndpoint
Tests run: 3, Failures: 0, Errors: 0, Skipped: 1, Time elapsed: 28.631 sec
Forking command line: /bin/sh -c cd <https://builds.apache.org/job/HBase-0.94-security/ws/trunk> && /home/jenkins/tools/java/jdk1.6.0_27-32/jre/bin/java -enableassertions -Xmx1900m -Djava.security.egd=file:/dev/./urandom -jar <https://builds.apache.org/job/HBase-0.94-security/ws/trunk/target/surefire/surefirebooter9113402768065057443.jar> <https://builds.apache.org/job/HBase-0.94-security/ws/trunk/target/surefire/surefire9035887496040021481tmp> <https://builds.apache.org/job/HBase-0.94-security/ws/trunk/target/surefire/surefire_1037580801388430946737tmp>
Running org.apache.hadoop.hbase.coprocessor.TestWALObserver
Tests run: 3, Failures: 0, Errors: 0, Skipped: 0, Time elapsed: 15.238 sec
Running org.apache.hadoop.hbase.TestLocalHBaseCluster
Tests run: 1, Failures: 0, Errors: 1, Skipped: 0, Time elapsed: 201.338 sec <<< FAILURE!
Forking command line: /bin/sh -c cd <https://builds.apache.org/job/HBase-0.94-security/ws/trunk> && /home/jenkins/tools/java/jdk1.6.0_27-32/jre/bin/java -enableassertions -Xmx1900m -Djava.security.egd=file:/dev/./urandom -jar <https://builds.apache.org/job/HBase-0.94-security/ws/trunk/target/surefire/surefirebooter7681559195904555087.jar> <https://builds.apache.org/job/HBase-0.94-security/ws/trunk/target/surefire/surefire5889204825971187934tmp> <https://builds.apache.org/job/HBase-0.94-security/ws/trunk/target/surefire/surefire_1048380954440839887742tmp>
Forking command line: /bin/sh -c cd <https://builds.apache.org/job/HBase-0.94-security/ws/trunk> && /home/jenkins/tools/java/jdk1.6.0_27-32/jre/bin/java -enableassertions -Xmx1900m -Djava.security.egd=file:/dev/./urandom -jar <https://builds.apache.org/job/HBase-0.94-security/ws/trunk/target/surefire/surefirebooter6424168235405279592.jar> <https://builds.apache.org/job/HBase-0.94-security/ws/trunk/target/surefire/surefire7563666859552719899tmp> <https://builds.apache.org/job/HBase-0.94-security/ws/trunk/target/surefire/surefire_1055742024401413270097tmp>
Running org.apache.hadoop.hbase.coprocessor.TestRegionObserverBypass
Tests run: 2, Failures: 0, Errors: 0, Skipped: 0, Time elapsed: 11.028 sec
Forking command line: /bin/sh -c cd <https://builds.apache.org/job/HBase-0.94-security/ws/trunk> && /home/jenkins/tools/java/jdk1.6.0_27-32/jre/bin/java -enableassertions -Xmx1900m -Djava.security.egd=file:/dev/./urandom -jar <https://builds.apache.org/job/HBase-0.94-security/ws/trunk/target/surefire/surefirebooter5959548507646691429.jar> <https://builds.apache.org/job/HBase-0.94-security/ws/trunk/target/surefire/surefire2538768401609632256tmp> <https://builds.apache.org/job/HBase-0.94-security/ws/trunk/target/surefire/surefire_106365141893484299508tmp>
Running org.apache.hadoop.hbase.coprocessor.TestMasterCoprocessorExceptionWithAbort
Tests run: 1, Failures: 0, Errors: 0, Skipped: 0, Time elapsed: 10.93 sec
Forking command line: /bin/sh -c cd <https://builds.apache.org/job/HBase-0.94-security/ws/trunk> && /home/jenkins/tools/java/jdk1.6.0_27-32/jre/bin/java -enableassertions -Xmx1900m -Djava.security.egd=file:/dev/./urandom -jar <https://builds.apache.org/job/HBase-0.94-security/ws/trunk/target/surefire/surefirebooter8747934181497381606.jar> <https://builds.apache.org/job/HBase-0.94-security/ws/trunk/target/surefire/surefire5417830594796233493tmp> <https://builds.apache.org/job/HBase-0.94-security/ws/trunk/target/surefire/surefire_107449874059880788105tmp>
Running org.apache.hadoop.hbase.coprocessor.TestRegionServerCoprocessorExceptionWithAbort
Tests run: 1, Failures: 0, Errors: 0, Skipped: 0, Time elapsed: 13.32 sec
Forking command line: /bin/sh -c cd <https://builds.apache.org/job/HBase-0.94-security/ws/trunk> && /home/jenkins/tools/java/jdk1.6.0_27-32/jre/bin/java -enableassertions -Xmx1900m -Djava.security.egd=file:/dev/./urandom -jar <https://builds.apache.org/job/HBase-0.94-security/ws/trunk/target/surefire/surefirebooter6834234191793670596.jar> <https://builds.apache.org/job/HBase-0.94-security/ws/trunk/target/surefire/surefire9017274640097476407tmp> <https://builds.apache.org/job/HBase-0.94-security/ws/trunk/target/surefire/surefire_1085378224120430801423tmp>
Running org.apache.hadoop.hbase.coprocessor.TestAggregateProtocol
Tests run: 45, Failures: 0, Errors: 0, Skipped: 0, Time elapsed: 13.532 sec
Forking command line: /bin/sh -c cd <https://builds.apache.org/job/HBase-0.94-security/ws/trunk> && /home/jenkins/tools/java/jdk1.6.0_27-32/jre/bin/java -enableassertions -Xmx1900m -Djava.security.egd=file:/dev/./urandom -jar <https://builds.apache.org/job/HBase-0.94-security/ws/trunk/target/surefire/surefirebooter8678203581199186068.jar> <https://builds.apache.org/job/HBase-0.94-security/ws/trunk/target/surefire/surefire6079623415683579361tmp> <https://builds.apache.org/job/HBase-0.94-security/ws/trunk/target/surefire/surefire_1093032865778909303086tmp>
Running org.apache.hadoop.hbase.coprocessor.TestMasterCoprocessorExceptionWithRemove
Tests run: 1, Failures: 0, Errors: 0, Skipped: 0, Time elapsed: 13.069 sec
Forking command line: /bin/sh -c cd <https://builds.apache.org/job/HBase-0.94-security/ws/trunk> && /home/jenkins/tools/java/jdk1.6.0_27-32/jre/bin/java -enableassertions -Xmx1900m -Djava.security.egd=file:/dev/./urandom -jar <https://builds.apache.org/job/HBase-0.94-security/ws/trunk/target/surefire/surefirebooter3690641662415754992.jar> <https://builds.apache.org/job/HBase-0.94-security/ws/trunk/target/surefire/surefire6392238834170848619tmp> <https://builds.apache.org/job/HBase-0.94-security/ws/trunk/target/surefire/surefire_1101796052436732449003tmp>
Running org.apache.hadoop.hbase.coprocessor.TestClassLoading
Tests run: 6, Failures: 0, Errors: 0, Skipped: 0, Time elapsed: 26.741 sec
Forking command line: /bin/sh -c cd <https://builds.apache.org/job/HBase-0.94-security/ws/trunk> && /home/jenkins/tools/java/jdk1.6.0_27-32/jre/bin/java -enableassertions -Xmx1900m -Djava.security.egd=file:/dev/./urandom -jar <https://builds.apache.org/job/HBase-0.94-security/ws/trunk/target/surefire/surefirebooter4299838430314804673.jar> <https://builds.apache.org/job/HBase-0.94-security/ws/trunk/target/surefire/surefire5060628137794292714tmp> <https://builds.apache.org/job/HBase-0.94-security/ws/trunk/target/surefire/surefire_1119131495619465076942tmp>
Running org.apache.hadoop.hbase.constraint.TestConstraint
Tests run: 5, Failures: 0, Errors: 0, Skipped: 0, Time elapsed: 30.192 sec
Forking command line: /bin/sh -c cd <https://builds.apache.org/job/HBase-0.94-security/ws/trunk> && /home/jenkins/tools/java/jdk1.6.0_27-32/jre/bin/java -enableassertions -Xmx1900m -Djava.security.egd=file:/dev/./urandom -jar <https://builds.apache.org/job/HBase-0.94-security/ws/trunk/target/surefire/surefirebooter1082374880865524097.jar> <https://builds.apache.org/job/HBase-0.94-security/ws/trunk/target/surefire/surefire2021146238738030354tmp> <https://builds.apache.org/job/HBase-0.94-security/ws/trunk/target/surefire/surefire_1127868711125025585102tmp>
Running org.apache.hadoop.hbase.master.TestActiveMasterManager
Tests run: 2, Failures: 0, Errors: 0, Skipped: 0, Time elapsed: 0.813 sec
Forking command line: /bin/sh -c cd <https://builds.apache.org/job/HBase-0.94-security/ws/trunk> && /home/jenkins/tools/java/jdk1.6.0_27-32/jre/bin/java -enableassertions -Xmx1900m -Djava.security.egd=file:/dev/./urandom -jar <https://builds.apache.org/job/HBase-0.94-security/ws/trunk/target/surefire/surefirebooter7415410843165521356.jar> <https://builds.apache.org/job/HBase-0.94-security/ws/trunk/target/surefire/surefire6362800276029552339tmp> <https://builds.apache.org/job/HBase-0.94-security/ws/trunk/target/surefire/surefire_1133395695021696381522tmp>
Running org.apache.hadoop.hbase.master.TestMasterStatusServlet
Tests run: 5, Failures: 0, Errors: 0, Skipped: 0, Time elapsed: 0.973 sec
Forking command line: /bin/sh -c cd <https://builds.apache.org/job/HBase-0.94-security/ws/trunk> && /home/jenkins/tools/java/jdk1.6.0_27-32/jre/bin/java -enableassertions -Xmx1900m -Djava.security.egd=file:/dev/./urandom -jar <https://builds.apache.org/job/HBase-0.94-security/ws/trunk/target/surefire/surefirebooter69566895063069515.jar> <https://builds.apache.org/job/HBase-0.94-security/ws/trunk/target/surefire/surefire981518393271260502tmp> <https://builds.apache.org/job/HBase-0.94-security/ws/trunk/target/surefire/surefire_1148762287430761322374tmp>
Running org.apache.hadoop.hbase.master.TestClockSkewDetection
Tests run: 1, Failures: 0, Errors: 0, Skipped: 0, Time elapsed: 0.296 sec
Forking command line: /bin/sh -c cd <https://builds.apache.org/job/HBase-0.94-security/ws/trunk> && /home/jenkins/tools/java/jdk1.6.0_27-32/jre/bin/java -enableassertions -Xmx1900m -Djava.security.egd=file:/dev/./urandom -jar <https://builds.apache.org/job/HBase-0.94-security/ws/trunk/target/surefire/surefirebooter375723021678222353.jar> <https://builds.apache.org/job/HBase-0.94-security/ws/trunk/target/surefire/surefire4623950853916921399tmp> <https://builds.apache.org/job/HBase-0.94-security/ws/trunk/target/surefire/surefire_1151832927357229175239tmp>
Running org.apache.hadoop.hbase.master.TestDefaultLoadBalancer
Tests run: 4, Failures: 0, Errors: 0, Skipped: 0, Time elapsed: 1.498 sec
Forking command line: /bin/sh -c cd <https://builds.apache.org/job/HBase-0.94-security/ws/trunk> && /home/jenkins/tools/java/jdk1.6.0_27-32/jre/bin/java -enableassertions -Xmx1900m -Djava.security.egd=file:/dev/./urandom -jar <https://builds.apache.org/job/HBase-0.94-security/ws/trunk/target/surefire/surefirebooter6994818316653766656.jar> <https://builds.apache.org/job/HBase-0.94-security/ws/trunk/target/surefire/surefire9121168458225743801tmp> <https://builds.apache.org/job/HBase-0.94-security/ws/trunk/target/surefire/surefire_1163413517460161409528tmp>
Running org.apache.hadoop.hbase.master.TestOpenedRegionHandler
Tests run: 2, Failures: 0, Errors: 0, Skipped: 0, Time elapsed: 12.524 sec
Forking command line: /bin/sh -c cd <https://builds.apache.org/job/HBase-0.94-security/ws/trunk> && /home/jenkins/tools/java/jdk1.6.0_27-32/jre/bin/java -enableassertions -Xmx1900m -Djava.security.egd=file:/dev/./urandom -jar <https://builds.apache.org/job/HBase-0.94-security/ws/trunk/target/surefire/surefirebooter8458813123652557923.jar> <https://builds.apache.org/job/HBase-0.94-security/ws/trunk/target/surefire/surefire7574156515599669071tmp> <https://builds.apache.org/job/HBase-0.94-security/ws/trunk/target/surefire/surefire_117391876159705127888tmp>
Running org.apache.hadoop.hbase.master.TestHMasterRPCException
Tests run: 1, Failures: 0, Errors: 0, Skipped: 0, Time elapsed: 1.156 sec
Forking command line: /bin/sh -c cd <https://builds.apache.org/job/HBase-0.94-security/ws/trunk> && /home/jenkins/tools/java/jdk1.6.0_27-32/jre/bin/java -enableassertions -Xmx1900m -Djava.security.egd=file:/dev/./urandom -jar <https://builds.apache.org/job/HBase-0.94-security/ws/trunk/target/surefire/surefirebooter5513921121424868511.jar> <https://builds.apache.org/job/HBase-0.94-security/ws/trunk/target/surefire/surefire8122228780937426769tmp> <https://builds.apache.org/job/HBase-0.94-security/ws/trunk/target/surefire/surefire_1181039111730676194687tmp>
Running org.apache.hadoop.hbase.master.TestMaster
Tests run: 1, Failures: 0, Errors: 0, Skipped: 0, Time elapsed: 15.07 sec
Running org.apache.hadoop.hbase.master.TestSplitLogManager
Tests run: 12, Failures: 0, Errors: 0, Skipped: 0, Time elapsed: 14.267 sec
Forking command line: /bin/sh -c cd <https://builds.apache.org/job/HBase-0.94-security/ws/trunk> && /home/jenkins/tools/java/jdk1.6.0_27-32/jre/bin/java -enableassertions -Xmx1900m -Djava.security.egd=file:/dev/./urandom -jar <https://builds.apache.org/job/HBase-0.94-security/ws/trunk/target/surefire/surefirebooter8221309903175920294.jar> <https://builds.apache.org/job/HBase-0.94-security/ws/trunk/target/surefire/surefire8660195627292800499tmp> <https://builds.apache.org/job/HBase-0.94-security/ws/trunk/target/surefire/surefire_1193385838583316329564tmp>
Forking command line: /bin/sh -c cd <https://builds.apache.org/job/HBase-0.94-security/ws/trunk> && /home/jenkins/tools/java/jdk1.6.0_27-32/jre/bin/java -enableassertions -Xmx1900m -Djava.security.egd=file:/dev/./urandom -jar <https://builds.apache.org/job/HBase-0.94-security/ws/trunk/target/surefire/surefirebooter4010609730932943666.jar> <https://builds.apache.org/job/HBase-0.94-security/ws/trunk/target/surefire/surefire5493088438656098975tmp> <https://builds.apache.org/job/HBase-0.94-security/ws/trunk/target/surefire/surefire_1202572493921267655481tmp>
Running org.apache.hadoop.hbase.master.TestDeadServer
Tests run: 1, Failures: 0, Errors: 0, Skipped: 0, Time elapsed: 0.212 sec
Forking command line: /bin/sh -c cd <https://builds.apache.org/job/HBase-0.94-security/ws/trunk> && /home/jenkins/tools/java/jdk1.6.0_27-32/jre/bin/java -enableassertions -Xmx1900m -Djava.security.egd=file:/dev/./urandom -jar <https://builds.apache.org/job/HBase-0.94-security/ws/trunk/target/surefire/surefirebooter2689646023410605371.jar> <https://builds.apache.org/job/HBase-0.94-security/ws/trunk/target/surefire/surefire1878466622994015478tmp> <https://builds.apache.org/job/HBase-0.94-security/ws/trunk/target/surefire/surefire_121973454014274810027tmp>
Running org.apache.hadoop.hbase.master.TestLogsCleaner
Tests run: 1, Failures: 0, Errors: 0, Skipped: 0, Time elapsed: 3.041 sec
Forking command line: /bin/sh -c cd <https://builds.apache.org/job/HBase-0.94-security/ws/trunk> && /home/jenkins/tools/java/jdk1.6.0_27-32/jre/bin/java -enableassertions -Xmx1900m -Djava.security.egd=file:/dev/./urandom -jar <https://builds.apache.org/job/HBase-0.94-security/ws/trunk/target/surefire/surefirebooter1084955997109357264.jar> <https://builds.apache.org/job/HBase-0.94-security/ws/trunk/target/surefire/surefire1239898802282777454tmp> <https://builds.apache.org/job/HBase-0.94-security/ws/trunk/target/surefire/surefire_1223945344316440194723tmp>
Running org.apache.hadoop.hbase.master.TestMasterZKSessionRecovery
Tests run: 2, Failures: 0, Errors: 0, Skipped: 0, Time elapsed: 18.455 sec
Running org.apache.hadoop.hbase.master.TestZKBasedOpenCloseRegion
Tests run: 4, Failures: 0, Errors: 0, Skipped: 0, Time elapsed: 17.377 sec

Results :

Tests in error: 
  testLocalHBaseCluster(org.apache.hadoop.hbase.TestLocalHBaseCluster): Master not initialized after 200 seconds

Tests run: 632, Failures: 0, Errors: 1, Skipped: 2

[INFO] ------------------------------------------------------------------------
[INFO] BUILD FAILURE
[INFO] ------------------------------------------------------------------------
[INFO] Total time: 31:25.411s
[INFO] Finished at: Thu May 24 11:09:15 UTC 2012
[INFO] Final Memory: 45M/894M
[INFO] ------------------------------------------------------------------------
[ERROR] Failed to execute goal org.apache.maven.plugins:maven-surefire-plugin:2.12-TRUNK-HBASE-2:test (secondPartTestsExecution) on project hbase: There are test failures.
[ERROR] 
[ERROR] Please refer to <https://builds.apache.org/job/HBase-0.94-security/ws/trunk/target/surefire-reports> for the individual test results.
[ERROR] -> [Help 1]
org.apache.maven.lifecycle.LifecycleExecutionException: Failed to execute goal org.apache.maven.plugins:maven-surefire-plugin:2.12-TRUNK-HBASE-2:test (secondPartTestsExecution) on project hbase: There are test failures.

Please refer to <https://builds.apache.org/job/HBase-0.94-security/ws/trunk/target/surefire-reports> for the individual test results.
	at org.apache.maven.lifecycle.internal.MojoExecutor.execute(MojoExecutor.java:213)
	at org.apache.maven.lifecycle.internal.MojoExecutor.execute(MojoExecutor.java:153)
	at org.apache.maven.lifecycle.internal.MojoExecutor.execute(MojoExecutor.java:145)
	at org.apache.maven.lifecycle.internal.MojoExecutor.executeForkedExecutions(MojoExecutor.java:365)
	at org.apache.maven.lifecycle.internal.MojoExecutor.execute(MojoExecutor.java:199)
	at org.apache.maven.lifecycle.internal.MojoExecutor.execute(MojoExecutor.java:153)
	at org.apache.maven.lifecycle.internal.MojoExecutor.execute(MojoExecutor.java:145)
	at org.apache.maven.lifecycle.internal.LifecycleModuleBuilder.buildProject(LifecycleModuleBuilder.java:84)
	at org.apache.maven.lifecycle.internal.LifecycleModuleBuilder.buildProject(LifecycleModuleBuilder.java:59)
	at org.apache.maven.lifecycle.internal.LifecycleStarter.singleThreadedBuild(LifecycleStarter.java:183)
	at org.apache.maven.lifecycle.internal.LifecycleStarter.execute(LifecycleStarter.java:161)
	at org.apache.maven.DefaultMaven.doExecute(DefaultMaven.java:319)
	at org.apache.maven.DefaultMaven.execute(DefaultMaven.java:156)
	at org.apache.maven.cli.MavenCli.execute(MavenCli.java:537)
	at org.apache.maven.cli.MavenCli.doMain(MavenCli.java:196)
	at org.apache.maven.cli.MavenCli.main(MavenCli.java:141)
	at sun.reflect.NativeMethodAccessorImpl.invoke0(Native Method)
	at sun.reflect.NativeMethodAccessorImpl.invoke(NativeMethodAccessorImpl.java:39)
	at sun.reflect.DelegatingMethodAccessorImpl.invoke(DelegatingMethodAccessorImpl.java:25)
	at java.lang.reflect.Method.invoke(Method.java:597)
	at org.codehaus.plexus.classworlds.launcher.Launcher.launchEnhanced(Launcher.java:290)
	at org.codehaus.plexus.classworlds.launcher.Launcher.launch(Launcher.java:230)
	at org.codehaus.plexus.classworlds.launcher.Launcher.mainWithExitCode(Launcher.java:409)
	at org.codehaus.plexus.classworlds.launcher.Launcher.main(Launcher.java:352)
Caused by: org.apache.maven.plugin.MojoFailureException: There are test failures.

Please refer to <https://builds.apache.org/job/HBase-0.94-security/ws/trunk/target/surefire-reports> for the individual test results.
	at org.apache.maven.plugin.surefire.SurefireHelper.reportExecution(SurefireHelper.java:87)
	at org.apache.maven.plugin.surefire.SurefirePlugin.writeSummary(SurefirePlugin.java:651)
	at org.apache.maven.plugin.surefire.SurefirePlugin.handleSummary(SurefirePlugin.java:625)
	at org.apache.maven.plugin.surefire.AbstractSurefireMojo.executeAfterPreconditionsChecked(AbstractSurefireMojo.java:137)
	at org.apache.maven.plugin.surefire.AbstractSurefireMojo.execute(AbstractSurefireMojo.java:98)
	at org.apache.maven.plugin.DefaultBuildPluginManager.executeMojo(DefaultBuildPluginManager.java:101)
	at org.apache.maven.lifecycle.internal.MojoExecutor.execute(MojoExecutor.java:209)
	... 23 more
[ERROR] 
[ERROR] 
[ERROR] For more information about the errors and possible solutions, please read the following articles:
[ERROR] [Help 1] http://cwiki.apache.org/confluence/display/MAVEN/MojoFailureException
Build step 'Invoke top-level Maven targets' marked build as failure
Archiving artifacts
Error updating JIRA issues. Saving issues for next build.
(503)Service Temporarily Unavailable
Recording test results

Build failed in Jenkins: HBase-0.94-security #29

Posted by Apache Jenkins Server <je...@builds.apache.org>.
See <https://builds.apache.org/job/HBase-0.94-security/29/changes>

Changes:

[tedyu] HBASE-6047 Put.has() can't determine result correctly (Alex Newman)

------------------------------------------
[...truncated 7237 lines...]
Tests run: 2, Failures: 0, Errors: 0, Skipped: 0, Time elapsed: 2.636 sec
Forking command line: /bin/sh -c cd /x1/jenkins/jenkins-slave/workspace/HBase-0.94-security/trunk && /x1/jenkins/tools/java/jdk1.6.0_32-32/jre/bin/java -enableassertions -Xmx1900m -Djava.security.egd=file:/dev/./urandom -jar /x1/jenkins/jenkins-slave/workspace/HBase-0.94-security/trunk/target/surefire/surefirebooter2672195025786253847.jar /x1/jenkins/jenkins-slave/workspace/HBase-0.94-security/trunk/target/surefire/surefire8449915093151876593tmp /x1/jenkins/jenkins-slave/workspace/HBase-0.94-security/trunk/target/surefire/surefire_64598311717601101736tmp
Running org.apache.hadoop.hbase.regionserver.TestRpcMetrics
Tests run: 1, Failures: 0, Errors: 0, Skipped: 0, Time elapsed: 1.676 sec
Forking command line: /bin/sh -c cd /x1/jenkins/jenkins-slave/workspace/HBase-0.94-security/trunk && /x1/jenkins/tools/java/jdk1.6.0_32-32/jre/bin/java -enableassertions -Xmx1900m -Djava.security.egd=file:/dev/./urandom -jar /x1/jenkins/jenkins-slave/workspace/HBase-0.94-security/trunk/target/surefire/surefirebooter8472411777722716846.jar /x1/jenkins/jenkins-slave/workspace/HBase-0.94-security/trunk/target/surefire/surefire7550124294808783606tmp /x1/jenkins/jenkins-slave/workspace/HBase-0.94-security/trunk/target/surefire/surefire_652468098979444222962tmp
Running org.apache.hadoop.hbase.regionserver.TestSeekOptimizations
Tests run: 6, Failures: 0, Errors: 0, Skipped: 0, Time elapsed: 2.392 sec
Forking command line: /bin/sh -c cd /x1/jenkins/jenkins-slave/workspace/HBase-0.94-security/trunk && /x1/jenkins/tools/java/jdk1.6.0_32-32/jre/bin/java -enableassertions -Xmx1900m -Djava.security.egd=file:/dev/./urandom -jar /x1/jenkins/jenkins-slave/workspace/HBase-0.94-security/trunk/target/surefire/surefirebooter3530687517020910641.jar /x1/jenkins/jenkins-slave/workspace/HBase-0.94-security/trunk/target/surefire/surefire6648051850807833400tmp /x1/jenkins/jenkins-slave/workspace/HBase-0.94-security/trunk/target/surefire/surefire_668270916316255273386tmp
Running org.apache.hadoop.hbase.regionserver.TestServerCustomProtocol
Tests run: 7, Failures: 0, Errors: 0, Skipped: 0, Time elapsed: 15.751 sec
Forking command line: /bin/sh -c cd /x1/jenkins/jenkins-slave/workspace/HBase-0.94-security/trunk && /x1/jenkins/tools/java/jdk1.6.0_32-32/jre/bin/java -enableassertions -Xmx1900m -Djava.security.egd=file:/dev/./urandom -jar /x1/jenkins/jenkins-slave/workspace/HBase-0.94-security/trunk/target/surefire/surefirebooter3135960175344305256.jar /x1/jenkins/jenkins-slave/workspace/HBase-0.94-security/trunk/target/surefire/surefire8286865482222435528tmp /x1/jenkins/jenkins-slave/workspace/HBase-0.94-security/trunk/target/surefire/surefire_678449463186734480791tmp
Running org.apache.hadoop.hbase.regionserver.handler.TestCloseRegionHandler
Tests run: 3, Failures: 0, Errors: 0, Skipped: 0, Time elapsed: 1.289 sec
Forking command line: /bin/sh -c cd /x1/jenkins/jenkins-slave/workspace/HBase-0.94-security/trunk && /x1/jenkins/tools/java/jdk1.6.0_32-32/jre/bin/java -enableassertions -Xmx1900m -Djava.security.egd=file:/dev/./urandom -jar /x1/jenkins/jenkins-slave/workspace/HBase-0.94-security/trunk/target/surefire/surefirebooter400267907687645270.jar /x1/jenkins/jenkins-slave/workspace/HBase-0.94-security/trunk/target/surefire/surefire4323010317600168121tmp /x1/jenkins/jenkins-slave/workspace/HBase-0.94-security/trunk/target/surefire/surefire_682816720109540704635tmp
Running org.apache.hadoop.hbase.regionserver.handler.TestOpenRegionHandler
Tests run: 3, Failures: 0, Errors: 0, Skipped: 0, Time elapsed: 0.856 sec
Forking command line: /bin/sh -c cd /x1/jenkins/jenkins-slave/workspace/HBase-0.94-security/trunk && /x1/jenkins/tools/java/jdk1.6.0_32-32/jre/bin/java -enableassertions -Xmx1900m -Djava.security.egd=file:/dev/./urandom -jar /x1/jenkins/jenkins-slave/workspace/HBase-0.94-security/trunk/target/surefire/surefirebooter4740449083102389479.jar /x1/jenkins/jenkins-slave/workspace/HBase-0.94-security/trunk/target/surefire/surefire7379032755470361393tmp /x1/jenkins/jenkins-slave/workspace/HBase-0.94-security/trunk/target/surefire/surefire_69968597383360619728tmp
Running org.apache.hadoop.hbase.regionserver.TestBlocksRead
Tests run: 4, Failures: 0, Errors: 0, Skipped: 0, Time elapsed: 0.761 sec
Forking command line: /bin/sh -c cd /x1/jenkins/jenkins-slave/workspace/HBase-0.94-security/trunk && /x1/jenkins/tools/java/jdk1.6.0_32-32/jre/bin/java -enableassertions -Xmx1900m -Djava.security.egd=file:/dev/./urandom -jar /x1/jenkins/jenkins-slave/workspace/HBase-0.94-security/trunk/target/surefire/surefirebooter7472749714317850187.jar /x1/jenkins/jenkins-slave/workspace/HBase-0.94-security/trunk/target/surefire/surefire4489146514595005138tmp /x1/jenkins/jenkins-slave/workspace/HBase-0.94-security/trunk/target/surefire/surefire_701551889773616301672tmp
Running org.apache.hadoop.hbase.regionserver.TestStoreScanner
Tests run: 16, Failures: 0, Errors: 0, Skipped: 0, Time elapsed: 0.05 sec
Forking command line: /bin/sh -c cd /x1/jenkins/jenkins-slave/workspace/HBase-0.94-security/trunk && /x1/jenkins/tools/java/jdk1.6.0_32-32/jre/bin/java -enableassertions -Xmx1900m -Djava.security.egd=file:/dev/./urandom -jar /x1/jenkins/jenkins-slave/workspace/HBase-0.94-security/trunk/target/surefire/surefirebooter2447799318019665305.jar /x1/jenkins/jenkins-slave/workspace/HBase-0.94-security/trunk/target/surefire/surefire7474508059378967692tmp /x1/jenkins/jenkins-slave/workspace/HBase-0.94-security/trunk/target/surefire/surefire_716813323968273209862tmp
Running org.apache.hadoop.hbase.regionserver.TestSplitLogWorker
Tests run: 5, Failures: 0, Errors: 0, Skipped: 0, Time elapsed: 2.096 sec
Forking command line: /bin/sh -c cd /x1/jenkins/jenkins-slave/workspace/HBase-0.94-security/trunk && /x1/jenkins/tools/java/jdk1.6.0_32-32/jre/bin/java -enableassertions -Xmx1900m -Djava.security.egd=file:/dev/./urandom -jar /x1/jenkins/jenkins-slave/workspace/HBase-0.94-security/trunk/target/surefire/surefirebooter8847009252081446151.jar /x1/jenkins/jenkins-slave/workspace/HBase-0.94-security/trunk/target/surefire/surefire4320823427205224148tmp /x1/jenkins/jenkins-slave/workspace/HBase-0.94-security/trunk/target/surefire/surefire_728267143321392930477tmp
Running org.apache.hadoop.hbase.regionserver.metrics.TestSchemaMetrics
Tests run: 6, Failures: 0, Errors: 0, Skipped: 0, Time elapsed: 10.852 sec
Forking command line: /bin/sh -c cd /x1/jenkins/jenkins-slave/workspace/HBase-0.94-security/trunk && /x1/jenkins/tools/java/jdk1.6.0_32-32/jre/bin/java -enableassertions -Xmx1900m -Djava.security.egd=file:/dev/./urandom -jar /x1/jenkins/jenkins-slave/workspace/HBase-0.94-security/trunk/target/surefire/surefirebooter4814157271845314113.jar /x1/jenkins/jenkins-slave/workspace/HBase-0.94-security/trunk/target/surefire/surefire1537454994281826287tmp /x1/jenkins/jenkins-slave/workspace/HBase-0.94-security/trunk/target/surefire/surefire_737999264396814945772tmp
Running org.apache.hadoop.hbase.regionserver.TestStoreFileBlockCacheSummary
Tests run: 1, Failures: 0, Errors: 0, Skipped: 0, Time elapsed: 11.7 sec
Forking command line: /bin/sh -c cd /x1/jenkins/jenkins-slave/workspace/HBase-0.94-security/trunk && /x1/jenkins/tools/java/jdk1.6.0_32-32/jre/bin/java -enableassertions -Xmx1900m -Djava.security.egd=file:/dev/./urandom -jar /x1/jenkins/jenkins-slave/workspace/HBase-0.94-security/trunk/target/surefire/surefirebooter6366424410346299347.jar /x1/jenkins/jenkins-slave/workspace/HBase-0.94-security/trunk/target/surefire/surefire7467695268183158258tmp /x1/jenkins/jenkins-slave/workspace/HBase-0.94-security/trunk/target/surefire/surefire_742484524896288478481tmp
Running org.apache.hadoop.hbase.regionserver.TestMasterAddressManager
Tests run: 1, Failures: 0, Errors: 0, Skipped: 0, Time elapsed: 0.596 sec
Forking command line: /bin/sh -c cd /x1/jenkins/jenkins-slave/workspace/HBase-0.94-security/trunk && /x1/jenkins/tools/java/jdk1.6.0_32-32/jre/bin/java -enableassertions -Xmx1900m -Djava.security.egd=file:/dev/./urandom -jar /x1/jenkins/jenkins-slave/workspace/HBase-0.94-security/trunk/target/surefire/surefirebooter6455246013691645265.jar /x1/jenkins/jenkins-slave/workspace/HBase-0.94-security/trunk/target/surefire/surefire8828999784425313051tmp /x1/jenkins/jenkins-slave/workspace/HBase-0.94-security/trunk/target/surefire/surefire_756915305654955102474tmp
Running org.apache.hadoop.hbase.regionserver.TestMultiColumnScanner
Tests run: 12, Failures: 0, Errors: 0, Skipped: 0, Time elapsed: 28.382 sec
Forking command line: /bin/sh -c cd /x1/jenkins/jenkins-slave/workspace/HBase-0.94-security/trunk && /x1/jenkins/tools/java/jdk1.6.0_32-32/jre/bin/java -enableassertions -Xmx1900m -Djava.security.egd=file:/dev/./urandom -jar /x1/jenkins/jenkins-slave/workspace/HBase-0.94-security/trunk/target/surefire/surefirebooter4214398831899886503.jar /x1/jenkins/jenkins-slave/workspace/HBase-0.94-security/trunk/target/surefire/surefire3398890641448247128tmp /x1/jenkins/jenkins-slave/workspace/HBase-0.94-security/trunk/target/surefire/surefire_763203862938035451206tmp
Running org.apache.hadoop.hbase.regionserver.TestHRegion
Tests run: 62, Failures: 0, Errors: 0, Skipped: 0, Time elapsed: 30.179 sec
Forking command line: /bin/sh -c cd /x1/jenkins/jenkins-slave/workspace/HBase-0.94-security/trunk && /x1/jenkins/tools/java/jdk1.6.0_32-32/jre/bin/java -enableassertions -Xmx1900m -Djava.security.egd=file:/dev/./urandom -jar /x1/jenkins/jenkins-slave/workspace/HBase-0.94-security/trunk/target/surefire/surefirebooter4894085367483251438.jar /x1/jenkins/jenkins-slave/workspace/HBase-0.94-security/trunk/target/surefire/surefire5050749027996434955tmp /x1/jenkins/jenkins-slave/workspace/HBase-0.94-security/trunk/target/surefire/surefire_776167924294554297552tmp
Running org.apache.hadoop.hbase.ipc.TestDelayedRpc
Tests run: 4, Failures: 0, Errors: 0, Skipped: 0, Time elapsed: 2.302 sec
Forking command line: /bin/sh -c cd /x1/jenkins/jenkins-slave/workspace/HBase-0.94-security/trunk && /x1/jenkins/tools/java/jdk1.6.0_32-32/jre/bin/java -enableassertions -Xmx1900m -Djava.security.egd=file:/dev/./urandom -jar /x1/jenkins/jenkins-slave/workspace/HBase-0.94-security/trunk/target/surefire/surefirebooter5465704741793480093.jar /x1/jenkins/jenkins-slave/workspace/HBase-0.94-security/trunk/target/surefire/surefire7213915747622557887tmp /x1/jenkins/jenkins-slave/workspace/HBase-0.94-security/trunk/target/surefire/surefire_782032701903554091444tmp
Running org.apache.hadoop.hbase.TestGlobalMemStoreSize
Tests run: 1, Failures: 0, Errors: 0, Skipped: 0, Time elapsed: 15.074 sec
Forking command line: /bin/sh -c cd /x1/jenkins/jenkins-slave/workspace/HBase-0.94-security/trunk && /x1/jenkins/tools/java/jdk1.6.0_32-32/jre/bin/java -enableassertions -Xmx1900m -Djava.security.egd=file:/dev/./urandom -jar /x1/jenkins/jenkins-slave/workspace/HBase-0.94-security/trunk/target/surefire/surefirebooter7847347929761975181.jar /x1/jenkins/jenkins-slave/workspace/HBase-0.94-security/trunk/target/surefire/surefire5425925313435691149tmp /x1/jenkins/jenkins-slave/workspace/HBase-0.94-security/trunk/target/surefire/surefire_796476604757780212369tmp
Running org.apache.hadoop.hbase.constraint.TestConstraint
Tests run: 5, Failures: 0, Errors: 0, Skipped: 0, Time elapsed: 29.155 sec
Forking command line: /bin/sh -c cd /x1/jenkins/jenkins-slave/workspace/HBase-0.94-security/trunk && /x1/jenkins/tools/java/jdk1.6.0_32-32/jre/bin/java -enableassertions -Xmx1900m -Djava.security.egd=file:/dev/./urandom -jar /x1/jenkins/jenkins-slave/workspace/HBase-0.94-security/trunk/target/surefire/surefirebooter4580202383879061329.jar /x1/jenkins/jenkins-slave/workspace/HBase-0.94-security/trunk/target/surefire/surefire5639679282278629292tmp /x1/jenkins/jenkins-slave/workspace/HBase-0.94-security/trunk/target/surefire/surefire_808056762143310116974tmp
Running org.apache.hadoop.hbase.rest.TestSchemaResource
Tests run: 2, Failures: 0, Errors: 0, Skipped: 0, Time elapsed: 18.464 sec
Forking command line: /bin/sh -c cd /x1/jenkins/jenkins-slave/workspace/HBase-0.94-security/trunk && /x1/jenkins/tools/java/jdk1.6.0_32-32/jre/bin/java -enableassertions -Xmx1900m -Djava.security.egd=file:/dev/./urandom -jar /x1/jenkins/jenkins-slave/workspace/HBase-0.94-security/trunk/target/surefire/surefirebooter2202514745125181462.jar /x1/jenkins/jenkins-slave/workspace/HBase-0.94-security/trunk/target/surefire/surefire1667490750537612894tmp /x1/jenkins/jenkins-slave/workspace/HBase-0.94-security/trunk/target/surefire/surefire_81652506624404849431tmp
Running org.apache.hadoop.hbase.rest.client.TestRemoteAdmin
Tests run: 1, Failures: 0, Errors: 0, Skipped: 0, Time elapsed: 14.253 sec
Forking command line: /bin/sh -c cd /x1/jenkins/jenkins-slave/workspace/HBase-0.94-security/trunk && /x1/jenkins/tools/java/jdk1.6.0_32-32/jre/bin/java -enableassertions -Xmx1900m -Djava.security.egd=file:/dev/./urandom -jar /x1/jenkins/jenkins-slave/workspace/HBase-0.94-security/trunk/target/surefire/surefirebooter6419052428878393133.jar /x1/jenkins/jenkins-slave/workspace/HBase-0.94-security/trunk/target/surefire/surefire1305102123116474340tmp /x1/jenkins/jenkins-slave/workspace/HBase-0.94-security/trunk/target/surefire/surefire_823363029633050998039tmp
Running org.apache.hadoop.hbase.rest.client.TestRemoteTable
Tests run: 3, Failures: 0, Errors: 0, Skipped: 0, Time elapsed: 15.163 sec
Forking command line: /bin/sh -c cd /x1/jenkins/jenkins-slave/workspace/HBase-0.94-security/trunk && /x1/jenkins/tools/java/jdk1.6.0_32-32/jre/bin/java -enableassertions -Xmx1900m -Djava.security.egd=file:/dev/./urandom -jar /x1/jenkins/jenkins-slave/workspace/HBase-0.94-security/trunk/target/surefire/surefirebooter5460533424294500949.jar /x1/jenkins/jenkins-slave/workspace/HBase-0.94-security/trunk/target/surefire/surefire4312606004338478510tmp /x1/jenkins/jenkins-slave/workspace/HBase-0.94-security/trunk/target/surefire/surefire_837285746037680836911tmp
Running org.apache.hadoop.hbase.rest.TestTableResource
Tests run: 8, Failures: 0, Errors: 0, Skipped: 0, Time elapsed: 21.832 sec
Forking command line: /bin/sh -c cd /x1/jenkins/jenkins-slave/workspace/HBase-0.94-security/trunk && /x1/jenkins/tools/java/jdk1.6.0_32-32/jre/bin/java -enableassertions -Xmx1900m -Djava.security.egd=file:/dev/./urandom -jar /x1/jenkins/jenkins-slave/workspace/HBase-0.94-security/trunk/target/surefire/surefirebooter8733660786264508395.jar /x1/jenkins/jenkins-slave/workspace/HBase-0.94-security/trunk/target/surefire/surefire5492340369776346525tmp /x1/jenkins/jenkins-slave/workspace/HBase-0.94-security/trunk/target/surefire/surefire_844010055345912591443tmp
Running org.apache.hadoop.hbase.rest.TestMultiRowResource
Tests run: 3, Failures: 0, Errors: 0, Skipped: 0, Time elapsed: 13.724 sec
Forking command line: /bin/sh -c cd /x1/jenkins/jenkins-slave/workspace/HBase-0.94-security/trunk && /x1/jenkins/tools/java/jdk1.6.0_32-32/jre/bin/java -enableassertions -Xmx1900m -Djava.security.egd=file:/dev/./urandom -jar /x1/jenkins/jenkins-slave/workspace/HBase-0.94-security/trunk/target/surefire/surefirebooter6869150477342711795.jar /x1/jenkins/jenkins-slave/workspace/HBase-0.94-security/trunk/target/surefire/surefire7797520678903831435tmp /x1/jenkins/jenkins-slave/workspace/HBase-0.94-security/trunk/target/surefire/surefire_855124737661904580646tmp
Running org.apache.hadoop.hbase.rest.TestGzipFilter
Tests run: 3, Failures: 0, Errors: 0, Skipped: 0, Time elapsed: 13.536 sec
Forking command line: /bin/sh -c cd /x1/jenkins/jenkins-slave/workspace/HBase-0.94-security/trunk && /x1/jenkins/tools/java/jdk1.6.0_32-32/jre/bin/java -enableassertions -Xmx1900m -Djava.security.egd=file:/dev/./urandom -jar /x1/jenkins/jenkins-slave/workspace/HBase-0.94-security/trunk/target/surefire/surefirebooter5517973179582420877.jar /x1/jenkins/jenkins-slave/workspace/HBase-0.94-security/trunk/target/surefire/surefire2600801831087729511tmp /x1/jenkins/jenkins-slave/workspace/HBase-0.94-security/trunk/target/surefire/surefire_861548123192713762550tmp
Running org.apache.hadoop.hbase.rest.TestRowResource
Tests run: 11, Failures: 0, Errors: 0, Skipped: 0, Time elapsed: 13.343 sec
Forking command line: /bin/sh -c cd /x1/jenkins/jenkins-slave/workspace/HBase-0.94-security/trunk && /x1/jenkins/tools/java/jdk1.6.0_32-32/jre/bin/java -enableassertions -Xmx1900m -Djava.security.egd=file:/dev/./urandom -jar /x1/jenkins/jenkins-slave/workspace/HBase-0.94-security/trunk/target/surefire/surefirebooter4183969718613226021.jar /x1/jenkins/jenkins-slave/workspace/HBase-0.94-security/trunk/target/surefire/surefire7975057035144891842tmp /x1/jenkins/jenkins-slave/workspace/HBase-0.94-security/trunk/target/surefire/surefire_873423631019032254310tmp
Running org.apache.hadoop.hbase.rest.TestScannerResource
Tests run: 5, Failures: 0, Errors: 0, Skipped: 0, Time elapsed: 26.19 sec
Forking command line: /bin/sh -c cd /x1/jenkins/jenkins-slave/workspace/HBase-0.94-security/trunk && /x1/jenkins/tools/java/jdk1.6.0_32-32/jre/bin/java -enableassertions -Xmx1900m -Djava.security.egd=file:/dev/./urandom -jar /x1/jenkins/jenkins-slave/workspace/HBase-0.94-security/trunk/target/surefire/surefirebooter8688664087831921150.jar /x1/jenkins/jenkins-slave/workspace/HBase-0.94-security/trunk/target/surefire/surefire4253068697635585422tmp /x1/jenkins/jenkins-slave/workspace/HBase-0.94-security/trunk/target/surefire/surefire_8884116928217465502tmp
Running org.apache.hadoop.hbase.TestLocalHBaseCluster
Tests run: 1, Failures: 0, Errors: 1, Skipped: 0, Time elapsed: 201.368 sec <<< FAILURE!
Forking command line: /bin/sh -c cd /x1/jenkins/jenkins-slave/workspace/HBase-0.94-security/trunk && /x1/jenkins/tools/java/jdk1.6.0_32-32/jre/bin/java -enableassertions -Xmx1900m -Djava.security.egd=file:/dev/./urandom -jar /x1/jenkins/jenkins-slave/workspace/HBase-0.94-security/trunk/target/surefire/surefirebooter4555048814754297142.jar /x1/jenkins/jenkins-slave/workspace/HBase-0.94-security/trunk/target/surefire/surefire7807470745318509719tmp /x1/jenkins/jenkins-slave/workspace/HBase-0.94-security/trunk/target/surefire/surefire_893113345435182394454tmp
Running org.apache.hadoop.hbase.rest.TestVersionResource
Tests run: 7, Failures: 0, Errors: 0, Skipped: 0, Time elapsed: 12.18 sec
Forking command line: /bin/sh -c cd /x1/jenkins/jenkins-slave/workspace/HBase-0.94-security/trunk && /x1/jenkins/tools/java/jdk1.6.0_32-32/jre/bin/java -enableassertions -Xmx1900m -Djava.security.egd=file:/dev/./urandom -jar /x1/jenkins/jenkins-slave/workspace/HBase-0.94-security/trunk/target/surefire/surefirebooter3875375740465128584.jar /x1/jenkins/jenkins-slave/workspace/HBase-0.94-security/trunk/target/surefire/surefire2894473024629773221tmp /x1/jenkins/jenkins-slave/workspace/HBase-0.94-security/trunk/target/surefire/surefire_905296196587293551662tmp
Running org.apache.hadoop.hbase.rest.TestStatusResource
Tests run: 2, Failures: 0, Errors: 0, Skipped: 0, Time elapsed: 10.538 sec
Forking command line: /bin/sh -c cd /x1/jenkins/jenkins-slave/workspace/HBase-0.94-security/trunk && /x1/jenkins/tools/java/jdk1.6.0_32-32/jre/bin/java -enableassertions -Xmx1900m -Djava.security.egd=file:/dev/./urandom -jar /x1/jenkins/jenkins-slave/workspace/HBase-0.94-security/trunk/target/surefire/surefirebooter3679794593742836408.jar /x1/jenkins/jenkins-slave/workspace/HBase-0.94-security/trunk/target/surefire/surefire8513335765998551129tmp /x1/jenkins/jenkins-slave/workspace/HBase-0.94-security/trunk/target/surefire/surefire_917960374735275523086tmp
Running org.apache.hadoop.hbase.metrics.TestMetricsMBeanBase
Tests run: 2, Failures: 0, Errors: 0, Skipped: 0, Time elapsed: 1.115 sec
Forking command line: /bin/sh -c cd /x1/jenkins/jenkins-slave/workspace/HBase-0.94-security/trunk && /x1/jenkins/tools/java/jdk1.6.0_32-32/jre/bin/java -enableassertions -Xmx1900m -Djava.security.egd=file:/dev/./urandom -jar /x1/jenkins/jenkins-slave/workspace/HBase-0.94-security/trunk/target/surefire/surefirebooter7944671940065337299.jar /x1/jenkins/jenkins-slave/workspace/HBase-0.94-security/trunk/target/surefire/surefire3795851076784217972tmp /x1/jenkins/jenkins-slave/workspace/HBase-0.94-security/trunk/target/surefire/surefire_926469729873361820166tmp
Running org.apache.hadoop.hbase.io.hfile.TestHFileBlockIndex
Tests run: 10, Failures: 0, Errors: 0, Skipped: 0, Time elapsed: 7.405 sec
Forking command line: /bin/sh -c cd /x1/jenkins/jenkins-slave/workspace/HBase-0.94-security/trunk && /x1/jenkins/tools/java/jdk1.6.0_32-32/jre/bin/java -enableassertions -Xmx1900m -Djava.security.egd=file:/dev/./urandom -jar /x1/jenkins/jenkins-slave/workspace/HBase-0.94-security/trunk/target/surefire/surefirebooter1723912837998005816.jar /x1/jenkins/jenkins-slave/workspace/HBase-0.94-security/trunk/target/surefire/surefire5758239199428041089tmp /x1/jenkins/jenkins-slave/workspace/HBase-0.94-security/trunk/target/surefire/surefire_937992393854904690753tmp
Running org.apache.hadoop.hbase.rest.TestScannersWithFilters
Tests run: 10, Failures: 0, Errors: 0, Skipped: 0, Time elapsed: 16.16 sec
Forking command line: /bin/sh -c cd /x1/jenkins/jenkins-slave/workspace/HBase-0.94-security/trunk && /x1/jenkins/tools/java/jdk1.6.0_32-32/jre/bin/java -enableassertions -Xmx1900m -Djava.security.egd=file:/dev/./urandom -jar /x1/jenkins/jenkins-slave/workspace/HBase-0.94-security/trunk/target/surefire/surefirebooter3192861439848294603.jar /x1/jenkins/jenkins-slave/workspace/HBase-0.94-security/trunk/target/surefire/surefire4147943067710299627tmp /x1/jenkins/jenkins-slave/workspace/HBase-0.94-security/trunk/target/surefire/surefire_942659205864886748051tmp
Running org.apache.hadoop.hbase.io.hfile.TestLruBlockCache
Tests run: 16, Failures: 0, Errors: 0, Skipped: 0, Time elapsed: 0.836 sec
Forking command line: /bin/sh -c cd /x1/jenkins/jenkins-slave/workspace/HBase-0.94-security/trunk && /x1/jenkins/tools/java/jdk1.6.0_32-32/jre/bin/java -enableassertions -Xmx1900m -Djava.security.egd=file:/dev/./urandom -jar /x1/jenkins/jenkins-slave/workspace/HBase-0.94-security/trunk/target/surefire/surefirebooter6262687097479930243.jar /x1/jenkins/jenkins-slave/workspace/HBase-0.94-security/trunk/target/surefire/surefire7573956080235813343tmp /x1/jenkins/jenkins-slave/workspace/HBase-0.94-security/trunk/target/surefire/surefire_955291308018383303340tmp
Running org.apache.hadoop.hbase.io.hfile.TestHFileSeek
Tests run: 1, Failures: 0, Errors: 0, Skipped: 0, Time elapsed: 6.449 sec
Forking command line: /bin/sh -c cd /x1/jenkins/jenkins-slave/workspace/HBase-0.94-security/trunk && /x1/jenkins/tools/java/jdk1.6.0_32-32/jre/bin/java -enableassertions -Xmx1900m -Djava.security.egd=file:/dev/./urandom -jar /x1/jenkins/jenkins-slave/workspace/HBase-0.94-security/trunk/target/surefire/surefirebooter6702024909863840807.jar /x1/jenkins/jenkins-slave/workspace/HBase-0.94-security/trunk/target/surefire/surefire1590818647818103263tmp /x1/jenkins/jenkins-slave/workspace/HBase-0.94-security/trunk/target/surefire/surefire_965385996618172958233tmp
Running org.apache.hadoop.hbase.io.hfile.TestFixedFileTrailer
Tests run: 2, Failures: 0, Errors: 0, Skipped: 0, Time elapsed: 0.521 sec
Forking command line: /bin/sh -c cd /x1/jenkins/jenkins-slave/workspace/HBase-0.94-security/trunk && /x1/jenkins/tools/java/jdk1.6.0_32-32/jre/bin/java -enableassertions -Xmx1900m -Djava.security.egd=file:/dev/./urandom -jar /x1/jenkins/jenkins-slave/workspace/HBase-0.94-security/trunk/target/surefire/surefirebooter8006605039637676855.jar /x1/jenkins/jenkins-slave/workspace/HBase-0.94-security/trunk/target/surefire/surefire5812393822475082326tmp /x1/jenkins/jenkins-slave/workspace/HBase-0.94-security/trunk/target/surefire/surefire_97671742852161476532tmp
Running org.apache.hadoop.hbase.io.hfile.TestHFilePerformance
Tests run: 1, Failures: 0, Errors: 0, Skipped: 0, Time elapsed: 4.506 sec
Forking command line: /bin/sh -c cd /x1/jenkins/jenkins-slave/workspace/HBase-0.94-security/trunk && /x1/jenkins/tools/java/jdk1.6.0_32-32/jre/bin/java -enableassertions -Xmx1900m -Djava.security.egd=file:/dev/./urandom -jar /x1/jenkins/jenkins-slave/workspace/HBase-0.94-security/trunk/target/surefire/surefirebooter5586564951829430480.jar /x1/jenkins/jenkins-slave/workspace/HBase-0.94-security/trunk/target/surefire/surefire302327006702282316tmp /x1/jenkins/jenkins-slave/workspace/HBase-0.94-security/trunk/target/surefire/surefire_988938243781112522032tmp
Running org.apache.hadoop.hbase.io.hfile.TestHFileBlockCompatibility
Tests run: 10, Failures: 0, Errors: 0, Skipped: 0, Time elapsed: 0.936 sec
Forking command line: /bin/sh -c cd /x1/jenkins/jenkins-slave/workspace/HBase-0.94-security/trunk && /x1/jenkins/tools/java/jdk1.6.0_32-32/jre/bin/java -enableassertions -Xmx1900m -Djava.security.egd=file:/dev/./urandom -jar /x1/jenkins/jenkins-slave/workspace/HBase-0.94-security/trunk/target/surefire/surefirebooter386163076332958831.jar /x1/jenkins/jenkins-slave/workspace/HBase-0.94-security/trunk/target/surefire/surefire6414505590882066083tmp /x1/jenkins/jenkins-slave/workspace/HBase-0.94-security/trunk/target/surefire/surefire_993124473879768472289tmp
Running org.apache.hadoop.hbase.io.hfile.TestCacheOnWrite
Tests run: 36, Failures: 0, Errors: 0, Skipped: 0, Time elapsed: 24.969 sec
Forking command line: /bin/sh -c cd /x1/jenkins/jenkins-slave/workspace/HBase-0.94-security/trunk && /x1/jenkins/tools/java/jdk1.6.0_32-32/jre/bin/java -enableassertions -Xmx1900m -Djava.security.egd=file:/dev/./urandom -jar /x1/jenkins/jenkins-slave/workspace/HBase-0.94-security/trunk/target/surefire/surefirebooter7269948563608507179.jar /x1/jenkins/jenkins-slave/workspace/HBase-0.94-security/trunk/target/surefire/surefire3706771735882353865tmp /x1/jenkins/jenkins-slave/workspace/HBase-0.94-security/trunk/target/surefire/surefire_1008410734734441178765tmp
Running org.apache.hadoop.hbase.io.hfile.TestForceCacheImportantBlocks
Tests run: 4, Failures: 0, Errors: 0, Skipped: 0, Time elapsed: 35.313 sec
Forking command line: /bin/sh -c cd /x1/jenkins/jenkins-slave/workspace/HBase-0.94-security/trunk && /x1/jenkins/tools/java/jdk1.6.0_32-32/jre/bin/java -enableassertions -Xmx1900m -Djava.security.egd=file:/dev/./urandom -jar /x1/jenkins/jenkins-slave/workspace/HBase-0.94-security/trunk/target/surefire/surefirebooter3610044218903709002.jar /x1/jenkins/jenkins-slave/workspace/HBase-0.94-security/trunk/target/surefire/surefire8908999638969243962tmp /x1/jenkins/jenkins-slave/workspace/HBase-0.94-security/trunk/target/surefire/surefire_1017367066265326571418tmp
Running org.apache.hadoop.hbase.io.hfile.TestChecksum
Tests run: 3, Failures: 0, Errors: 0, Skipped: 0, Time elapsed: 0.788 sec
Forking command line: /bin/sh -c cd /x1/jenkins/jenkins-slave/workspace/HBase-0.94-security/trunk && /x1/jenkins/tools/java/jdk1.6.0_32-32/jre/bin/java -enableassertions -Xmx1900m -Djava.security.egd=file:/dev/./urandom -jar /x1/jenkins/jenkins-slave/workspace/HBase-0.94-security/trunk/target/surefire/surefirebooter6177665063884159771.jar /x1/jenkins/jenkins-slave/workspace/HBase-0.94-security/trunk/target/surefire/surefire3171576716158671069tmp /x1/jenkins/jenkins-slave/workspace/HBase-0.94-security/trunk/target/surefire/surefire_1025761074591633102433tmp
Running org.apache.hadoop.hbase.io.hfile.slab.TestSlabCache
Tests run: 7, Failures: 0, Errors: 0, Skipped: 0, Time elapsed: 10.397 sec
Forking command line: /bin/sh -c cd /x1/jenkins/jenkins-slave/workspace/HBase-0.94-security/trunk && /x1/jenkins/tools/java/jdk1.6.0_32-32/jre/bin/java -enableassertions -Xmx1900m -Djava.security.egd=file:/dev/./urandom -jar /x1/jenkins/jenkins-slave/workspace/HBase-0.94-security/trunk/target/surefire/surefirebooter3765409342857906533.jar /x1/jenkins/jenkins-slave/workspace/HBase-0.94-security/trunk/target/surefire/surefire8064337949947083461tmp /x1/jenkins/jenkins-slave/workspace/HBase-0.94-security/trunk/target/surefire/surefire_1035074560238160882935tmp
Running org.apache.hadoop.hbase.io.hfile.slab.TestSingleSizeCache
Tests run: 5, Failures: 0, Errors: 0, Skipped: 0, Time elapsed: 15.794 sec
Forking command line: /bin/sh -c cd /x1/jenkins/jenkins-slave/workspace/HBase-0.94-security/trunk && /x1/jenkins/tools/java/jdk1.6.0_32-32/jre/bin/java -enableassertions -Xmx1900m -Djava.security.egd=file:/dev/./urandom -jar /x1/jenkins/jenkins-slave/workspace/HBase-0.94-security/trunk/target/surefire/surefirebooter7500338012380238784.jar /x1/jenkins/jenkins-slave/workspace/HBase-0.94-security/trunk/target/surefire/surefire4473296334727171948tmp /x1/jenkins/jenkins-slave/workspace/HBase-0.94-security/trunk/target/surefire/surefire_1041556579733343163491tmp
Running org.apache.hadoop.hbase.io.hfile.TestHFileBlock
Tests run: 16, Failures: 0, Errors: 0, Skipped: 0, Time elapsed: 46.539 sec
Forking command line: /bin/sh -c cd /x1/jenkins/jenkins-slave/workspace/HBase-0.94-security/trunk && /x1/jenkins/tools/java/jdk1.6.0_32-32/jre/bin/java -enableassertions -Xmx1900m -Djava.security.egd=file:/dev/./urandom -jar /x1/jenkins/jenkins-slave/workspace/HBase-0.94-security/trunk/target/surefire/surefirebooter540222004367764000.jar /x1/jenkins/jenkins-slave/workspace/HBase-0.94-security/trunk/target/surefire/surefire319197767700667736tmp /x1/jenkins/jenkins-slave/workspace/HBase-0.94-security/trunk/target/surefire/surefire_105728156163114125846tmp
Running org.apache.hadoop.hbase.replication.TestReplicationZookeeper
Tests run: 1, Failures: 0, Errors: 0, Skipped: 0, Time elapsed: 0.567 sec
Forking command line: /bin/sh -c cd /x1/jenkins/jenkins-slave/workspace/HBase-0.94-security/trunk && /x1/jenkins/tools/java/jdk1.6.0_32-32/jre/bin/java -enableassertions -Xmx1900m -Djava.security.egd=file:/dev/./urandom -jar /x1/jenkins/jenkins-slave/workspace/HBase-0.94-security/trunk/target/surefire/surefirebooter7595655000096154938.jar /x1/jenkins/jenkins-slave/workspace/HBase-0.94-security/trunk/target/surefire/surefire5009709287252483572tmp /x1/jenkins/jenkins-slave/workspace/HBase-0.94-security/trunk/target/surefire/surefire_1065565129266501088014tmp
Running org.apache.hadoop.hbase.io.encoding.TestLoadAndSwitchEncodeOnDisk
Tests run: 1, Failures: 0, Errors: 0, Skipped: 0, Time elapsed: 23.249 sec
Forking command line: /bin/sh -c cd /x1/jenkins/jenkins-slave/workspace/HBase-0.94-security/trunk && /x1/jenkins/tools/java/jdk1.6.0_32-32/jre/bin/java -enableassertions -Xmx1900m -Djava.security.egd=file:/dev/./urandom -jar /x1/jenkins/jenkins-slave/workspace/HBase-0.94-security/trunk/target/surefire/surefirebooter8152700799083059565.jar /x1/jenkins/jenkins-slave/workspace/HBase-0.94-security/trunk/target/surefire/surefire6982498726766385338tmp /x1/jenkins/jenkins-slave/workspace/HBase-0.94-security/trunk/target/surefire/surefire_107829520530742397607tmp
Running org.apache.hadoop.hbase.replication.regionserver.TestReplicationSourceManager
Tests run: 1, Failures: 0, Errors: 0, Skipped: 0, Time elapsed: 0.993 sec
Forking command line: /bin/sh -c cd /x1/jenkins/jenkins-slave/workspace/HBase-0.94-security/trunk && /x1/jenkins/tools/java/jdk1.6.0_32-32/jre/bin/java -enableassertions -Xmx1900m -Djava.security.egd=file:/dev/./urandom -jar /x1/jenkins/jenkins-slave/workspace/HBase-0.94-security/trunk/target/surefire/surefirebooter6172281494694262622.jar /x1/jenkins/jenkins-slave/workspace/HBase-0.94-security/trunk/target/surefire/surefire1374198191692063048tmp /x1/jenkins/jenkins-slave/workspace/HBase-0.94-security/trunk/target/surefire/surefire_1087160394869138690698tmp
Running org.apache.hadoop.hbase.replication.TestReplicationSource
Tests run: 1, Failures: 0, Errors: 0, Skipped: 0, Time elapsed: 2.329 sec
Forking command line: /bin/sh -c cd /x1/jenkins/jenkins-slave/workspace/HBase-0.94-security/trunk && /x1/jenkins/tools/java/jdk1.6.0_32-32/jre/bin/java -enableassertions -Xmx1900m -Djava.security.egd=file:/dev/./urandom -jar /x1/jenkins/jenkins-slave/workspace/HBase-0.94-security/trunk/target/surefire/surefirebooter6688879085949847754.jar /x1/jenkins/jenkins-slave/workspace/HBase-0.94-security/trunk/target/surefire/surefire5594013287484376436tmp /x1/jenkins/jenkins-slave/workspace/HBase-0.94-security/trunk/target/surefire/surefire_1092288678093929175054tmp
Running org.apache.hadoop.hbase.replication.regionserver.TestReplicationSink
Tests run: 5, Failures: 0, Errors: 0, Skipped: 0, Time elapsed: 14.007 sec
Forking command line: /bin/sh -c cd /x1/jenkins/jenkins-slave/workspace/HBase-0.94-security/trunk && /x1/jenkins/tools/java/jdk1.6.0_32-32/jre/bin/java -enableassertions -Xmx1900m -Djava.security.egd=file:/dev/./urandom -jar /x1/jenkins/jenkins-slave/workspace/HBase-0.94-security/trunk/target/surefire/surefirebooter7244570946515790830.jar /x1/jenkins/jenkins-slave/workspace/HBase-0.94-security/trunk/target/surefire/surefire440961880102237720tmp /x1/jenkins/jenkins-slave/workspace/HBase-0.94-security/trunk/target/surefire/surefire_1101143567039050179614tmp
Running org.apache.hadoop.hbase.replication.TestReplicationPeer
Tests run: 1, Failures: 0, Errors: 0, Skipped: 0, Time elapsed: 7.564 sec
Running org.apache.hadoop.hbase.util.TestFSTableDescriptors
Tests run: 10, Failures: 0, Errors: 0, Skipped: 0, Time elapsed: 0.872 sec
Forking command line: /bin/sh -c cd /x1/jenkins/jenkins-slave/workspace/HBase-0.94-security/trunk && /x1/jenkins/tools/java/jdk1.6.0_32-32/jre/bin/java -enableassertions -Xmx1900m -Djava.security.egd=file:/dev/./urandom -jar /x1/jenkins/jenkins-slave/workspace/HBase-0.94-security/trunk/target/surefire/surefirebooter6464361271032556313.jar /x1/jenkins/jenkins-slave/workspace/HBase-0.94-security/trunk/target/surefire/surefire1026605853464318930tmp /x1/jenkins/jenkins-slave/workspace/HBase-0.94-security/trunk/target/surefire/surefire_1115017173136236417688tmp
Forking command line: /bin/sh -c cd /x1/jenkins/jenkins-slave/workspace/HBase-0.94-security/trunk && /x1/jenkins/tools/java/jdk1.6.0_32-32/jre/bin/java -enableassertions -Xmx1900m -Djava.security.egd=file:/dev/./urandom -jar /x1/jenkins/jenkins-slave/workspace/HBase-0.94-security/trunk/target/surefire/surefirebooter1193281549851333661.jar /x1/jenkins/jenkins-slave/workspace/HBase-0.94-security/trunk/target/surefire/surefire6852778178442289149tmp /x1/jenkins/jenkins-slave/workspace/HBase-0.94-security/trunk/target/surefire/surefire_1126511662078682484810tmp
Running org.apache.hadoop.hbase.util.TestEnvironmentEdgeManager
Tests run: 2, Failures: 0, Errors: 0, Skipped: 0, Time elapsed: 0.342 sec
Forking command line: /bin/sh -c cd /x1/jenkins/jenkins-slave/workspace/HBase-0.94-security/trunk && /x1/jenkins/tools/java/jdk1.6.0_32-32/jre/bin/java -enableassertions -Xmx1900m -Djava.security.egd=file:/dev/./urandom -jar /x1/jenkins/jenkins-slave/workspace/HBase-0.94-security/trunk/target/surefire/surefirebooter3604953861981106070.jar /x1/jenkins/jenkins-slave/workspace/HBase-0.94-security/trunk/target/surefire/surefire9209523692150185856tmp /x1/jenkins/jenkins-slave/workspace/HBase-0.94-security/trunk/target/surefire/surefire_1131989470383561353865tmp
Running org.apache.hadoop.hbase.util.TestIdLock
Tests run: 1, Failures: 0, Errors: 0, Skipped: 0, Time elapsed: 15.293 sec
Forking command line: /bin/sh -c cd /x1/jenkins/jenkins-slave/workspace/HBase-0.94-security/trunk && /x1/jenkins/tools/java/jdk1.6.0_32-32/jre/bin/java -enableassertions -Xmx1900m -Djava.security.egd=file:/dev/./urandom -jar /x1/jenkins/jenkins-slave/workspace/HBase-0.94-security/trunk/target/surefire/surefirebooter7004363895677720006.jar /x1/jenkins/jenkins-slave/workspace/HBase-0.94-security/trunk/target/surefire/surefire1369298528222431176tmp /x1/jenkins/jenkins-slave/workspace/HBase-0.94-security/trunk/target/surefire/surefire_114406655396435705834tmp
Running org.apache.hadoop.hbase.util.TestMergeTable
Tests run: 1, Failures: 0, Errors: 0, Skipped: 0, Time elapsed: 25.693 sec
Forking command line: /bin/sh -c cd /x1/jenkins/jenkins-slave/workspace/HBase-0.94-security/trunk && /x1/jenkins/tools/java/jdk1.6.0_32-32/jre/bin/java -enableassertions -Xmx1900m -Djava.security.egd=file:/dev/./urandom -jar /x1/jenkins/jenkins-slave/workspace/HBase-0.94-security/trunk/target/surefire/surefirebooter2954109482283983297.jar /x1/jenkins/jenkins-slave/workspace/HBase-0.94-security/trunk/target/surefire/surefire6498742554750021926tmp /x1/jenkins/jenkins-slave/workspace/HBase-0.94-security/trunk/target/surefire/surefire_1153538382844546117225tmp
Running org.apache.hadoop.hbase.util.TestFSUtils
Tests run: 4, Failures: 0, Errors: 0, Skipped: 0, Time elapsed: 19.45 sec
Forking command line: /bin/sh -c cd /x1/jenkins/jenkins-slave/workspace/HBase-0.94-security/trunk && /x1/jenkins/tools/java/jdk1.6.0_32-32/jre/bin/java -enableassertions -Xmx1900m -Djava.security.egd=file:/dev/./urandom -jar /x1/jenkins/jenkins-slave/workspace/HBase-0.94-security/trunk/target/surefire/surefirebooter7378669806836443152.jar /x1/jenkins/jenkins-slave/workspace/HBase-0.94-security/trunk/target/surefire/surefire8888612997909979003tmp /x1/jenkins/jenkins-slave/workspace/HBase-0.94-security/trunk/target/surefire/surefire_1161034154697194172644tmp
Running org.apache.hadoop.hbase.util.TestPoolMap$TestRoundRobinPoolType
Tests run: 3, Failures: 0, Errors: 0, Skipped: 0, Time elapsed: 0.005 sec
Running org.apache.hadoop.hbase.util.TestPoolMap$TestThreadLocalPoolType
Tests run: 3, Failures: 0, Errors: 0, Skipped: 0, Time elapsed: 0.004 sec
Running org.apache.hadoop.hbase.util.TestPoolMap$TestReusablePoolType
Tests run: 3, Failures: 0, Errors: 0, Skipped: 0, Time elapsed: 0.022 sec
Forking command line: /bin/sh -c cd /x1/jenkins/jenkins-slave/workspace/HBase-0.94-security/trunk && /x1/jenkins/tools/java/jdk1.6.0_32-32/jre/bin/java -enableassertions -Xmx1900m -Djava.security.egd=file:/dev/./urandom -jar /x1/jenkins/jenkins-slave/workspace/HBase-0.94-security/trunk/target/surefire/surefirebooter1986668997827254409.jar /x1/jenkins/jenkins-slave/workspace/HBase-0.94-security/trunk/target/surefire/surefire4369849653007703139tmp /x1/jenkins/jenkins-slave/workspace/HBase-0.94-security/trunk/target/surefire/surefire_117119671016603204029tmp
Running org.apache.hadoop.hbase.util.TestRegionSplitter
Tests run: 5, Failures: 0, Errors: 0, Skipped: 0, Time elapsed: 32.805 sec
Forking command line: /bin/sh -c cd /x1/jenkins/jenkins-slave/workspace/HBase-0.94-security/trunk && /x1/jenkins/tools/java/jdk1.6.0_32-32/jre/bin/java -enableassertions -Xmx1900m -Djava.security.egd=file:/dev/./urandom -jar /x1/jenkins/jenkins-slave/workspace/HBase-0.94-security/trunk/target/surefire/surefirebooter694084988642220994.jar /x1/jenkins/jenkins-slave/workspace/HBase-0.94-security/trunk/target/surefire/surefire5547015699191285421tmp /x1/jenkins/jenkins-slave/workspace/HBase-0.94-security/trunk/target/surefire/surefire_1184471434223827225953tmp
Running org.apache.hadoop.hbase.util.hbck.TestOfflineMetaRebuildBase
Tests run: 1, Failures: 0, Errors: 0, Skipped: 0, Time elapsed: 19.938 sec
Forking command line: /bin/sh -c cd /x1/jenkins/jenkins-slave/workspace/HBase-0.94-security/trunk && /x1/jenkins/tools/java/jdk1.6.0_32-32/jre/bin/java -enableassertions -Xmx1900m -Djava.security.egd=file:/dev/./urandom -jar /x1/jenkins/jenkins-slave/workspace/HBase-0.94-security/trunk/target/surefire/surefirebooter3283897154849163337.jar /x1/jenkins/jenkins-slave/workspace/HBase-0.94-security/trunk/target/surefire/surefire6774729688815022934tmp /x1/jenkins/jenkins-slave/workspace/HBase-0.94-security/trunk/target/surefire/surefire_1195479259808052721888tmp
Running org.apache.hadoop.hbase.util.hbck.TestOfflineMetaRebuildOverlap
Tests run: 1, Failures: 0, Errors: 0, Skipped: 0, Time elapsed: 16.393 sec
Forking command line: /bin/sh -c cd /x1/jenkins/jenkins-slave/workspace/HBase-0.94-security/trunk && /x1/jenkins/tools/java/jdk1.6.0_32-32/jre/bin/java -enableassertions -Xmx1900m -Djava.security.egd=file:/dev/./urandom -jar /x1/jenkins/jenkins-slave/workspace/HBase-0.94-security/trunk/target/surefire/surefirebooter176266252836693537.jar /x1/jenkins/jenkins-slave/workspace/HBase-0.94-security/trunk/target/surefire/surefire9144278082317496405tmp /x1/jenkins/jenkins-slave/workspace/HBase-0.94-security/trunk/target/surefire/surefire_1205009146283639567881tmp
Running org.apache.hadoop.hbase.util.hbck.TestOfflineMetaRebuildHole
Tests run: 1, Failures: 0, Errors: 0, Skipped: 0, Time elapsed: 17.407 sec
Forking command line: /bin/sh -c cd /x1/jenkins/jenkins-slave/workspace/HBase-0.94-security/trunk && /x1/jenkins/tools/java/jdk1.6.0_32-32/jre/bin/java -enableassertions -Xmx1900m -Djava.security.egd=file:/dev/./urandom -jar /x1/jenkins/jenkins-slave/workspace/HBase-0.94-security/trunk/target/surefire/surefirebooter2249677821358653006.jar /x1/jenkins/jenkins-slave/workspace/HBase-0.94-security/trunk/target/surefire/surefire3491940519158636103tmp /x1/jenkins/jenkins-slave/workspace/HBase-0.94-security/trunk/target/surefire/surefire_1219008900060998155290tmp
Running org.apache.hadoop.hbase.util.TestDefaultEnvironmentEdge
Tests run: 1, Failures: 0, Errors: 0, Skipped: 0, Time elapsed: 0.164 sec
Forking command line: /bin/sh -c cd /x1/jenkins/jenkins-slave/workspace/HBase-0.94-security/trunk && /x1/jenkins/tools/java/jdk1.6.0_32-32/jre/bin/java -enableassertions -Xmx1900m -Djava.security.egd=file:/dev/./urandom -jar /x1/jenkins/jenkins-slave/workspace/HBase-0.94-security/trunk/target/surefire/surefirebooter4444684315411245342.jar /x1/jenkins/jenkins-slave/workspace/HBase-0.94-security/trunk/target/surefire/surefire9122926416020415185tmp /x1/jenkins/jenkins-slave/workspace/HBase-0.94-security/trunk/target/surefire/surefire_1223403901564903502542tmp
Running org.apache.hadoop.hbase.TestInfoServers
Tests run: 2, Failures: 0, Errors: 0, Skipped: 0, Time elapsed: 11.52 sec
Running org.apache.hadoop.hbase.util.TestHBaseFsck
Tests run: 17, Failures: 0, Errors: 0, Skipped: 0, Time elapsed: 143.168 sec

Results :

Tests in error: 
  testLocalHBaseCluster(org.apache.hadoop.hbase.TestLocalHBaseCluster): Master not initialized after 200 seconds

Tests run: 632, Failures: 0, Errors: 1, Skipped: 2

[INFO] ------------------------------------------------------------------------
[INFO] BUILD FAILURE
[INFO] ------------------------------------------------------------------------
[INFO] Total time: 26:03.966s
[INFO] Finished at: Wed May 23 04:11:07 UTC 2012
[INFO] Final Memory: 52M/984M
[INFO] ------------------------------------------------------------------------
[ERROR] Failed to execute goal org.apache.maven.plugins:maven-surefire-plugin:2.12-TRUNK-HBASE-2:test (secondPartTestsExecution) on project hbase: There are test failures.
[ERROR] 
[ERROR] Please refer to /x1/jenkins/jenkins-slave/workspace/HBase-0.94-security/trunk/target/surefire-reports for the individual test results.
[ERROR] -> [Help 1]
org.apache.maven.lifecycle.LifecycleExecutionException: Failed to execute goal org.apache.maven.plugins:maven-surefire-plugin:2.12-TRUNK-HBASE-2:test (secondPartTestsExecution) on project hbase: There are test failures.

Please refer to /x1/jenkins/jenkins-slave/workspace/HBase-0.94-security/trunk/target/surefire-reports for the individual test results.
	at org.apache.maven.lifecycle.internal.MojoExecutor.execute(MojoExecutor.java:213)
	at org.apache.maven.lifecycle.internal.MojoExecutor.execute(MojoExecutor.java:153)
	at org.apache.maven.lifecycle.internal.MojoExecutor.execute(MojoExecutor.java:145)
	at org.apache.maven.lifecycle.internal.MojoExecutor.executeForkedExecutions(MojoExecutor.java:365)
	at org.apache.maven.lifecycle.internal.MojoExecutor.execute(MojoExecutor.java:199)
	at org.apache.maven.lifecycle.internal.MojoExecutor.execute(MojoExecutor.java:153)
	at org.apache.maven.lifecycle.internal.MojoExecutor.execute(MojoExecutor.java:145)
	at org.apache.maven.lifecycle.internal.LifecycleModuleBuilder.buildProject(LifecycleModuleBuilder.java:84)
	at org.apache.maven.lifecycle.internal.LifecycleModuleBuilder.buildProject(LifecycleModuleBuilder.java:59)
	at org.apache.maven.lifecycle.internal.LifecycleStarter.singleThreadedBuild(LifecycleStarter.java:183)
	at org.apache.maven.lifecycle.internal.LifecycleStarter.execute(LifecycleStarter.java:161)
	at org.apache.maven.DefaultMaven.doExecute(DefaultMaven.java:319)
	at org.apache.maven.DefaultMaven.execute(DefaultMaven.java:156)
	at org.apache.maven.cli.MavenCli.execute(MavenCli.java:537)
	at org.apache.maven.cli.MavenCli.doMain(MavenCli.java:196)
	at org.apache.maven.cli.MavenCli.main(MavenCli.java:141)
	at sun.reflect.NativeMethodAccessorImpl.invoke0(Native Method)
	at sun.reflect.NativeMethodAccessorImpl.invoke(NativeMethodAccessorImpl.java:39)
	at sun.reflect.DelegatingMethodAccessorImpl.invoke(DelegatingMethodAccessorImpl.java:25)
	at java.lang.reflect.Method.invoke(Method.java:597)
	at org.codehaus.plexus.classworlds.launcher.Launcher.launchEnhanced(Launcher.java:290)
	at org.codehaus.plexus.classworlds.launcher.Launcher.launch(Launcher.java:230)
	at org.codehaus.plexus.classworlds.launcher.Launcher.mainWithExitCode(Launcher.java:409)
	at org.codehaus.plexus.classworlds.launcher.Launcher.main(Launcher.java:352)
Caused by: org.apache.maven.plugin.MojoFailureException: There are test failures.

Please refer to /x1/jenkins/jenkins-slave/workspace/HBase-0.94-security/trunk/target/surefire-reports for the individual test results.
	at org.apache.maven.plugin.surefire.SurefireHelper.reportExecution(SurefireHelper.java:87)
	at org.apache.maven.plugin.surefire.SurefirePlugin.writeSummary(SurefirePlugin.java:651)
	at org.apache.maven.plugin.surefire.SurefirePlugin.handleSummary(SurefirePlugin.java:625)
	at org.apache.maven.plugin.surefire.AbstractSurefireMojo.executeAfterPreconditionsChecked(AbstractSurefireMojo.java:137)
	at org.apache.maven.plugin.surefire.AbstractSurefireMojo.execute(AbstractSurefireMojo.java:98)
	at org.apache.maven.plugin.DefaultBuildPluginManager.executeMojo(DefaultBuildPluginManager.java:101)
	at org.apache.maven.lifecycle.internal.MojoExecutor.execute(MojoExecutor.java:209)
	... 23 more
[ERROR] 
[ERROR] 
[ERROR] For more information about the errors and possible solutions, please read the following articles:
[ERROR] [Help 1] http://cwiki.apache.org/confluence/display/MAVEN/MojoFailureException
Build step 'Invoke top-level Maven targets' marked build as failure
Archiving artifacts
Updating HBASE-6047
Recording test results