You are viewing a plain text version of this content. The canonical link for it is here.
Posted to commits@jspwiki.apache.org by Apache Jenkins Server <je...@builds.apache.org> on 2014/04/21 00:08:50 UTC
Build failed in Jenkins: JSPWiki #291
See <https://builds.apache.org/job/JSPWiki/291/changes>
Changes:
[juanpablo] Upgraded selenium-*-drivers to 2.41.0
[juanpablo] * 2.10.1-svn-14
* Fixed JSPWIKI-832 - [Portable] Problems setting up multiple wikis using a shared JSPWiki libraries
(patch by Siegfried Goeschl - thanks!)
------------------------------------------
[...truncated 1871 lines...]
at org.apache.wiki.util.ClassUtil.getMappedObject(ClassUtil.java:359)
at org.apache.wiki.WikiEngine.initialize(WikiEngine.java:563)
at org.apache.wiki.WikiEngine.<init>(WikiEngine.java:430)
at org.apache.wiki.TestEngine.<init>(TestEngine.java:127)
at org.apache.wiki.providers.FileSystemProviderTest.setUp(FileSystemProviderTest.java:60)
testScandinavianLettersUTF8(org.apache.wiki.providers.FileSystemProviderTest) Time elapsed: 0 sec <<< ERROR!
org.apache.wiki.api.exceptions.WikiException: JSPWiki: Unable to load and setup properties from jspwiki.properties. Failed to start; please check log files for better information.
at org.apache.wiki.providers.AbstractFileProvider.initialize(AbstractFileProvider.java:110)
at org.apache.wiki.providers.CachingProvider.initialize(CachingProvider.java:146)
at org.apache.wiki.PageManager.<init>(PageManager.java:190)
at sun.reflect.GeneratedConstructorAccessor12.newInstance(Unknown Source)
at sun.reflect.DelegatingConstructorAccessorImpl.newInstance(DelegatingConstructorAccessorImpl.java:27)
at java.lang.reflect.Constructor.newInstance(Constructor.java:513)
at org.apache.wiki.util.ClassUtil.getMappedObject(ClassUtil.java:359)
at org.apache.wiki.WikiEngine.initialize(WikiEngine.java:563)
at org.apache.wiki.WikiEngine.<init>(WikiEngine.java:430)
at org.apache.wiki.TestEngine.<init>(TestEngine.java:127)
at org.apache.wiki.providers.FileSystemProviderTest.setUp(FileSystemProviderTest.java:60)
testSlashesInPageNamesUTF8(org.apache.wiki.providers.FileSystemProviderTest) Time elapsed: 0 sec <<< ERROR!
org.apache.wiki.api.exceptions.WikiException: JSPWiki: Unable to load and setup properties from jspwiki.properties. Failed to start; please check log files for better information.
at org.apache.wiki.providers.AbstractFileProvider.initialize(AbstractFileProvider.java:110)
at org.apache.wiki.providers.CachingProvider.initialize(CachingProvider.java:146)
at org.apache.wiki.PageManager.<init>(PageManager.java:190)
at sun.reflect.GeneratedConstructorAccessor12.newInstance(Unknown Source)
at sun.reflect.DelegatingConstructorAccessorImpl.newInstance(DelegatingConstructorAccessorImpl.java:27)
at java.lang.reflect.Constructor.newInstance(Constructor.java:513)
at org.apache.wiki.util.ClassUtil.getMappedObject(ClassUtil.java:359)
at org.apache.wiki.WikiEngine.initialize(WikiEngine.java:563)
at org.apache.wiki.WikiEngine.<init>(WikiEngine.java:430)
at org.apache.wiki.TestEngine.<init>(TestEngine.java:127)
at org.apache.wiki.providers.FileSystemProviderTest.setUp(FileSystemProviderTest.java:60)
testDotsInBeginning(org.apache.wiki.providers.FileSystemProviderTest) Time elapsed: 0 sec <<< ERROR!
org.apache.wiki.api.exceptions.WikiException: JSPWiki: Unable to load and setup properties from jspwiki.properties. Failed to start; please check log files for better information.
at org.apache.wiki.providers.AbstractFileProvider.initialize(AbstractFileProvider.java:110)
at org.apache.wiki.providers.CachingProvider.initialize(CachingProvider.java:146)
at org.apache.wiki.PageManager.<init>(PageManager.java:190)
at sun.reflect.GeneratedConstructorAccessor12.newInstance(Unknown Source)
at sun.reflect.DelegatingConstructorAccessorImpl.newInstance(DelegatingConstructorAccessorImpl.java:27)
at java.lang.reflect.Constructor.newInstance(Constructor.java:513)
at org.apache.wiki.util.ClassUtil.getMappedObject(ClassUtil.java:359)
at org.apache.wiki.WikiEngine.initialize(WikiEngine.java:563)
at org.apache.wiki.WikiEngine.<init>(WikiEngine.java:430)
at org.apache.wiki.TestEngine.<init>(TestEngine.java:127)
at org.apache.wiki.providers.FileSystemProviderTest.setUp(FileSystemProviderTest.java:60)
testSlashesInPageNames(org.apache.wiki.providers.FileSystemProviderTest) Time elapsed: 0.004 sec <<< ERROR!
org.apache.wiki.api.exceptions.WikiException: JSPWiki: Unable to load and setup properties from jspwiki.properties. Failed to start; please check log files for better information.
at org.apache.wiki.providers.AbstractFileProvider.initialize(AbstractFileProvider.java:110)
at org.apache.wiki.providers.CachingProvider.initialize(CachingProvider.java:146)
at org.apache.wiki.PageManager.<init>(PageManager.java:190)
at sun.reflect.GeneratedConstructorAccessor12.newInstance(Unknown Source)
at sun.reflect.DelegatingConstructorAccessorImpl.newInstance(DelegatingConstructorAccessorImpl.java:27)
at java.lang.reflect.Constructor.newInstance(Constructor.java:513)
at org.apache.wiki.util.ClassUtil.getMappedObject(ClassUtil.java:359)
at org.apache.wiki.WikiEngine.initialize(WikiEngine.java:563)
at org.apache.wiki.WikiEngine.<init>(WikiEngine.java:430)
at org.apache.wiki.TestEngine.<init>(TestEngine.java:127)
at org.apache.wiki.providers.FileSystemProviderTest.setUp(FileSystemProviderTest.java:60)
testAuthor(org.apache.wiki.providers.FileSystemProviderTest) Time elapsed: 0.004 sec <<< ERROR!
org.apache.wiki.api.exceptions.WikiException: JSPWiki: Unable to load and setup properties from jspwiki.properties. Failed to start; please check log files for better information.
at org.apache.wiki.providers.AbstractFileProvider.initialize(AbstractFileProvider.java:110)
at org.apache.wiki.providers.CachingProvider.initialize(CachingProvider.java:146)
at org.apache.wiki.PageManager.<init>(PageManager.java:190)
at sun.reflect.GeneratedConstructorAccessor12.newInstance(Unknown Source)
at sun.reflect.DelegatingConstructorAccessorImpl.newInstance(DelegatingConstructorAccessorImpl.java:27)
at java.lang.reflect.Constructor.newInstance(Constructor.java:513)
at org.apache.wiki.util.ClassUtil.getMappedObject(ClassUtil.java:359)
at org.apache.wiki.WikiEngine.initialize(WikiEngine.java:563)
at org.apache.wiki.WikiEngine.<init>(WikiEngine.java:430)
at org.apache.wiki.TestEngine.<init>(TestEngine.java:127)
at org.apache.wiki.providers.FileSystemProviderTest.setUp(FileSystemProviderTest.java:60)
testDirectoryIsFile(org.apache.wiki.providers.FileSystemProviderTest) Time elapsed: 0 sec <<< ERROR!
org.apache.wiki.api.exceptions.WikiException: JSPWiki: Unable to load and setup properties from jspwiki.properties. Failed to start; please check log files for better information.
at org.apache.wiki.providers.AbstractFileProvider.initialize(AbstractFileProvider.java:110)
at org.apache.wiki.providers.CachingProvider.initialize(CachingProvider.java:146)
at org.apache.wiki.PageManager.<init>(PageManager.java:190)
at sun.reflect.GeneratedConstructorAccessor12.newInstance(Unknown Source)
at sun.reflect.DelegatingConstructorAccessorImpl.newInstance(DelegatingConstructorAccessorImpl.java:27)
at java.lang.reflect.Constructor.newInstance(Constructor.java:513)
at org.apache.wiki.util.ClassUtil.getMappedObject(ClassUtil.java:359)
at org.apache.wiki.WikiEngine.initialize(WikiEngine.java:563)
at org.apache.wiki.WikiEngine.<init>(WikiEngine.java:430)
at org.apache.wiki.TestEngine.<init>(TestEngine.java:127)
at org.apache.wiki.providers.FileSystemProviderTest.setUp(FileSystemProviderTest.java:60)
testDelete(org.apache.wiki.providers.FileSystemProviderTest) Time elapsed: 0.004 sec <<< ERROR!
org.apache.wiki.api.exceptions.WikiException: JSPWiki: Unable to load and setup properties from jspwiki.properties. Failed to start; please check log files for better information.
at org.apache.wiki.providers.AbstractFileProvider.initialize(AbstractFileProvider.java:110)
at org.apache.wiki.providers.CachingProvider.initialize(CachingProvider.java:146)
at org.apache.wiki.PageManager.<init>(PageManager.java:190)
at sun.reflect.GeneratedConstructorAccessor12.newInstance(Unknown Source)
at sun.reflect.DelegatingConstructorAccessorImpl.newInstance(DelegatingConstructorAccessorImpl.java:27)
at java.lang.reflect.Constructor.newInstance(Constructor.java:513)
at org.apache.wiki.util.ClassUtil.getMappedObject(ClassUtil.java:359)
at org.apache.wiki.WikiEngine.initialize(WikiEngine.java:563)
at org.apache.wiki.WikiEngine.<init>(WikiEngine.java:430)
at org.apache.wiki.TestEngine.<init>(TestEngine.java:127)
at org.apache.wiki.providers.FileSystemProviderTest.setUp(FileSystemProviderTest.java:60)
Running org.apache.wiki.ReferenceManagerTest
Tests run: 18, Failures: 0, Errors: 0, Skipped: 0, Time elapsed: 0.854 sec - in org.apache.wiki.ReferenceManagerTest
Running org.apache.wiki.content.PageRenamerTest
Tests run: 21, Failures: 0, Errors: 0, Skipped: 0, Time elapsed: 2.018 sec - in org.apache.wiki.content.PageRenamerTest
Running org.apache.wiki.i18n.InternationalizationManagerTest
Tests run: 2, Failures: 0, Errors: 0, Skipped: 0, Time elapsed: 0 sec - in org.apache.wiki.i18n.InternationalizationManagerTest
Running org.apache.wiki.plugin.GroupsTest
Tests run: 1, Failures: 0, Errors: 0, Skipped: 0, Time elapsed: 0.033 sec - in org.apache.wiki.plugin.GroupsTest
Running org.apache.wiki.plugin.ReferringPagesPluginTest
Tests run: 8, Failures: 0, Errors: 0, Skipped: 0, Time elapsed: 0.698 sec - in org.apache.wiki.plugin.ReferringPagesPluginTest
Running org.apache.wiki.plugin.DefaultPluginManagerTest
Tests run: 15, Failures: 0, Errors: 0, Skipped: 0, Time elapsed: 0.198 sec - in org.apache.wiki.plugin.DefaultPluginManagerTest
Running org.apache.wiki.plugin.IfPluginTest
Tests run: 4, Failures: 0, Errors: 0, Skipped: 0, Time elapsed: 0.109 sec - in org.apache.wiki.plugin.IfPluginTest
Running org.apache.wiki.plugin.CounterPluginTest
Tests run: 6, Failures: 0, Errors: 0, Skipped: 0, Time elapsed: 0.082 sec - in org.apache.wiki.plugin.CounterPluginTest
Running org.apache.wiki.plugin.ReferringUndefinedPagesPluginTest
Tests run: 4, Failures: 0, Errors: 0, Skipped: 0, Time elapsed: 0.18 sec - in org.apache.wiki.plugin.ReferringUndefinedPagesPluginTest
Running org.apache.wiki.plugin.InsertPageTest
Tests run: 6, Failures: 0, Errors: 0, Skipped: 0, Time elapsed: 0.141 sec - in org.apache.wiki.plugin.InsertPageTest
Running org.apache.wiki.plugin.PageViewPluginTest
Tests run: 4, Failures: 0, Errors: 0, Skipped: 0, Time elapsed: 0.211 sec - in org.apache.wiki.plugin.PageViewPluginTest
Running org.apache.wiki.plugin.RecentChangesPluginTest
Tests run: 3, Failures: 0, Errors: 0, Skipped: 0, Time elapsed: 0.119 sec - in org.apache.wiki.plugin.RecentChangesPluginTest
Running org.apache.wiki.plugin.TableOfContentsTest
Tests run: 8, Failures: 0, Errors: 0, Skipped: 0, Time elapsed: 0.222 sec - in org.apache.wiki.plugin.TableOfContentsTest
Running org.apache.wiki.plugin.UndefinedPagesPluginTest
Tests run: 2, Failures: 0, Errors: 0, Skipped: 0, Time elapsed: 0.063 sec - in org.apache.wiki.plugin.UndefinedPagesPluginTest
Running org.apache.wiki.ReleaseTest
Tests run: 17, Failures: 0, Errors: 0, Skipped: 0, Time elapsed: 0.003 sec - in org.apache.wiki.ReleaseTest
Running org.apache.wiki.render.WysiwygEditingRendererTest
Tests run: 2, Failures: 0, Errors: 0, Skipped: 0, Time elapsed: 0.051 sec - in org.apache.wiki.render.WysiwygEditingRendererTest
Running org.apache.wiki.render.RenderingManagerTest
Tests run: 1, Failures: 0, Errors: 0, Skipped: 0, Time elapsed: 0.62 sec - in org.apache.wiki.render.RenderingManagerTest
Running org.apache.wiki.render.CreoleRendererTest
Tests run: 14, Failures: 0, Errors: 0, Skipped: 0, Time elapsed: 0.179 sec - in org.apache.wiki.render.CreoleRendererTest
Running org.apache.wiki.PropertyReaderTest
Tests run: 3, Failures: 0, Errors: 0, Skipped: 0, Time elapsed: 0 sec - in org.apache.wiki.PropertyReaderTest
Running org.apache.wiki.attachment.AttachmentManagerTest
Tests run: 14, Failures: 0, Errors: 0, Skipped: 0, Time elapsed: 0.698 sec - in org.apache.wiki.attachment.AttachmentManagerTest
Running org.apache.wiki.WikiEngineTest
MockServletContext: JSPWiki: Unable to load and setup properties from jspwiki.properties. Failed to start; please check log files for better information.
Tests run: 40, Failures: 0, Errors: 1, Skipped: 0, Time elapsed: 2.883 sec <<< FAILURE! - in org.apache.wiki.WikiEngineTest
testNonExistentDirectory(org.apache.wiki.WikiEngineTest) Time elapsed: 0.013 sec <<< ERROR!
org.apache.wiki.api.exceptions.WikiException: JSPWiki: Unable to load and setup properties from jspwiki.properties. Failed to start; please check log files for better information.
at org.apache.wiki.providers.AbstractFileProvider.initialize(AbstractFileProvider.java:110)
at org.apache.wiki.providers.CachingProvider.initialize(CachingProvider.java:146)
at org.apache.wiki.PageManager.<init>(PageManager.java:190)
at sun.reflect.GeneratedConstructorAccessor12.newInstance(Unknown Source)
at sun.reflect.DelegatingConstructorAccessorImpl.newInstance(DelegatingConstructorAccessorImpl.java:27)
at java.lang.reflect.Constructor.newInstance(Constructor.java:513)
at org.apache.wiki.util.ClassUtil.getMappedObject(ClassUtil.java:359)
at org.apache.wiki.WikiEngine.initialize(WikiEngine.java:563)
at org.apache.wiki.WikiEngine.<init>(WikiEngine.java:430)
at org.apache.wiki.TestEngine.<init>(TestEngine.java:127)
at org.apache.wiki.WikiEngineTest.testNonExistentDirectory(WikiEngineTest.java:98)
Running org.apache.wiki.util.TextUtilTest
Tests run: 40, Failures: 0, Errors: 0, Skipped: 0, Time elapsed: 0.04 sec - in org.apache.wiki.util.TextUtilTest
Running org.apache.wiki.util.TimedCounterListTest
Tests run: 2, Failures: 0, Errors: 0, Skipped: 0, Time elapsed: 0.11 sec - in org.apache.wiki.util.TimedCounterListTest
Running org.apache.wiki.util.FileUtilTest
Tests run: 5, Failures: 0, Errors: 0, Skipped: 0, Time elapsed: 0.016 sec - in org.apache.wiki.util.FileUtilTest
Running org.apache.wiki.util.CryptoUtilTest
Tests run: 8, Failures: 0, Errors: 0, Skipped: 0, Time elapsed: 0.006 sec - in org.apache.wiki.util.CryptoUtilTest
Running org.apache.wiki.util.SerializerTest
Tests run: 1, Failures: 0, Errors: 0, Skipped: 0, Time elapsed: 0.001 sec - in org.apache.wiki.util.SerializerTest
Running org.apache.wiki.util.UtilJ2eeCompatTest
Tests run: 3, Failures: 0, Errors: 0, Skipped: 0, Time elapsed: 0.001 sec - in org.apache.wiki.util.UtilJ2eeCompatTest
Running org.apache.wiki.util.PriorityListTest
Tests run: 4, Failures: 0, Errors: 0, Skipped: 0, Time elapsed: 0 sec - in org.apache.wiki.util.PriorityListTest
Running org.apache.wiki.util.XmlUtilTest
Tests run: 2, Failures: 0, Errors: 0, Skipped: 0, Time elapsed: 0.001 sec - in org.apache.wiki.util.XmlUtilTest
Running org.apache.wiki.util.comparators.HumanComparatorTest
Tests run: 2, Failures: 0, Errors: 0, Skipped: 0, Time elapsed: 0 sec - in org.apache.wiki.util.comparators.HumanComparatorTest
Running org.apache.wiki.util.CommentedPropertiesTest
Tests run: 4, Failures: 0, Errors: 0, Skipped: 0, Time elapsed: 0 sec - in org.apache.wiki.util.CommentedPropertiesTest
Running org.apache.wiki.util.MailUtilTest
I could not test whether mail sending works, since I could not connect to your SMTP server.
Reason: Could not connect to SMTP host: 127.0.0.1, port: 25
Tests run: 2, Failures: 0, Errors: 0, Skipped: 0, Time elapsed: 0.018 sec - in org.apache.wiki.util.MailUtilTest
Running org.apache.wiki.util.ClassUtilTest
Tests run: 3, Failures: 0, Errors: 0, Skipped: 0, Time elapsed: 0.069 sec - in org.apache.wiki.util.ClassUtilTest
Running org.apache.wiki.filters.DefaultFilterManagerTest
Tests run: 2, Failures: 0, Errors: 0, Skipped: 0, Time elapsed: 0.02 sec - in org.apache.wiki.filters.DefaultFilterManagerTest
Results :
Tests in error:
FileSystemProviderTest.setUp:60 ? Wiki JSPWiki: Unable to load and setup prope...
FileSystemProviderTest.setUp:60 ? Wiki JSPWiki: Unable to load and setup prope...
FileSystemProviderTest.setUp:60 ? Wiki JSPWiki: Unable to load and setup prope...
FileSystemProviderTest.setUp:60 ? Wiki JSPWiki: Unable to load and setup prope...
FileSystemProviderTest.setUp:60 ? Wiki JSPWiki: Unable to load and setup prope...
FileSystemProviderTest.setUp:60 ? Wiki JSPWiki: Unable to load and setup prope...
FileSystemProviderTest.setUp:60 ? Wiki JSPWiki: Unable to load and setup prope...
FileSystemProviderTest.setUp:60 ? Wiki JSPWiki: Unable to load and setup prope...
FileSystemProviderTest.setUp:60 ? Wiki JSPWiki: Unable to load and setup prope...
WikiEngineTest.testNonExistentDirectory:98 ? Wiki JSPWiki: Unable to load and ...
Tests run: 940, Failures: 0, Errors: 10, Skipped: 0
[INFO] ------------------------------------------------------------------------
[INFO] Reactor Summary:
[INFO]
[INFO] Apache JSPWiki .................................... SUCCESS [6.937s]
[INFO] Apache JSPWiki Main War ........................... FAILURE [1:48.644s]
[INFO] Apache JSPWiki initial wiki pages builder ......... SKIPPED
[INFO] Apache JSPWiki initial wiki pages (de) ............ SKIPPED
[INFO] Apache JSPWiki initial wiki pages (en) ............ SKIPPED
[INFO] Apache JSPWiki initial wiki pages (es) ............ SKIPPED
[INFO] Apache JSPWiki initial wiki pages (fi) ............ SKIPPED
[INFO] Apache JSPWiki initial wiki pages (fr) ............ SKIPPED
[INFO] Apache JSPWiki initial wiki pages (it) ............ SKIPPED
[INFO] Apache JSPWiki initial wiki pages (nl) ............ SKIPPED
[INFO] Apache JSPWiki initial wiki pages (pt_BR) ......... SKIPPED
[INFO] Apache JSPWiki initial wiki pages (zh_CN) ......... SKIPPED
[INFO] jspwiki-it-builder ................................ SKIPPED
[INFO] jspwiki-selenium-tests ............................ SKIPPED
[INFO] jspwiki-it-test-custom ............................ SKIPPED
[INFO] jspwiki-it-test-custom-absolute-urls .............. SKIPPED
[INFO] jspwiki-it-test-custom-jdbc ....................... SKIPPED
[INFO] jspwiki-it-test-cma ............................... SKIPPED
[INFO] jspwiki-it-test-cma-jdbc .......................... SKIPPED
[INFO] ------------------------------------------------------------------------
[INFO] BUILD FAILURE
[INFO] ------------------------------------------------------------------------
[INFO] Total time: 1:56.228s
[INFO] Finished at: Sun Apr 20 22:08:49 UTC 2014
[INFO] Final Memory: 29M/385M
[INFO] ------------------------------------------------------------------------
[ERROR] Failed to execute goal org.apache.maven.plugins:maven-surefire-plugin:2.16:test (default-test) on project jspwiki-war: There are test failures.
[ERROR]
[ERROR] Please refer to /x1/jenkins/jenkins-slave/workspace/JSPWiki/jspwiki-war/target/surefire-reports for the individual test results.
[ERROR] -> [Help 1]
[ERROR]
[ERROR] To see the full stack trace of the errors, re-run Maven with the -e switch.
[ERROR] Re-run Maven using the -X switch to enable full debug logging.
[ERROR]
[ERROR] For more information about the errors and possible solutions, please read the following articles:
[ERROR] [Help 1] http://cwiki.apache.org/confluence/display/MAVEN/MojoFailureException
[ERROR]
[ERROR] After correcting the problems, you can resume the build with the command
[ERROR] mvn <goals> -rf :jspwiki-war
Build step 'Invoke top-level Maven targets' marked build as failure
Jenkins build is back to normal : JSPWiki #292
Posted by Apache Jenkins Server <je...@builds.apache.org>.
See <https://builds.apache.org/job/JSPWiki/292/>