You are viewing a plain text version of this content. The canonical link for it is here.
Posted to dev@poi.apache.org by Apache Jenkins Server <je...@builds.apache.org> on 2025/06/22 06:50:34 UTC
Build failed in Jenkins: POI » POI-DSL-1.25 #2
See <https://ci-builds.apache.org/job/POI/job/POI-DSL-1.25/2/display/redirect?page=changes>
Changes:
[PJ Fanning] [bug-69681] allow 1 optional space in date formats before the AM/PM part
[PJ Fanning] [bug-69681] allow 1 optional space in date formats before the AM/PM part
[PJ Fanning] update changes
[PJ Fanning] [bug-69714] refactor thread-local
[PJ Fanning] [bug-69714] add TempFile.withStrategy. Thanks to Attila Kelemen. This closes #825
[PJ Fanning] [bug-69714] refactor thread-local
[PJ Fanning] [bug-69714] refactor test
[PJ Fanning] [bug-69714] add thread local support for overriding TempFile strategy
[PJ Fanning] [bug-69714] add thread local support for overriding TempFile strategy
------------------------------------------
[...truncated 9.57 MiB...]
[spotbugs] At edu.umd.cs.findbugs.FindBugs2.execute(FindBugs2.java:252)
[spotbugs] At edu.umd.cs.findbugs.FindBugs.runMain(FindBugs.java:395)
[spotbugs] At edu.umd.cs.findbugs.FindBugs2.main(FindBugs2.java:1231)
[spotbugs] Couldn't get class info for java/util/regex/MatchResult
[spotbugs] java.lang.IllegalArgumentException: Unsupported class file major version 69
[spotbugs] At org.objectweb.asm.ClassReader.<init>(ClassReader.java:200)
[spotbugs] At org.objectweb.asm.ClassReader.<init>(ClassReader.java:180)
[spotbugs] At org.objectweb.asm.ClassReader.<init>(ClassReader.java:166)
[spotbugs] At edu.umd.cs.findbugs.asm.FBClassReader.<init>(FBClassReader.java:35)
[spotbugs] At edu.umd.cs.findbugs.classfile.engine.asm.ClassReaderAnalysisEngine.analyze(ClassReaderAnalysisEngine.java:48)
[spotbugs] At edu.umd.cs.findbugs.classfile.engine.asm.ClassReaderAnalysisEngine.analyze(ClassReaderAnalysisEngine.java:34)
[spotbugs] At edu.umd.cs.findbugs.classfile.impl.AnalysisCache.getClassAnalysis(AnalysisCache.java:261)
[spotbugs] At edu.umd.cs.findbugs.classfile.engine.ClassInfoAnalysisEngine.analyze(ClassInfoAnalysisEngine.java:75)
[spotbugs] At edu.umd.cs.findbugs.classfile.engine.ClassInfoAnalysisEngine.analyze(ClassInfoAnalysisEngine.java:38)
[spotbugs] At edu.umd.cs.findbugs.classfile.impl.AnalysisCache.getClassAnalysis(AnalysisCache.java:261)
[spotbugs] At edu.umd.cs.findbugs.ba.XFactory.getXClass(XFactory.java:693)
[spotbugs] At edu.umd.cs.findbugs.ba.AnalysisContext.setAppClassList(AnalysisContext.java:975)
[spotbugs] At edu.umd.cs.findbugs.FindBugs2.setAppClassList(FindBugs2.java:909)
[spotbugs] At edu.umd.cs.findbugs.FindBugs2.execute(FindBugs2.java:252)
[spotbugs] At edu.umd.cs.findbugs.FindBugs.runMain(FindBugs.java:395)
[spotbugs] At edu.umd.cs.findbugs.FindBugs2.main(FindBugs2.java:1231)
[spotbugs] Couldn't get class info for javax/xml/crypto/dsig/spec/SignatureMethodParameterSpec
[spotbugs] java.lang.IllegalArgumentException: Unsupported class file major version 69
[spotbugs] At org.objectweb.asm.ClassReader.<init>(ClassReader.java:200)
[spotbugs] At org.objectweb.asm.ClassReader.<init>(ClassReader.java:180)
[spotbugs] At org.objectweb.asm.ClassReader.<init>(ClassReader.java:166)
[spotbugs] At edu.umd.cs.findbugs.asm.FBClassReader.<init>(FBClassReader.java:35)
[spotbugs] At edu.umd.cs.findbugs.classfile.engine.asm.ClassReaderAnalysisEngine.analyze(ClassReaderAnalysisEngine.java:48)
[spotbugs] At edu.umd.cs.findbugs.classfile.engine.asm.ClassReaderAnalysisEngine.analyze(ClassReaderAnalysisEngine.java:34)
[spotbugs] At edu.umd.cs.findbugs.classfile.impl.AnalysisCache.getClassAnalysis(AnalysisCache.java:261)
[spotbugs] At edu.umd.cs.findbugs.classfile.engine.ClassInfoAnalysisEngine.analyze(ClassInfoAnalysisEngine.java:75)
[spotbugs] At edu.umd.cs.findbugs.classfile.engine.ClassInfoAnalysisEngine.analyze(ClassInfoAnalysisEngine.java:38)
[spotbugs] At edu.umd.cs.findbugs.classfile.impl.AnalysisCache.getClassAnalysis(AnalysisCache.java:261)
[spotbugs] At edu.umd.cs.findbugs.ba.XFactory.getXClass(XFactory.java:693)
[spotbugs] At edu.umd.cs.findbugs.ba.AnalysisContext.setAppClassList(AnalysisContext.java:975)
[spotbugs] At edu.umd.cs.findbugs.FindBugs2.setAppClassList(FindBugs2.java:909)
[spotbugs] At edu.umd.cs.findbugs.FindBugs2.execute(FindBugs2.java:252)
[spotbugs] At edu.umd.cs.findbugs.FindBugs.runMain(FindBugs.java:395)
[spotbugs] At edu.umd.cs.findbugs.FindBugs2.main(FindBugs2.java:1231)
[spotbugs] Couldn't get class info for java/util/Random
[spotbugs] java.lang.IllegalArgumentException: Unsupported class file major version 69
[spotbugs] At org.objectweb.asm.ClassReader.<init>(ClassReader.java:200)
[spotbugs] At org.objectweb.asm.ClassReader.<init>(ClassReader.java:180)
[spotbugs] At org.objectweb.asm.ClassReader.<init>(ClassReader.java:166)
[spotbugs] At edu.umd.cs.findbugs.asm.FBClassReader.<init>(FBClassReader.java:35)
[spotbugs] At edu.umd.cs.findbugs.classfile.engine.asm.ClassReaderAnalysisEngine.analyze(ClassReaderAnalysisEngine.java:48)
[spotbugs] At edu.umd.cs.findbugs.classfile.engine.asm.ClassReaderAnalysisEngine.analyze(ClassReaderAnalysisEngine.java:34)
[spotbugs] At edu.umd.cs.findbugs.classfile.impl.AnalysisCache.getClassAnalysis(AnalysisCache.java:261)
[spotbugs] At edu.umd.cs.findbugs.classfile.engine.ClassInfoAnalysisEngine.analyze(ClassInfoAnalysisEngine.java:75)
[spotbugs] At edu.umd.cs.findbugs.classfile.engine.ClassInfoAnalysisEngine.analyze(ClassInfoAnalysisEngine.java:38)
[spotbugs] At edu.umd.cs.findbugs.classfile.impl.AnalysisCache.getClassAnalysis(AnalysisCache.java:261)
[spotbugs] At edu.umd.cs.findbugs.ba.XFactory.getXClass(XFactory.java:693)
[spotbugs] At edu.umd.cs.findbugs.ba.AnalysisContext.setAppClassList(AnalysisContext.java:975)
[spotbugs] At edu.umd.cs.findbugs.FindBugs2.setAppClassList(FindBugs2.java:909)
[spotbugs] At edu.umd.cs.findbugs.FindBugs2.execute(FindBugs2.java:252)
[spotbugs] At edu.umd.cs.findbugs.FindBugs.runMain(FindBugs.java:395)
[spotbugs] At edu.umd.cs.findbugs.FindBugs2.main(FindBugs2.java:1231)
[spotbugs] Couldn't get class info for java/nio/file/attribute/BasicFileAttributes
[spotbugs] java.lang.IllegalArgumentException: Unsupported class file major version 69
[spotbugs] At org.objectweb.asm.ClassReader.<init>(ClassReader.java:200)
[spotbugs] At org.objectweb.asm.ClassReader.<init>(ClassReader.java:180)
[spotbugs] At org.objectweb.asm.ClassReader.<init>(ClassReader.java:166)
[spotbugs] At edu.umd.cs.findbugs.asm.FBClassReader.<init>(FBClassReader.java:35)
[spotbugs] At edu.umd.cs.findbugs.classfile.engine.asm.ClassReaderAnalysisEngine.analyze(ClassReaderAnalysisEngine.java:48)
[spotbugs] At edu.umd.cs.findbugs.classfile.engine.asm.ClassReaderAnalysisEngine.analyze(ClassReaderAnalysisEngine.java:34)
[spotbugs] At edu.umd.cs.findbugs.classfile.impl.AnalysisCache.getClassAnalysis(AnalysisCache.java:261)
[spotbugs] At edu.umd.cs.findbugs.classfile.engine.ClassInfoAnalysisEngine.analyze(ClassInfoAnalysisEngine.java:75)
[spotbugs] At edu.umd.cs.findbugs.classfile.engine.ClassInfoAnalysisEngine.analyze(ClassInfoAnalysisEngine.java:38)
[spotbugs] At edu.umd.cs.findbugs.classfile.impl.AnalysisCache.getClassAnalysis(AnalysisCache.java:261)
[spotbugs] At edu.umd.cs.findbugs.ba.XFactory.getXClass(XFactory.java:693)
[spotbugs] At edu.umd.cs.findbugs.ba.AnalysisContext.setAppClassList(AnalysisContext.java:975)
[spotbugs] At edu.umd.cs.findbugs.FindBugs2.setAppClassList(FindBugs2.java:909)
[spotbugs] At edu.umd.cs.findbugs.FindBugs2.execute(FindBugs2.java:252)
[spotbugs] At edu.umd.cs.findbugs.FindBugs.runMain(FindBugs.java:395)
[spotbugs] At edu.umd.cs.findbugs.FindBugs2.main(FindBugs2.java:1231)
[spotbugs] Couldn't get class info for java/util/Locale
[spotbugs] java.lang.IllegalArgumentException: Unsupported class file major version 69
[spotbugs] At org.objectweb.asm.ClassReader.<init>(ClassReader.java:200)
[spotbugs] At org.objectweb.asm.ClassReader.<init>(ClassReader.java:180)
[spotbugs] At org.objectweb.asm.ClassReader.<init>(ClassReader.java:166)
[spotbugs] At edu.umd.cs.findbugs.asm.FBClassReader.<init>(FBClassReader.java:35)
[spotbugs] At edu.umd.cs.findbugs.classfile.engine.asm.ClassReaderAnalysisEngine.analyze(ClassReaderAnalysisEngine.java:48)
[spotbugs] At edu.umd.cs.findbugs.classfile.engine.asm.ClassReaderAnalysisEngine.analyze(ClassReaderAnalysisEngine.java:34)
[spotbugs] At edu.umd.cs.findbugs.classfile.impl.AnalysisCache.getClassAnalysis(AnalysisCache.java:261)
[spotbugs] At edu.umd.cs.findbugs.classfile.engine.ClassInfoAnalysisEngine.analyze(ClassInfoAnalysisEngine.java:75)
[spotbugs] At edu.umd.cs.findbugs.classfile.engine.ClassInfoAnalysisEngine.analyze(ClassInfoAnalysisEngine.java:38)
[spotbugs] At edu.umd.cs.findbugs.classfile.impl.AnalysisCache.getClassAnalysis(AnalysisCache.java:261)
[spotbugs] At edu.umd.cs.findbugs.ba.XFactory.getXClass(XFactory.java:693)
[spotbugs] At edu.umd.cs.findbugs.ba.AnalysisContext.setAppClassList(AnalysisContext.java:975)
[spotbugs] At edu.umd.cs.findbugs.FindBugs2.setAppClassList(FindBugs2.java:909)
[spotbugs] At edu.umd.cs.findbugs.FindBugs2.execute(FindBugs2.java:252)
[spotbugs] At edu.umd.cs.findbugs.FindBugs.runMain(FindBugs.java:395)
[spotbugs] At edu.umd.cs.findbugs.FindBugs2.main(FindBugs2.java:1231)
[spotbugs] Couldn't get class info for java/util/zip/Deflater
[spotbugs] java.lang.IllegalArgumentException: Unsupported class file major version 69
[spotbugs] At org.objectweb.asm.ClassReader.<init>(ClassReader.java:200)
[spotbugs] At org.objectweb.asm.ClassReader.<init>(ClassReader.java:180)
[spotbugs] At org.objectweb.asm.ClassReader.<init>(ClassReader.java:166)
[spotbugs] At edu.umd.cs.findbugs.asm.FBClassReader.<init>(FBClassReader.java:35)
[spotbugs] At edu.umd.cs.findbugs.classfile.engine.asm.ClassReaderAnalysisEngine.analyze(ClassReaderAnalysisEngine.java:48)
[spotbugs] At edu.umd.cs.findbugs.classfile.engine.asm.ClassReaderAnalysisEngine.analyze(ClassReaderAnalysisEngine.java:34)
[spotbugs] At edu.umd.cs.findbugs.classfile.impl.AnalysisCache.getClassAnalysis(AnalysisCache.java:261)
[spotbugs] At edu.umd.cs.findbugs.classfile.engine.ClassInfoAnalysisEngine.analyze(ClassInfoAnalysisEngine.java:75)
[spotbugs] At edu.umd.cs.findbugs.classfile.engine.ClassInfoAnalysisEngine.analyze(ClassInfoAnalysisEngine.java:38)
[spotbugs] At edu.umd.cs.findbugs.classfile.impl.AnalysisCache.getClassAnalysis(AnalysisCache.java:261)
[spotbugs] At edu.umd.cs.findbugs.ba.XFactory.getXClass(XFactory.java:693)
[spotbugs] At edu.umd.cs.findbugs.ba.AnalysisContext.setAppClassList(AnalysisContext.java:975)
[spotbugs] At edu.umd.cs.findbugs.FindBugs2.setAppClassList(FindBugs2.java:909)
[spotbugs] At edu.umd.cs.findbugs.FindBugs2.execute(FindBugs2.java:252)
[spotbugs] At edu.umd.cs.findbugs.FindBugs.runMain(FindBugs.java:395)
[spotbugs] At edu.umd.cs.findbugs.FindBugs2.main(FindBugs2.java:1231)
[spotbugs] Couldn't get class info for java/lang/AssertionError
[spotbugs] java.lang.IllegalArgumentException: Unsupported class file major version 69
[spotbugs] At org.objectweb.asm.ClassReader.<init>(ClassReader.java:200)
[spotbugs] At org.objectweb.asm.ClassReader.<init>(ClassReader.java:180)
[spotbugs] At org.objectweb.asm.ClassReader.<init>(ClassReader.java:166)
[spotbugs] At edu.umd.cs.findbugs.asm.FBClassReader.<init>(FBClassReader.java:35)
[spotbugs] At edu.umd.cs.findbugs.classfile.engine.asm.ClassReaderAnalysisEngine.analyze(ClassReaderAnalysisEngine.java:48)
[spotbugs] At edu.umd.cs.findbugs.classfile.engine.asm.ClassReaderAnalysisEngine.analyze(ClassReaderAnalysisEngine.java:34)
[spotbugs] At edu.umd.cs.findbugs.classfile.impl.AnalysisCache.getClassAnalysis(AnalysisCache.java:261)
[spotbugs] At edu.umd.cs.findbugs.classfile.engine.ClassInfoAnalysisEngine.analyze(ClassInfoAnalysisEngine.java:75)
[spotbugs] At edu.umd.cs.findbugs.classfile.engine.ClassInfoAnalysisEngine.analyze(ClassInfoAnalysisEngine.java:38)
[spotbugs] At edu.umd.cs.findbugs.classfile.impl.AnalysisCache.getClassAnalysis(AnalysisCache.java:261)
[spotbugs] At edu.umd.cs.findbugs.ba.XFactory.getXClass(XFactory.java:693)
[spotbugs] At edu.umd.cs.findbugs.ba.AnalysisContext.setAppClassList(AnalysisContext.java:975)
[spotbugs] At edu.umd.cs.findbugs.FindBugs2.setAppClassList(FindBugs2.java:909)
[spotbugs] At edu.umd.cs.findbugs.FindBugs2.execute(FindBugs2.java:252)
[spotbugs] At edu.umd.cs.findbugs.FindBugs.runMain(FindBugs.java:395)
[spotbugs] At edu.umd.cs.findbugs.FindBugs2.main(FindBugs2.java:1231)
[spotbugs] Couldn't get class info for java/util/Set
[spotbugs] java.lang.IllegalArgumentException: Unsupported class file major version 69
[spotbugs] At org.objectweb.asm.ClassReader.<init>(ClassReader.java:200)
[spotbugs] At org.objectweb.asm.ClassReader.<init>(ClassReader.java:180)
[spotbugs] At org.objectweb.asm.ClassReader.<init>(ClassReader.java:166)
[spotbugs] At edu.umd.cs.findbugs.asm.FBClassReader.<init>(FBClassReader.java:35)
[spotbugs] At edu.umd.cs.findbugs.classfile.engine.asm.ClassReaderAnalysisEngine.analyze(ClassReaderAnalysisEngine.java:48)
[spotbugs] At edu.umd.cs.findbugs.classfile.engine.asm.ClassReaderAnalysisEngine.analyze(ClassReaderAnalysisEngine.java:34)
[spotbugs] At edu.umd.cs.findbugs.classfile.impl.AnalysisCache.getClassAnalysis(AnalysisCache.java:261)
[spotbugs] At edu.umd.cs.findbugs.classfile.engine.ClassInfoAnalysisEngine.analyze(ClassInfoAnalysisEngine.java:75)
[spotbugs] At edu.umd.cs.findbugs.classfile.engine.ClassInfoAnalysisEngine.analyze(ClassInfoAnalysisEngine.java:38)
[spotbugs] At edu.umd.cs.findbugs.classfile.impl.AnalysisCache.getClassAnalysis(AnalysisCache.java:261)
[spotbugs] At edu.umd.cs.findbugs.ba.XFactory.getXClass(XFactory.java:693)
[spotbugs] At edu.umd.cs.findbugs.ba.AnalysisContext.setAppClassList(AnalysisContext.java:975)
[spotbugs] At edu.umd.cs.findbugs.FindBugs2.setAppClassList(FindBugs2.java:909)
[spotbugs] At edu.umd.cs.findbugs.FindBugs2.execute(FindBugs2.java:252)
[spotbugs] At edu.umd.cs.findbugs.FindBugs.runMain(FindBugs.java:395)
[spotbugs] At edu.umd.cs.findbugs.FindBugs2.main(FindBugs2.java:1231)
[spotbugs] Couldn't get class info for java/io/FilterInputStream
[spotbugs] java.lang.IllegalArgumentException: Unsupported class file major version 69
[spotbugs] At org.objectweb.asm.ClassReader.<init>(ClassReader.java:200)
[spotbugs] At org.objectweb.asm.ClassReader.<init>(ClassReader.java:180)
[spotbugs] At org.objectweb.asm.ClassReader.<init>(ClassReader.java:166)
[spotbugs] At edu.umd.cs.findbugs.asm.FBClassReader.<init>(FBClassReader.java:35)
[spotbugs] At edu.umd.cs.findbugs.classfile.engine.asm.ClassReaderAnalysisEngine.analyze(ClassReaderAnalysisEngine.java:48)
[spotbugs] At edu.umd.cs.findbugs.classfile.engine.asm.ClassReaderAnalysisEngine.analyze(ClassReaderAnalysisEngine.java:34)
[spotbugs] At edu.umd.cs.findbugs.classfile.impl.AnalysisCache.getClassAnalysis(AnalysisCache.java:261)
[spotbugs] At edu.umd.cs.findbugs.classfile.engine.ClassInfoAnalysisEngine.analyze(ClassInfoAnalysisEngine.java:75)
[spotbugs] At edu.umd.cs.findbugs.classfile.engine.ClassInfoAnalysisEngine.analyze(ClassInfoAnalysisEngine.java:38)
[spotbugs] At edu.umd.cs.findbugs.classfile.impl.AnalysisCache.getClassAnalysis(AnalysisCache.java:261)
[spotbugs] At edu.umd.cs.findbugs.FindBugs2.buildReferencedClassSet(FindBugs2.java:806)
[spotbugs] At edu.umd.cs.findbugs.FindBugs2.execute(FindBugs2.java:249)
[spotbugs] At edu.umd.cs.findbugs.FindBugs.runMain(FindBugs.java:395)
[spotbugs] At edu.umd.cs.findbugs.FindBugs2.main(FindBugs2.java:1231)
[spotbugs] Couldn't get class info for java/awt/AlphaComposite
[spotbugs] java.lang.IllegalArgumentException: Unsupported class file major version 69
[spotbugs] At org.objectweb.asm.ClassReader.<init>(ClassReader.java:200)
[spotbugs] At org.objectweb.asm.ClassReader.<init>(ClassReader.java:180)
[spotbugs] At org.objectweb.asm.ClassReader.<init>(ClassReader.java:166)
[spotbugs] At edu.umd.cs.findbugs.asm.FBClassReader.<init>(FBClassReader.java:35)
[spotbugs] At edu.umd.cs.findbugs.classfile.engine.asm.ClassReaderAnalysisEngine.analyze(ClassReaderAnalysisEngine.java:48)
[spotbugs] At edu.umd.cs.findbugs.classfile.engine.asm.ClassReaderAnalysisEngine.analyze(ClassReaderAnalysisEngine.java:34)
[spotbugs] At edu.umd.cs.findbugs.classfile.impl.AnalysisCache.getClassAnalysis(AnalysisCache.java:261)
[spotbugs] At edu.umd.cs.findbugs.classfile.engine.ClassInfoAnalysisEngine.analyze(ClassInfoAnalysisEngine.java:75)
[spotbugs] At edu.umd.cs.findbugs.classfile.engine.ClassInfoAnalysisEngine.analyze(ClassInfoAnalysisEngine.java:38)
[spotbugs] At edu.umd.cs.findbugs.classfile.impl.AnalysisCache.getClassAnalysis(AnalysisCache.java:261)
[spotbugs] At edu.umd.cs.findbugs.ba.XFactory.getXClass(XFactory.java:693)
[spotbugs] At edu.umd.cs.findbugs.ba.AnalysisContext.setAppClassList(AnalysisContext.java:975)
[spotbugs] At edu.umd.cs.findbugs.FindBugs2.setAppClassList(FindBugs2.java:909)
[spotbugs] At edu.umd.cs.findbugs.FindBugs2.execute(FindBugs2.java:252)
[spotbugs] At edu.umd.cs.findbugs.FindBugs.runMain(FindBugs.java:395)
[spotbugs] At edu.umd.cs.findbugs.FindBugs2.main(FindBugs2.java:1231)
[spotbugs] Couldn't get class info for java/awt/geom/Arc2D
[spotbugs] java.lang.IllegalArgumentException: Unsupported class file major version 69
[spotbugs] At org.objectweb.asm.ClassReader.<init>(ClassReader.java:200)
[spotbugs] At org.objectweb.asm.ClassReader.<init>(ClassReader.java:180)
[spotbugs] At org.objectweb.asm.ClassReader.<init>(ClassReader.java:166)
[spotbugs] At edu.umd.cs.findbugs.asm.FBClassReader.<init>(FBClassReader.java:35)
[spotbugs] At edu.umd.cs.findbugs.classfile.engine.asm.ClassReaderAnalysisEngine.analyze(ClassReaderAnalysisEngine.java:48)
[spotbugs] At edu.umd.cs.findbugs.classfile.engine.asm.ClassReaderAnalysisEngine.analyze(ClassReaderAnalysisEngine.java:34)
[spotbugs] At edu.umd.cs.findbugs.classfile.impl.AnalysisCache.getClassAnalysis(AnalysisCache.java:261)
[spotbugs] At edu.umd.cs.findbugs.classfile.engine.ClassInfoAnalysisEngine.analyze(ClassInfoAnalysisEngine.java:75)
[spotbugs] At edu.umd.cs.findbugs.classfile.engine.ClassInfoAnalysisEngine.analyze(ClassInfoAnalysisEngine.java:38)
[spotbugs] At edu.umd.cs.findbugs.classfile.impl.AnalysisCache.getClassAnalysis(AnalysisCache.java:261)
[spotbugs] At edu.umd.cs.findbugs.ba.XFactory.getXClass(XFactory.java:693)
[spotbugs] At edu.umd.cs.findbugs.ba.AnalysisContext.setAppClassList(AnalysisContext.java:975)
[spotbugs] At edu.umd.cs.findbugs.FindBugs2.setAppClassList(FindBugs2.java:909)
[spotbugs] At edu.umd.cs.findbugs.FindBugs2.execute(FindBugs2.java:252)
[spotbugs] At edu.umd.cs.findbugs.FindBugs.runMain(FindBugs.java:395)
[spotbugs] At edu.umd.cs.findbugs.FindBugs2.main(FindBugs2.java:1231)
[spotbugs] Couldn't get class info for java/security/DigestException
[spotbugs] java.lang.IllegalArgumentException: Unsupported class file major version 69
[spotbugs] At org.objectweb.asm.ClassReader.<init>(ClassReader.java:200)
[spotbugs] At org.objectweb.asm.ClassReader.<init>(ClassReader.java:180)
[spotbugs] At org.objectweb.asm.ClassReader.<init>(ClassReader.java:166)
[spotbugs] At edu.umd.cs.findbugs.asm.FBClassReader.<init>(FBClassReader.java:35)
[spotbugs] At edu.umd.cs.findbugs.classfile.engine.asm.ClassReaderAnalysisEngine.analyze(ClassReaderAnalysisEngine.java:48)
[spotbugs] At edu.umd.cs.findbugs.classfile.engine.asm.ClassReaderAnalysisEngine.analyze(ClassReaderAnalysisEngine.java:34)
[spotbugs] At edu.umd.cs.findbugs.classfile.impl.AnalysisCache.getClassAnalysis(AnalysisCache.java:261)
[spotbugs] At edu.umd.cs.findbugs.classfile.engine.ClassInfoAnalysisEngine.analyze(ClassInfoAnalysisEngine.java:75)
[spotbugs] At edu.umd.cs.findbugs.classfile.engine.ClassInfoAnalysisEngine.analyze(ClassInfoAnalysisEngine.java:38)
[spotbugs] At edu.umd.cs.findbugs.classfile.impl.AnalysisCache.getClassAnalysis(AnalysisCache.java:261)
[spotbugs] At edu.umd.cs.findbugs.ba.XFactory.getXClass(XFactory.java:693)
[spotbugs] At edu.umd.cs.findbugs.ba.AnalysisContext.setAppClassList(AnalysisContext.java:975)
[spotbugs] At edu.umd.cs.findbugs.FindBugs2.setAppClassList(FindBugs2.java:909)
[spotbugs] At edu.umd.cs.findbugs.FindBugs2.execute(FindBugs2.java:252)
[spotbugs] At edu.umd.cs.findbugs.FindBugs.runMain(FindBugs.java:395)
[spotbugs] At edu.umd.cs.findbugs.FindBugs2.main(FindBugs2.java:1231)
[spotbugs]
[spotbugs] java.lang.IllegalArgumentException: Unsupported class file major version 69
[spotbugs] at org.objectweb.asm.ClassReader.<init>(ClassReader.java:200)
[spotbugs] at org.objectweb.asm.ClassReader.<init>(ClassReader.java:180)
[spotbugs] at org.objectweb.asm.ClassReader.<init>(ClassReader.java:166)
[spotbugs] at edu.umd.cs.findbugs.asm.FBClassReader.<init>(FBClassReader.java:35)
[spotbugs] at edu.umd.cs.findbugs.classfile.engine.asm.ClassReaderAnalysisEngine.analyze(ClassReaderAnalysisEngine.java:48)
[spotbugs] at edu.umd.cs.findbugs.classfile.engine.asm.ClassReaderAnalysisEngine.analyze(ClassReaderAnalysisEngine.java:34)
[spotbugs] at edu.umd.cs.findbugs.classfile.impl.AnalysisCache.getClassAnalysis(AnalysisCache.java:261)
[spotbugs] at edu.umd.cs.findbugs.classfile.engine.ClassInfoAnalysisEngine.analyze(ClassInfoAnalysisEngine.java:75)
[spotbugs] at edu.umd.cs.findbugs.classfile.engine.ClassInfoAnalysisEngine.analyze(ClassInfoAnalysisEngine.java:38)
[spotbugs] at edu.umd.cs.findbugs.classfile.impl.AnalysisCache.getClassAnalysis(AnalysisCache.java:261)
[spotbugs] at edu.umd.cs.findbugs.ba.XFactory.getXClass(XFactory.java:693)
[spotbugs] at edu.umd.cs.findbugs.ba.AnalysisContext.setAppClassList(AnalysisContext.java:975)
[spotbugs] at edu.umd.cs.findbugs.FindBugs2.setAppClassList(FindBugs2.java:909)
[spotbugs] at edu.umd.cs.findbugs.FindBugs2.execute(FindBugs2.java:252)
[spotbugs] at edu.umd.cs.findbugs.FindBugs.runMain(FindBugs.java:395)
[spotbugs] at edu.umd.cs.findbugs.FindBugs2.main(FindBugs2.java:1231)
[spotbugs] Java Result: 4
BUILD FAILED
<https://ci-builds.apache.org/job/POI/job/POI-DSL-1.25/ws/build.xml>:2657: Execution of SpotBugs failed.
Total time: 28 minutes 7 seconds
Build step 'Invoke Ant' marked build as failure
ERROR: Not all environment variables could be successfully injected. Check for similarly-named environment variables.
Archiving artifacts
ERROR: Not all environment variables could be successfully injected. Check for similarly-named environment variables.
Recording test results
ERROR: Not all environment variables could be successfully injected. Check for similarly-named environment variables.
[Checks API] No suitable checks publisher found.
ERROR: Not all environment variables could be successfully injected. Check for similarly-named environment variables.
---------------------------------------------------------------------
To unsubscribe, e-mail: dev-unsubscribe@poi.apache.org
For additional commands, e-mail: dev-help@poi.apache.org
Build failed in Jenkins: POI » POI-DSL-1.25 #3
Posted by Apache Jenkins Server <je...@builds.apache.org>.
See <https://ci-builds.apache.org/job/POI/job/POI-DSL-1.25/3/display/redirect?page=changes>
Changes:
[Dominik Stadler] Bug 69729: Clarify that JDK 11 is needed for building
[Dominik Stadler] Update changelog, mention newer JaCoCo
[PJ Fanning] xmlunit 2.10.3
[PJ Fanning] junit 5.13.2
[PJ Fanning] try to tidy up jupiter dependency by using the junit-bom
------------------------------------------
[...truncated 9.57 MiB...]
[spotbugs] At edu.umd.cs.findbugs.FindBugs2.execute(FindBugs2.java:252)
[spotbugs] At edu.umd.cs.findbugs.FindBugs.runMain(FindBugs.java:395)
[spotbugs] At edu.umd.cs.findbugs.FindBugs2.main(FindBugs2.java:1231)
[spotbugs] Couldn't get class info for java/util/regex/MatchResult
[spotbugs] java.lang.IllegalArgumentException: Unsupported class file major version 69
[spotbugs] At org.objectweb.asm.ClassReader.<init>(ClassReader.java:200)
[spotbugs] At org.objectweb.asm.ClassReader.<init>(ClassReader.java:180)
[spotbugs] At org.objectweb.asm.ClassReader.<init>(ClassReader.java:166)
[spotbugs] At edu.umd.cs.findbugs.asm.FBClassReader.<init>(FBClassReader.java:35)
[spotbugs] At edu.umd.cs.findbugs.classfile.engine.asm.ClassReaderAnalysisEngine.analyze(ClassReaderAnalysisEngine.java:48)
[spotbugs] At edu.umd.cs.findbugs.classfile.engine.asm.ClassReaderAnalysisEngine.analyze(ClassReaderAnalysisEngine.java:34)
[spotbugs] At edu.umd.cs.findbugs.classfile.impl.AnalysisCache.getClassAnalysis(AnalysisCache.java:261)
[spotbugs] At edu.umd.cs.findbugs.classfile.engine.ClassInfoAnalysisEngine.analyze(ClassInfoAnalysisEngine.java:75)
[spotbugs] At edu.umd.cs.findbugs.classfile.engine.ClassInfoAnalysisEngine.analyze(ClassInfoAnalysisEngine.java:38)
[spotbugs] At edu.umd.cs.findbugs.classfile.impl.AnalysisCache.getClassAnalysis(AnalysisCache.java:261)
[spotbugs] At edu.umd.cs.findbugs.ba.XFactory.getXClass(XFactory.java:693)
[spotbugs] At edu.umd.cs.findbugs.ba.AnalysisContext.setAppClassList(AnalysisContext.java:975)
[spotbugs] At edu.umd.cs.findbugs.FindBugs2.setAppClassList(FindBugs2.java:909)
[spotbugs] At edu.umd.cs.findbugs.FindBugs2.execute(FindBugs2.java:252)
[spotbugs] At edu.umd.cs.findbugs.FindBugs.runMain(FindBugs.java:395)
[spotbugs] At edu.umd.cs.findbugs.FindBugs2.main(FindBugs2.java:1231)
[spotbugs] Couldn't get class info for javax/xml/crypto/dsig/spec/SignatureMethodParameterSpec
[spotbugs] java.lang.IllegalArgumentException: Unsupported class file major version 69
[spotbugs] At org.objectweb.asm.ClassReader.<init>(ClassReader.java:200)
[spotbugs] At org.objectweb.asm.ClassReader.<init>(ClassReader.java:180)
[spotbugs] At org.objectweb.asm.ClassReader.<init>(ClassReader.java:166)
[spotbugs] At edu.umd.cs.findbugs.asm.FBClassReader.<init>(FBClassReader.java:35)
[spotbugs] At edu.umd.cs.findbugs.classfile.engine.asm.ClassReaderAnalysisEngine.analyze(ClassReaderAnalysisEngine.java:48)
[spotbugs] At edu.umd.cs.findbugs.classfile.engine.asm.ClassReaderAnalysisEngine.analyze(ClassReaderAnalysisEngine.java:34)
[spotbugs] At edu.umd.cs.findbugs.classfile.impl.AnalysisCache.getClassAnalysis(AnalysisCache.java:261)
[spotbugs] At edu.umd.cs.findbugs.classfile.engine.ClassInfoAnalysisEngine.analyze(ClassInfoAnalysisEngine.java:75)
[spotbugs] At edu.umd.cs.findbugs.classfile.engine.ClassInfoAnalysisEngine.analyze(ClassInfoAnalysisEngine.java:38)
[spotbugs] At edu.umd.cs.findbugs.classfile.impl.AnalysisCache.getClassAnalysis(AnalysisCache.java:261)
[spotbugs] At edu.umd.cs.findbugs.ba.XFactory.getXClass(XFactory.java:693)
[spotbugs] At edu.umd.cs.findbugs.ba.AnalysisContext.setAppClassList(AnalysisContext.java:975)
[spotbugs] At edu.umd.cs.findbugs.FindBugs2.setAppClassList(FindBugs2.java:909)
[spotbugs] At edu.umd.cs.findbugs.FindBugs2.execute(FindBugs2.java:252)
[spotbugs] At edu.umd.cs.findbugs.FindBugs.runMain(FindBugs.java:395)
[spotbugs] At edu.umd.cs.findbugs.FindBugs2.main(FindBugs2.java:1231)
[spotbugs] Couldn't get class info for java/util/Random
[spotbugs] java.lang.IllegalArgumentException: Unsupported class file major version 69
[spotbugs] At org.objectweb.asm.ClassReader.<init>(ClassReader.java:200)
[spotbugs] At org.objectweb.asm.ClassReader.<init>(ClassReader.java:180)
[spotbugs] At org.objectweb.asm.ClassReader.<init>(ClassReader.java:166)
[spotbugs] At edu.umd.cs.findbugs.asm.FBClassReader.<init>(FBClassReader.java:35)
[spotbugs] At edu.umd.cs.findbugs.classfile.engine.asm.ClassReaderAnalysisEngine.analyze(ClassReaderAnalysisEngine.java:48)
[spotbugs] At edu.umd.cs.findbugs.classfile.engine.asm.ClassReaderAnalysisEngine.analyze(ClassReaderAnalysisEngine.java:34)
[spotbugs] At edu.umd.cs.findbugs.classfile.impl.AnalysisCache.getClassAnalysis(AnalysisCache.java:261)
[spotbugs] At edu.umd.cs.findbugs.classfile.engine.ClassInfoAnalysisEngine.analyze(ClassInfoAnalysisEngine.java:75)
[spotbugs] At edu.umd.cs.findbugs.classfile.engine.ClassInfoAnalysisEngine.analyze(ClassInfoAnalysisEngine.java:38)
[spotbugs] At edu.umd.cs.findbugs.classfile.impl.AnalysisCache.getClassAnalysis(AnalysisCache.java:261)
[spotbugs] At edu.umd.cs.findbugs.ba.XFactory.getXClass(XFactory.java:693)
[spotbugs] At edu.umd.cs.findbugs.ba.AnalysisContext.setAppClassList(AnalysisContext.java:975)
[spotbugs] At edu.umd.cs.findbugs.FindBugs2.setAppClassList(FindBugs2.java:909)
[spotbugs] At edu.umd.cs.findbugs.FindBugs2.execute(FindBugs2.java:252)
[spotbugs] At edu.umd.cs.findbugs.FindBugs.runMain(FindBugs.java:395)
[spotbugs] At edu.umd.cs.findbugs.FindBugs2.main(FindBugs2.java:1231)
[spotbugs] Couldn't get class info for java/nio/file/attribute/BasicFileAttributes
[spotbugs] java.lang.IllegalArgumentException: Unsupported class file major version 69
[spotbugs] At org.objectweb.asm.ClassReader.<init>(ClassReader.java:200)
[spotbugs] At org.objectweb.asm.ClassReader.<init>(ClassReader.java:180)
[spotbugs] At org.objectweb.asm.ClassReader.<init>(ClassReader.java:166)
[spotbugs] At edu.umd.cs.findbugs.asm.FBClassReader.<init>(FBClassReader.java:35)
[spotbugs] At edu.umd.cs.findbugs.classfile.engine.asm.ClassReaderAnalysisEngine.analyze(ClassReaderAnalysisEngine.java:48)
[spotbugs] At edu.umd.cs.findbugs.classfile.engine.asm.ClassReaderAnalysisEngine.analyze(ClassReaderAnalysisEngine.java:34)
[spotbugs] At edu.umd.cs.findbugs.classfile.impl.AnalysisCache.getClassAnalysis(AnalysisCache.java:261)
[spotbugs] At edu.umd.cs.findbugs.classfile.engine.ClassInfoAnalysisEngine.analyze(ClassInfoAnalysisEngine.java:75)
[spotbugs] At edu.umd.cs.findbugs.classfile.engine.ClassInfoAnalysisEngine.analyze(ClassInfoAnalysisEngine.java:38)
[spotbugs] At edu.umd.cs.findbugs.classfile.impl.AnalysisCache.getClassAnalysis(AnalysisCache.java:261)
[spotbugs] At edu.umd.cs.findbugs.ba.XFactory.getXClass(XFactory.java:693)
[spotbugs] At edu.umd.cs.findbugs.ba.AnalysisContext.setAppClassList(AnalysisContext.java:975)
[spotbugs] At edu.umd.cs.findbugs.FindBugs2.setAppClassList(FindBugs2.java:909)
[spotbugs] At edu.umd.cs.findbugs.FindBugs2.execute(FindBugs2.java:252)
[spotbugs] At edu.umd.cs.findbugs.FindBugs.runMain(FindBugs.java:395)
[spotbugs] At edu.umd.cs.findbugs.FindBugs2.main(FindBugs2.java:1231)
[spotbugs] Couldn't get class info for java/util/Locale
[spotbugs] java.lang.IllegalArgumentException: Unsupported class file major version 69
[spotbugs] At org.objectweb.asm.ClassReader.<init>(ClassReader.java:200)
[spotbugs] At org.objectweb.asm.ClassReader.<init>(ClassReader.java:180)
[spotbugs] At org.objectweb.asm.ClassReader.<init>(ClassReader.java:166)
[spotbugs] At edu.umd.cs.findbugs.asm.FBClassReader.<init>(FBClassReader.java:35)
[spotbugs] At edu.umd.cs.findbugs.classfile.engine.asm.ClassReaderAnalysisEngine.analyze(ClassReaderAnalysisEngine.java:48)
[spotbugs] At edu.umd.cs.findbugs.classfile.engine.asm.ClassReaderAnalysisEngine.analyze(ClassReaderAnalysisEngine.java:34)
[spotbugs] At edu.umd.cs.findbugs.classfile.impl.AnalysisCache.getClassAnalysis(AnalysisCache.java:261)
[spotbugs] At edu.umd.cs.findbugs.classfile.engine.ClassInfoAnalysisEngine.analyze(ClassInfoAnalysisEngine.java:75)
[spotbugs] At edu.umd.cs.findbugs.classfile.engine.ClassInfoAnalysisEngine.analyze(ClassInfoAnalysisEngine.java:38)
[spotbugs] At edu.umd.cs.findbugs.classfile.impl.AnalysisCache.getClassAnalysis(AnalysisCache.java:261)
[spotbugs] At edu.umd.cs.findbugs.ba.XFactory.getXClass(XFactory.java:693)
[spotbugs] At edu.umd.cs.findbugs.ba.AnalysisContext.setAppClassList(AnalysisContext.java:975)
[spotbugs] At edu.umd.cs.findbugs.FindBugs2.setAppClassList(FindBugs2.java:909)
[spotbugs] At edu.umd.cs.findbugs.FindBugs2.execute(FindBugs2.java:252)
[spotbugs] At edu.umd.cs.findbugs.FindBugs.runMain(FindBugs.java:395)
[spotbugs] At edu.umd.cs.findbugs.FindBugs2.main(FindBugs2.java:1231)
[spotbugs] Couldn't get class info for java/util/zip/Deflater
[spotbugs] java.lang.IllegalArgumentException: Unsupported class file major version 69
[spotbugs] At org.objectweb.asm.ClassReader.<init>(ClassReader.java:200)
[spotbugs] At org.objectweb.asm.ClassReader.<init>(ClassReader.java:180)
[spotbugs] At org.objectweb.asm.ClassReader.<init>(ClassReader.java:166)
[spotbugs] At edu.umd.cs.findbugs.asm.FBClassReader.<init>(FBClassReader.java:35)
[spotbugs] At edu.umd.cs.findbugs.classfile.engine.asm.ClassReaderAnalysisEngine.analyze(ClassReaderAnalysisEngine.java:48)
[spotbugs] At edu.umd.cs.findbugs.classfile.engine.asm.ClassReaderAnalysisEngine.analyze(ClassReaderAnalysisEngine.java:34)
[spotbugs] At edu.umd.cs.findbugs.classfile.impl.AnalysisCache.getClassAnalysis(AnalysisCache.java:261)
[spotbugs] At edu.umd.cs.findbugs.classfile.engine.ClassInfoAnalysisEngine.analyze(ClassInfoAnalysisEngine.java:75)
[spotbugs] At edu.umd.cs.findbugs.classfile.engine.ClassInfoAnalysisEngine.analyze(ClassInfoAnalysisEngine.java:38)
[spotbugs] At edu.umd.cs.findbugs.classfile.impl.AnalysisCache.getClassAnalysis(AnalysisCache.java:261)
[spotbugs] At edu.umd.cs.findbugs.ba.XFactory.getXClass(XFactory.java:693)
[spotbugs] At edu.umd.cs.findbugs.ba.AnalysisContext.setAppClassList(AnalysisContext.java:975)
[spotbugs] At edu.umd.cs.findbugs.FindBugs2.setAppClassList(FindBugs2.java:909)
[spotbugs] At edu.umd.cs.findbugs.FindBugs2.execute(FindBugs2.java:252)
[spotbugs] At edu.umd.cs.findbugs.FindBugs.runMain(FindBugs.java:395)
[spotbugs] At edu.umd.cs.findbugs.FindBugs2.main(FindBugs2.java:1231)
[spotbugs] Couldn't get class info for java/lang/AssertionError
[spotbugs] java.lang.IllegalArgumentException: Unsupported class file major version 69
[spotbugs] At org.objectweb.asm.ClassReader.<init>(ClassReader.java:200)
[spotbugs] At org.objectweb.asm.ClassReader.<init>(ClassReader.java:180)
[spotbugs] At org.objectweb.asm.ClassReader.<init>(ClassReader.java:166)
[spotbugs] At edu.umd.cs.findbugs.asm.FBClassReader.<init>(FBClassReader.java:35)
[spotbugs] At edu.umd.cs.findbugs.classfile.engine.asm.ClassReaderAnalysisEngine.analyze(ClassReaderAnalysisEngine.java:48)
[spotbugs] At edu.umd.cs.findbugs.classfile.engine.asm.ClassReaderAnalysisEngine.analyze(ClassReaderAnalysisEngine.java:34)
[spotbugs] At edu.umd.cs.findbugs.classfile.impl.AnalysisCache.getClassAnalysis(AnalysisCache.java:261)
[spotbugs] At edu.umd.cs.findbugs.classfile.engine.ClassInfoAnalysisEngine.analyze(ClassInfoAnalysisEngine.java:75)
[spotbugs] At edu.umd.cs.findbugs.classfile.engine.ClassInfoAnalysisEngine.analyze(ClassInfoAnalysisEngine.java:38)
[spotbugs] At edu.umd.cs.findbugs.classfile.impl.AnalysisCache.getClassAnalysis(AnalysisCache.java:261)
[spotbugs] At edu.umd.cs.findbugs.ba.XFactory.getXClass(XFactory.java:693)
[spotbugs] At edu.umd.cs.findbugs.ba.AnalysisContext.setAppClassList(AnalysisContext.java:975)
[spotbugs] At edu.umd.cs.findbugs.FindBugs2.setAppClassList(FindBugs2.java:909)
[spotbugs] At edu.umd.cs.findbugs.FindBugs2.execute(FindBugs2.java:252)
[spotbugs] At edu.umd.cs.findbugs.FindBugs.runMain(FindBugs.java:395)
[spotbugs] At edu.umd.cs.findbugs.FindBugs2.main(FindBugs2.java:1231)
[spotbugs] Couldn't get class info for java/util/Set
[spotbugs] java.lang.IllegalArgumentException: Unsupported class file major version 69
[spotbugs] At org.objectweb.asm.ClassReader.<init>(ClassReader.java:200)
[spotbugs] At org.objectweb.asm.ClassReader.<init>(ClassReader.java:180)
[spotbugs] At org.objectweb.asm.ClassReader.<init>(ClassReader.java:166)
[spotbugs] At edu.umd.cs.findbugs.asm.FBClassReader.<init>(FBClassReader.java:35)
[spotbugs] At edu.umd.cs.findbugs.classfile.engine.asm.ClassReaderAnalysisEngine.analyze(ClassReaderAnalysisEngine.java:48)
[spotbugs] At edu.umd.cs.findbugs.classfile.engine.asm.ClassReaderAnalysisEngine.analyze(ClassReaderAnalysisEngine.java:34)
[spotbugs] At edu.umd.cs.findbugs.classfile.impl.AnalysisCache.getClassAnalysis(AnalysisCache.java:261)
[spotbugs] At edu.umd.cs.findbugs.classfile.engine.ClassInfoAnalysisEngine.analyze(ClassInfoAnalysisEngine.java:75)
[spotbugs] At edu.umd.cs.findbugs.classfile.engine.ClassInfoAnalysisEngine.analyze(ClassInfoAnalysisEngine.java:38)
[spotbugs] At edu.umd.cs.findbugs.classfile.impl.AnalysisCache.getClassAnalysis(AnalysisCache.java:261)
[spotbugs] At edu.umd.cs.findbugs.ba.XFactory.getXClass(XFactory.java:693)
[spotbugs] At edu.umd.cs.findbugs.ba.AnalysisContext.setAppClassList(AnalysisContext.java:975)
[spotbugs] At edu.umd.cs.findbugs.FindBugs2.setAppClassList(FindBugs2.java:909)
[spotbugs] At edu.umd.cs.findbugs.FindBugs2.execute(FindBugs2.java:252)
[spotbugs] At edu.umd.cs.findbugs.FindBugs.runMain(FindBugs.java:395)
[spotbugs] At edu.umd.cs.findbugs.FindBugs2.main(FindBugs2.java:1231)
[spotbugs] Couldn't get class info for java/io/FilterInputStream
[spotbugs] java.lang.IllegalArgumentException: Unsupported class file major version 69
[spotbugs] At org.objectweb.asm.ClassReader.<init>(ClassReader.java:200)
[spotbugs] At org.objectweb.asm.ClassReader.<init>(ClassReader.java:180)
[spotbugs] At org.objectweb.asm.ClassReader.<init>(ClassReader.java:166)
[spotbugs] At edu.umd.cs.findbugs.asm.FBClassReader.<init>(FBClassReader.java:35)
[spotbugs] At edu.umd.cs.findbugs.classfile.engine.asm.ClassReaderAnalysisEngine.analyze(ClassReaderAnalysisEngine.java:48)
[spotbugs] At edu.umd.cs.findbugs.classfile.engine.asm.ClassReaderAnalysisEngine.analyze(ClassReaderAnalysisEngine.java:34)
[spotbugs] At edu.umd.cs.findbugs.classfile.impl.AnalysisCache.getClassAnalysis(AnalysisCache.java:261)
[spotbugs] At edu.umd.cs.findbugs.classfile.engine.ClassInfoAnalysisEngine.analyze(ClassInfoAnalysisEngine.java:75)
[spotbugs] At edu.umd.cs.findbugs.classfile.engine.ClassInfoAnalysisEngine.analyze(ClassInfoAnalysisEngine.java:38)
[spotbugs] At edu.umd.cs.findbugs.classfile.impl.AnalysisCache.getClassAnalysis(AnalysisCache.java:261)
[spotbugs] At edu.umd.cs.findbugs.FindBugs2.buildReferencedClassSet(FindBugs2.java:806)
[spotbugs] At edu.umd.cs.findbugs.FindBugs2.execute(FindBugs2.java:249)
[spotbugs] At edu.umd.cs.findbugs.FindBugs.runMain(FindBugs.java:395)
[spotbugs] At edu.umd.cs.findbugs.FindBugs2.main(FindBugs2.java:1231)
[spotbugs] Couldn't get class info for java/awt/AlphaComposite
[spotbugs] java.lang.IllegalArgumentException: Unsupported class file major version 69
[spotbugs] At org.objectweb.asm.ClassReader.<init>(ClassReader.java:200)
[spotbugs] At org.objectweb.asm.ClassReader.<init>(ClassReader.java:180)
[spotbugs] At org.objectweb.asm.ClassReader.<init>(ClassReader.java:166)
[spotbugs] At edu.umd.cs.findbugs.asm.FBClassReader.<init>(FBClassReader.java:35)
[spotbugs] At edu.umd.cs.findbugs.classfile.engine.asm.ClassReaderAnalysisEngine.analyze(ClassReaderAnalysisEngine.java:48)
[spotbugs] At edu.umd.cs.findbugs.classfile.engine.asm.ClassReaderAnalysisEngine.analyze(ClassReaderAnalysisEngine.java:34)
[spotbugs] At edu.umd.cs.findbugs.classfile.impl.AnalysisCache.getClassAnalysis(AnalysisCache.java:261)
[spotbugs] At edu.umd.cs.findbugs.classfile.engine.ClassInfoAnalysisEngine.analyze(ClassInfoAnalysisEngine.java:75)
[spotbugs] At edu.umd.cs.findbugs.classfile.engine.ClassInfoAnalysisEngine.analyze(ClassInfoAnalysisEngine.java:38)
[spotbugs] At edu.umd.cs.findbugs.classfile.impl.AnalysisCache.getClassAnalysis(AnalysisCache.java:261)
[spotbugs] At edu.umd.cs.findbugs.ba.XFactory.getXClass(XFactory.java:693)
[spotbugs] At edu.umd.cs.findbugs.ba.AnalysisContext.setAppClassList(AnalysisContext.java:975)
[spotbugs] At edu.umd.cs.findbugs.FindBugs2.setAppClassList(FindBugs2.java:909)
[spotbugs] At edu.umd.cs.findbugs.FindBugs2.execute(FindBugs2.java:252)
[spotbugs] At edu.umd.cs.findbugs.FindBugs.runMain(FindBugs.java:395)
[spotbugs] At edu.umd.cs.findbugs.FindBugs2.main(FindBugs2.java:1231)
[spotbugs] Couldn't get class info for java/awt/geom/Arc2D
[spotbugs] java.lang.IllegalArgumentException: Unsupported class file major version 69
[spotbugs] At org.objectweb.asm.ClassReader.<init>(ClassReader.java:200)
[spotbugs] At org.objectweb.asm.ClassReader.<init>(ClassReader.java:180)
[spotbugs] At org.objectweb.asm.ClassReader.<init>(ClassReader.java:166)
[spotbugs] At edu.umd.cs.findbugs.asm.FBClassReader.<init>(FBClassReader.java:35)
[spotbugs] At edu.umd.cs.findbugs.classfile.engine.asm.ClassReaderAnalysisEngine.analyze(ClassReaderAnalysisEngine.java:48)
[spotbugs] At edu.umd.cs.findbugs.classfile.engine.asm.ClassReaderAnalysisEngine.analyze(ClassReaderAnalysisEngine.java:34)
[spotbugs] At edu.umd.cs.findbugs.classfile.impl.AnalysisCache.getClassAnalysis(AnalysisCache.java:261)
[spotbugs] At edu.umd.cs.findbugs.classfile.engine.ClassInfoAnalysisEngine.analyze(ClassInfoAnalysisEngine.java:75)
[spotbugs] At edu.umd.cs.findbugs.classfile.engine.ClassInfoAnalysisEngine.analyze(ClassInfoAnalysisEngine.java:38)
[spotbugs] At edu.umd.cs.findbugs.classfile.impl.AnalysisCache.getClassAnalysis(AnalysisCache.java:261)
[spotbugs] At edu.umd.cs.findbugs.ba.XFactory.getXClass(XFactory.java:693)
[spotbugs] At edu.umd.cs.findbugs.ba.AnalysisContext.setAppClassList(AnalysisContext.java:975)
[spotbugs] At edu.umd.cs.findbugs.FindBugs2.setAppClassList(FindBugs2.java:909)
[spotbugs] At edu.umd.cs.findbugs.FindBugs2.execute(FindBugs2.java:252)
[spotbugs] At edu.umd.cs.findbugs.FindBugs.runMain(FindBugs.java:395)
[spotbugs] At edu.umd.cs.findbugs.FindBugs2.main(FindBugs2.java:1231)
[spotbugs] Couldn't get class info for java/security/DigestException
[spotbugs] java.lang.IllegalArgumentException: Unsupported class file major version 69
[spotbugs] At org.objectweb.asm.ClassReader.<init>(ClassReader.java:200)
[spotbugs] At org.objectweb.asm.ClassReader.<init>(ClassReader.java:180)
[spotbugs] At org.objectweb.asm.ClassReader.<init>(ClassReader.java:166)
[spotbugs] At edu.umd.cs.findbugs.asm.FBClassReader.<init>(FBClassReader.java:35)
[spotbugs] At edu.umd.cs.findbugs.classfile.engine.asm.ClassReaderAnalysisEngine.analyze(ClassReaderAnalysisEngine.java:48)
[spotbugs] At edu.umd.cs.findbugs.classfile.engine.asm.ClassReaderAnalysisEngine.analyze(ClassReaderAnalysisEngine.java:34)
[spotbugs] At edu.umd.cs.findbugs.classfile.impl.AnalysisCache.getClassAnalysis(AnalysisCache.java:261)
[spotbugs] At edu.umd.cs.findbugs.classfile.engine.ClassInfoAnalysisEngine.analyze(ClassInfoAnalysisEngine.java:75)
[spotbugs] At edu.umd.cs.findbugs.classfile.engine.ClassInfoAnalysisEngine.analyze(ClassInfoAnalysisEngine.java:38)
[spotbugs] At edu.umd.cs.findbugs.classfile.impl.AnalysisCache.getClassAnalysis(AnalysisCache.java:261)
[spotbugs] At edu.umd.cs.findbugs.ba.XFactory.getXClass(XFactory.java:693)
[spotbugs] At edu.umd.cs.findbugs.ba.AnalysisContext.setAppClassList(AnalysisContext.java:975)
[spotbugs] At edu.umd.cs.findbugs.FindBugs2.setAppClassList(FindBugs2.java:909)
[spotbugs] At edu.umd.cs.findbugs.FindBugs2.execute(FindBugs2.java:252)
[spotbugs] At edu.umd.cs.findbugs.FindBugs.runMain(FindBugs.java:395)
[spotbugs] At edu.umd.cs.findbugs.FindBugs2.main(FindBugs2.java:1231)
[spotbugs]
[spotbugs] java.lang.IllegalArgumentException: Unsupported class file major version 69
[spotbugs] at org.objectweb.asm.ClassReader.<init>(ClassReader.java:200)
[spotbugs] at org.objectweb.asm.ClassReader.<init>(ClassReader.java:180)
[spotbugs] at org.objectweb.asm.ClassReader.<init>(ClassReader.java:166)
[spotbugs] at edu.umd.cs.findbugs.asm.FBClassReader.<init>(FBClassReader.java:35)
[spotbugs] at edu.umd.cs.findbugs.classfile.engine.asm.ClassReaderAnalysisEngine.analyze(ClassReaderAnalysisEngine.java:48)
[spotbugs] at edu.umd.cs.findbugs.classfile.engine.asm.ClassReaderAnalysisEngine.analyze(ClassReaderAnalysisEngine.java:34)
[spotbugs] at edu.umd.cs.findbugs.classfile.impl.AnalysisCache.getClassAnalysis(AnalysisCache.java:261)
[spotbugs] at edu.umd.cs.findbugs.classfile.engine.ClassInfoAnalysisEngine.analyze(ClassInfoAnalysisEngine.java:75)
[spotbugs] at edu.umd.cs.findbugs.classfile.engine.ClassInfoAnalysisEngine.analyze(ClassInfoAnalysisEngine.java:38)
[spotbugs] at edu.umd.cs.findbugs.classfile.impl.AnalysisCache.getClassAnalysis(AnalysisCache.java:261)
[spotbugs] at edu.umd.cs.findbugs.ba.XFactory.getXClass(XFactory.java:693)
[spotbugs] at edu.umd.cs.findbugs.ba.AnalysisContext.setAppClassList(AnalysisContext.java:975)
[spotbugs] at edu.umd.cs.findbugs.FindBugs2.setAppClassList(FindBugs2.java:909)
[spotbugs] at edu.umd.cs.findbugs.FindBugs2.execute(FindBugs2.java:252)
[spotbugs] at edu.umd.cs.findbugs.FindBugs.runMain(FindBugs.java:395)
[spotbugs] at edu.umd.cs.findbugs.FindBugs2.main(FindBugs2.java:1231)
[spotbugs] Java Result: 4
BUILD FAILED
<https://ci-builds.apache.org/job/POI/job/POI-DSL-1.25/ws/build.xml>:2657: Execution of SpotBugs failed.
Total time: 28 minutes 32 seconds
Build step 'Invoke Ant' marked build as failure
ERROR: Not all environment variables could be successfully injected. Check for similarly-named environment variables.
Archiving artifacts
ERROR: Not all environment variables could be successfully injected. Check for similarly-named environment variables.
Recording test results
ERROR: Not all environment variables could be successfully injected. Check for similarly-named environment variables.
[Checks API] No suitable checks publisher found.
ERROR: Not all environment variables could be successfully injected. Check for similarly-named environment variables.
---------------------------------------------------------------------
To unsubscribe, e-mail: dev-unsubscribe@poi.apache.org
For additional commands, e-mail: dev-help@poi.apache.org