You are viewing a plain text version of this content. The canonical link for it is here.
Posted to builds@beam.apache.org by Apache Jenkins Server <je...@builds.apache.org> on 2022/10/16 01:18:52 UTC
Build failed in Jenkins: beam_PerformanceTests_InfluxDbIO_IT #2445
See <https://ci-beam.apache.org/job/beam_PerformanceTests_InfluxDbIO_IT/2445/display/redirect>
Changes:
------------------------------------------
[...truncated 209.35 KB...]
at okio.SocketAsyncTimeout.newTimeoutException(JvmOkio.kt:143)
at okio.AsyncTimeout.access$newTimeoutException(AsyncTimeout.kt:162)
at okio.AsyncTimeout$source$1.read(AsyncTimeout.kt:340)
at okio.RealBufferedSource.indexOf(RealBufferedSource.kt:449)
at okio.RealBufferedSource.readUtf8LineStrict(RealBufferedSource.kt:333)
at okhttp3.internal.http1.HeadersReader.readLine(HeadersReader.kt:29)
at okhttp3.internal.http1.Http1ExchangeCodec.readResponseHeaders(Http1ExchangeCodec.kt:178)
at okhttp3.internal.connection.Exchange.readResponseHeaders(Exchange.kt:106)
at okhttp3.internal.http.CallServerInterceptor.intercept(CallServerInterceptor.kt:79)
at okhttp3.internal.http.RealInterceptorChain.proceed(RealInterceptorChain.kt:100)
at okhttp3.internal.connection.ConnectInterceptor.intercept(ConnectInterceptor.kt:34)
at okhttp3.internal.http.RealInterceptorChain.proceed(RealInterceptorChain.kt:100)
at okhttp3.internal.cache.CacheInterceptor.intercept(CacheInterceptor.kt:82)
at okhttp3.internal.http.RealInterceptorChain.proceed(RealInterceptorChain.kt:100)
at okhttp3.internal.http.BridgeInterceptor.intercept(BridgeInterceptor.kt:83)
at okhttp3.internal.http.RealInterceptorChain.proceed(RealInterceptorChain.kt:100)
at okhttp3.internal.http.RetryAndFollowUpInterceptor.intercept(RetryAndFollowUpInterceptor.kt:76)
at okhttp3.internal.http.RealInterceptorChain.proceed(RealInterceptorChain.kt:100)
at org.influxdb.impl.BasicAuthInterceptor.intercept(BasicAuthInterceptor.java:22)
at okhttp3.internal.http.RealInterceptorChain.proceed(RealInterceptorChain.kt:100)
at org.influxdb.impl.GzipRequestInterceptor.intercept(GzipRequestInterceptor.java:42)
at okhttp3.internal.http.RealInterceptorChain.proceed(RealInterceptorChain.kt:100)
at okhttp3.logging.HttpLoggingInterceptor.intercept(HttpLoggingInterceptor.kt:152)
at okhttp3.internal.http.RealInterceptorChain.proceed(RealInterceptorChain.kt:100)
at okhttp3.internal.connection.RealCall.getResponseWithInterceptorChain$okhttp(RealCall.kt:197)
at okhttp3.internal.connection.RealCall.execute(RealCall.kt:148)
at retrofit2.OkHttpCall.execute(OkHttpCall.java:190)
at org.influxdb.impl.InfluxDBImpl.execute(InfluxDBImpl.java:824)
at org.influxdb.impl.InfluxDBImpl.write(InfluxDBImpl.java:485)
at org.influxdb.impl.InfluxDBImpl.write(InfluxDBImpl.java:509)
at org.influxdb.impl.InfluxDBImpl.write(InfluxDBImpl.java:502)
at org.influxdb.impl.InfluxDBImpl.write(InfluxDBImpl.java:424)
at org.apache.beam.sdk.io.influxdb.InfluxDbIO$Write$InfluxWriterFn.flush(InfluxDbIO.java:558)
at org.apache.beam.sdk.io.influxdb.InfluxDbIO$Write$InfluxWriterFn.finishBundle(InfluxDbIO.java:541)
at org.apache.beam.sdk.io.influxdb.InfluxDbIO$Write$InfluxWriterFn$DoFnInvoker.invokeFinishBundle(Unknown Source)
at org.apache.beam.repackaged.direct_java.runners.core.SimpleDoFnRunner.finishBundle(SimpleDoFnRunner.java:221)
at org.apache.beam.repackaged.direct_java.runners.core.SimplePushbackSideInputDoFnRunner.finishBundle(SimplePushbackSideInputDoFnRunner.java:130)
at org.apache.beam.runners.direct.ParDoEvaluator.finishBundle(ParDoEvaluator.java:269)
at org.apache.beam.runners.direct.DoFnLifecycleManagerRemovingTransformEvaluator.finishBundle(DoFnLifecycleManagerRemovingTransformEvaluator.java:73)
at org.apache.beam.runners.direct.DirectTransformExecutor.finishBundle(DirectTransformExecutor.java:193)
at org.apache.beam.runners.direct.DirectTransformExecutor.run(DirectTransformExecutor.java:131)
at java.util.concurrent.Executors$RunnableAdapter.call(Executors.java:511)
at java.util.concurrent.FutureTask.run(FutureTask.java:266)
at java.util.concurrent.ThreadPoolExecutor.runWorker(ThreadPoolExecutor.java:1149)
at java.util.concurrent.ThreadPoolExecutor$Worker.run(ThreadPoolExecutor.java:624)
at java.lang.Thread.run(Thread.java:750)
Caused by:
java.net.SocketException: Socket closed
at java.net.SocketInputStream.read(SocketInputStream.java:204)
at java.net.SocketInputStream.read(SocketInputStream.java:141)
at okio.InputStreamSource.read(JvmOkio.kt:90)
at okio.AsyncTimeout$source$1.read(AsyncTimeout.kt:129)
... 43 more
org.apache.beam.sdk.io.influxdb.InfluxDbIOIT > testWriteAndRead FAILED
org.apache.beam.sdk.Pipeline$PipelineExecutionException: org.influxdb.InfluxDBIOException: java.net.SocketTimeoutException: timeout
at org.apache.beam.runners.direct.DirectRunner$DirectPipelineResult.waitUntilFinish(DirectRunner.java:374)
at org.apache.beam.runners.direct.DirectRunner$DirectPipelineResult.waitUntilFinish(DirectRunner.java:342)
at org.apache.beam.runners.direct.DirectRunner.run(DirectRunner.java:218)
at org.apache.beam.runners.direct.DirectRunner.run(DirectRunner.java:67)
at org.apache.beam.sdk.Pipeline.run(Pipeline.java:323)
at org.apache.beam.sdk.testing.TestPipeline.run(TestPipeline.java:399)
at org.apache.beam.sdk.testing.TestPipeline.run(TestPipeline.java:335)
at org.apache.beam.sdk.io.influxdb.InfluxDbIOIT.testWriteAndRead(InfluxDbIOIT.java:148)
Caused by:
org.influxdb.InfluxDBIOException: java.net.SocketTimeoutException: timeout
at org.influxdb.impl.InfluxDBImpl.execute(InfluxDBImpl.java:836)
at org.influxdb.impl.InfluxDBImpl.write(InfluxDBImpl.java:485)
at org.influxdb.impl.InfluxDBImpl.write(InfluxDBImpl.java:509)
at org.influxdb.impl.InfluxDBImpl.write(InfluxDBImpl.java:502)
at org.influxdb.impl.InfluxDBImpl.write(InfluxDBImpl.java:424)
at org.apache.beam.sdk.io.influxdb.InfluxDbIO$Write$InfluxWriterFn.flush(InfluxDbIO.java:558)
at org.apache.beam.sdk.io.influxdb.InfluxDbIO$Write$InfluxWriterFn.finishBundle(InfluxDbIO.java:541)
Caused by:
java.net.SocketTimeoutException: timeout
at okio.SocketAsyncTimeout.newTimeoutException(JvmOkio.kt:143)
at okio.AsyncTimeout.access$newTimeoutException(AsyncTimeout.kt:162)
at okio.AsyncTimeout$source$1.read(AsyncTimeout.kt:340)
at okio.RealBufferedSource.indexOf(RealBufferedSource.kt:449)
at okio.RealBufferedSource.readUtf8LineStrict(RealBufferedSource.kt:333)
at okhttp3.internal.http1.HeadersReader.readLine(HeadersReader.kt:29)
at okhttp3.internal.http1.Http1ExchangeCodec.readResponseHeaders(Http1ExchangeCodec.kt:178)
at okhttp3.internal.connection.Exchange.readResponseHeaders(Exchange.kt:106)
at okhttp3.internal.http.CallServerInterceptor.intercept(CallServerInterceptor.kt:79)
at okhttp3.internal.http.RealInterceptorChain.proceed(RealInterceptorChain.kt:100)
at okhttp3.internal.connection.ConnectInterceptor.intercept(ConnectInterceptor.kt:34)
at okhttp3.internal.http.RealInterceptorChain.proceed(RealInterceptorChain.kt:100)
at okhttp3.internal.cache.CacheInterceptor.intercept(CacheInterceptor.kt:82)
at okhttp3.internal.http.RealInterceptorChain.proceed(RealInterceptorChain.kt:100)
at okhttp3.internal.http.BridgeInterceptor.intercept(BridgeInterceptor.kt:83)
at okhttp3.internal.http.RealInterceptorChain.proceed(RealInterceptorChain.kt:100)
at okhttp3.internal.http.RetryAndFollowUpInterceptor.intercept(RetryAndFollowUpInterceptor.kt:76)
at okhttp3.internal.http.RealInterceptorChain.proceed(RealInterceptorChain.kt:100)
at org.influxdb.impl.BasicAuthInterceptor.intercept(BasicAuthInterceptor.java:22)
at okhttp3.internal.http.RealInterceptorChain.proceed(RealInterceptorChain.kt:100)
at org.influxdb.impl.GzipRequestInterceptor.intercept(GzipRequestInterceptor.java:42)
at okhttp3.internal.http.RealInterceptorChain.proceed(RealInterceptorChain.kt:100)
at okhttp3.logging.HttpLoggingInterceptor.intercept(HttpLoggingInterceptor.kt:152)
at okhttp3.internal.http.RealInterceptorChain.proceed(RealInterceptorChain.kt:100)
at okhttp3.internal.connection.RealCall.getResponseWithInterceptorChain$okhttp(RealCall.kt:197)
at okhttp3.internal.connection.RealCall.execute(RealCall.kt:148)
at retrofit2.OkHttpCall.execute(OkHttpCall.java:190)
at org.influxdb.impl.InfluxDBImpl.execute(InfluxDBImpl.java:824)
at org.influxdb.impl.InfluxDBImpl.write(InfluxDBImpl.java:485)
at org.influxdb.impl.InfluxDBImpl.write(InfluxDBImpl.java:509)
at org.influxdb.impl.InfluxDBImpl.write(InfluxDBImpl.java:502)
at org.influxdb.impl.InfluxDBImpl.write(InfluxDBImpl.java:424)
at org.apache.beam.sdk.io.influxdb.InfluxDbIO$Write$InfluxWriterFn.flush(InfluxDbIO.java:558)
at org.apache.beam.sdk.io.influxdb.InfluxDbIO$Write$InfluxWriterFn.finishBundle(InfluxDbIO.java:541)
at org.apache.beam.sdk.io.influxdb.InfluxDbIO$Write$InfluxWriterFn$DoFnInvoker.invokeFinishBundle(Unknown Source)
at org.apache.beam.repackaged.direct_java.runners.core.SimpleDoFnRunner.finishBundle(SimpleDoFnRunner.java:221)
at org.apache.beam.repackaged.direct_java.runners.core.SimplePushbackSideInputDoFnRunner.finishBundle(SimplePushbackSideInputDoFnRunner.java:130)
at org.apache.beam.runners.direct.ParDoEvaluator.finishBundle(ParDoEvaluator.java:269)
at org.apache.beam.runners.direct.DoFnLifecycleManagerRemovingTransformEvaluator.finishBundle(DoFnLifecycleManagerRemovingTransformEvaluator.java:73)
at org.apache.beam.runners.direct.DirectTransformExecutor.finishBundle(DirectTransformExecutor.java:193)
at org.apache.beam.runners.direct.DirectTransformExecutor.run(DirectTransformExecutor.java:131)
at java.util.concurrent.Executors$RunnableAdapter.call(Executors.java:511)
at java.util.concurrent.FutureTask.run(FutureTask.java:266)
at java.util.concurrent.ThreadPoolExecutor.runWorker(ThreadPoolExecutor.java:1149)
at java.util.concurrent.ThreadPoolExecutor$Worker.run(ThreadPoolExecutor.java:624)
at java.lang.Thread.run(Thread.java:750)
Caused by:
java.net.SocketException: Socket closed
at java.net.SocketInputStream.read(SocketInputStream.java:204)
at java.net.SocketInputStream.read(SocketInputStream.java:141)
at okio.InputStreamSource.read(JvmOkio.kt:90)
at okio.AsyncTimeout$source$1.read(AsyncTimeout.kt:129)
... 43 more
Gradle Test Executor 1 finished executing tests.
> Task :sdks:java:io:influxdb:integrationTest
org.apache.beam.sdk.io.influxdb.InfluxDbIOIT > testWriteAndReadWithSingleMetric FAILED
org.apache.beam.sdk.Pipeline$PipelineExecutionException: org.influxdb.InfluxDBIOException: java.net.SocketTimeoutException: timeout
at org.apache.beam.runners.direct.DirectRunner$DirectPipelineResult.waitUntilFinish(DirectRunner.java:374)
at org.apache.beam.runners.direct.DirectRunner$DirectPipelineResult.waitUntilFinish(DirectRunner.java:342)
at org.apache.beam.runners.direct.DirectRunner.run(DirectRunner.java:218)
at org.apache.beam.runners.direct.DirectRunner.run(DirectRunner.java:67)
at org.apache.beam.sdk.Pipeline.run(Pipeline.java:323)
at org.apache.beam.sdk.testing.TestPipeline.run(TestPipeline.java:399)
at org.apache.beam.sdk.testing.TestPipeline.run(TestPipeline.java:335)
at org.apache.beam.sdk.io.influxdb.InfluxDbIOIT.testWriteAndReadWithSingleMetric(InfluxDbIOIT.java:189)
Caused by:
org.influxdb.InfluxDBIOException: java.net.SocketTimeoutException: timeout
at org.influxdb.impl.InfluxDBImpl.execute(InfluxDBImpl.java:836)
at org.influxdb.impl.InfluxDBImpl.write(InfluxDBImpl.java:485)
at org.influxdb.impl.InfluxDBImpl.write(InfluxDBImpl.java:509)
at org.influxdb.impl.InfluxDBImpl.write(InfluxDBImpl.java:502)
at org.influxdb.impl.InfluxDBImpl.write(InfluxDBImpl.java:424)
at org.apache.beam.sdk.io.influxdb.InfluxDbIO$Write$InfluxWriterFn.flush(InfluxDbIO.java:558)
at org.apache.beam.sdk.io.influxdb.InfluxDbIO$Write$InfluxWriterFn.finishBundle(InfluxDbIO.java:541)
Caused by:
java.net.SocketTimeoutException: timeout
at okio.SocketAsyncTimeout.newTimeoutException(JvmOkio.kt:143)
at okio.AsyncTimeout.access$newTimeoutException(AsyncTimeout.kt:162)
at okio.AsyncTimeout$source$1.read(AsyncTimeout.kt:340)
at okio.RealBufferedSource.indexOf(RealBufferedSource.kt:449)
at okio.RealBufferedSource.readUtf8LineStrict(RealBufferedSource.kt:333)
at okhttp3.internal.http1.HeadersReader.readLine(HeadersReader.kt:29)
at okhttp3.internal.http1.Http1ExchangeCodec.readResponseHeaders(Http1ExchangeCodec.kt:178)
at okhttp3.internal.connection.Exchange.readResponseHeaders(Exchange.kt:106)
at okhttp3.internal.http.CallServerInterceptor.intercept(CallServerInterceptor.kt:79)
at okhttp3.internal.http.RealInterceptorChain.proceed(RealInterceptorChain.kt:100)
at okhttp3.internal.connection.ConnectInterceptor.intercept(ConnectInterceptor.kt:34)
at okhttp3.internal.http.RealInterceptorChain.proceed(RealInterceptorChain.kt:100)
at okhttp3.internal.cache.CacheInterceptor.intercept(CacheInterceptor.kt:82)
at okhttp3.internal.http.RealInterceptorChain.proceed(RealInterceptorChain.kt:100)
at okhttp3.internal.http.BridgeInterceptor.intercept(BridgeInterceptor.kt:83)
at okhttp3.internal.http.RealInterceptorChain.proceed(RealInterceptorChain.kt:100)
at okhttp3.internal.http.RetryAndFollowUpInterceptor.intercept(RetryAndFollowUpInterceptor.kt:76)
at okhttp3.internal.http.RealInterceptorChain.proceed(RealInterceptorChain.kt:100)
at org.influxdb.impl.BasicAuthInterceptor.intercept(BasicAuthInterceptor.java:22)
at okhttp3.internal.http.RealInterceptorChain.proceed(RealInterceptorChain.kt:100)
at org.influxdb.impl.GzipRequestInterceptor.intercept(GzipRequestInterceptor.java:42)
at okhttp3.internal.http.RealInterceptorChain.proceed(RealInterceptorChain.kt:100)
at okhttp3.logging.HttpLoggingInterceptor.intercept(HttpLoggingInterceptor.kt:152)
at okhttp3.internal.http.RealInterceptorChain.proceed(RealInterceptorChain.kt:100)
at okhttp3.internal.connection.RealCall.getResponseWithInterceptorChain$okhttp(RealCall.kt:197)
at okhttp3.internal.connection.RealCall.execute(RealCall.kt:148)
at retrofit2.OkHttpCall.execute(OkHttpCall.java:190)
at org.influxdb.impl.InfluxDBImpl.execute(InfluxDBImpl.java:824)
at org.influxdb.impl.InfluxDBImpl.write(InfluxDBImpl.java:485)
at org.influxdb.impl.InfluxDBImpl.write(InfluxDBImpl.java:509)
at org.influxdb.impl.InfluxDBImpl.write(InfluxDBImpl.java:502)
at org.influxdb.impl.InfluxDBImpl.write(InfluxDBImpl.java:424)
at org.apache.beam.sdk.io.influxdb.InfluxDbIO$Write$InfluxWriterFn.flush(InfluxDbIO.java:558)
at org.apache.beam.sdk.io.influxdb.InfluxDbIO$Write$InfluxWriterFn.finishBundle(InfluxDbIO.java:541)
at org.apache.beam.sdk.io.influxdb.InfluxDbIO$Write$InfluxWriterFn$DoFnInvoker.invokeFinishBundle(Unknown Source)
at org.apache.beam.repackaged.direct_java.runners.core.SimpleDoFnRunner.finishBundle(SimpleDoFnRunner.java:221)
at org.apache.beam.repackaged.direct_java.runners.core.SimplePushbackSideInputDoFnRunner.finishBundle(SimplePushbackSideInputDoFnRunner.java:130)
at org.apache.beam.runners.direct.ParDoEvaluator.finishBundle(ParDoEvaluator.java:269)
at org.apache.beam.runners.direct.DoFnLifecycleManagerRemovingTransformEvaluator.finishBundle(DoFnLifecycleManagerRemovingTransformEvaluator.java:73)
at org.apache.beam.runners.direct.DirectTransformExecutor.finishBundle(DirectTransformExecutor.java:193)
at org.apache.beam.runners.direct.DirectTransformExecutor.run(DirectTransformExecutor.java:131)
at java.util.concurrent.Executors$RunnableAdapter.call(Executors.java:511)
at java.util.concurrent.FutureTask.run(FutureTask.java:266)
at java.util.concurrent.ThreadPoolExecutor.runWorker(ThreadPoolExecutor.java:1149)
at java.util.concurrent.ThreadPoolExecutor$Worker.run(ThreadPoolExecutor.java:624)
at java.lang.Thread.run(Thread.java:750)
Caused by:
java.net.SocketException: Socket closed
at java.net.SocketInputStream.read(SocketInputStream.java:204)
at java.net.SocketInputStream.read(SocketInputStream.java:141)
at okio.InputStreamSource.read(JvmOkio.kt:90)
at okio.AsyncTimeout$source$1.read(AsyncTimeout.kt:129)
... 43 more
6 tests completed, 4 failed
Finished generating test XML results (0.023 secs) into: <https://ci-beam.apache.org/job/beam_PerformanceTests_InfluxDbIO_IT/ws/src/sdks/java/io/influxdb/build/test-results/integrationTest>
Generating HTML test report...
Finished generating test html results (0.023 secs) into: <https://ci-beam.apache.org/job/beam_PerformanceTests_InfluxDbIO_IT/ws/src/sdks/java/io/influxdb/build/reports/tests/integrationTest>
> Task :sdks:java:io:influxdb:integrationTest FAILED
:sdks:java:io:influxdb:integrationTest (Thread[Execution worker Thread 5,5,main]) completed. Took 1 mins 26.556 secs.
FAILURE: Build failed with an exception.
* What went wrong:
Execution failed for task ':sdks:java:io:influxdb:integrationTest'.
> There were failing tests. See the report at: file://<https://ci-beam.apache.org/job/beam_PerformanceTests_InfluxDbIO_IT/ws/src/sdks/java/io/influxdb/build/reports/tests/integrationTest/index.html>
* Try:
> Run with --stacktrace option to get the stack trace.
> Run with --debug option to get more log output.
* Get more help at https://help.gradle.org
Deprecated Gradle features were used in this build, making it incompatible with Gradle 8.0.
You can use '--warning-mode all' to show the individual deprecation warnings and determine if they come from your own scripts or plugins.
See https://docs.gradle.org/7.5.1/userguide/command_line_interface.html#sec:command_line_warnings
BUILD FAILED in 1m 47s
77 actionable tasks: 42 executed, 33 from cache, 2 up-to-date
Publishing build scan...
https://gradle.com/s/4d6pag25zsx3a
Build step 'Invoke Gradle script' changed build result to FAILURE
Build step 'Invoke Gradle script' marked build as failure
---------------------------------------------------------------------
To unsubscribe, e-mail: builds-unsubscribe@beam.apache.org
For additional commands, e-mail: builds-help@beam.apache.org
Jenkins build is back to normal : beam_PerformanceTests_InfluxDbIO_IT #2452
Posted by Apache Jenkins Server <je...@builds.apache.org>.
See <https://ci-beam.apache.org/job/beam_PerformanceTests_InfluxDbIO_IT/2452/display/redirect?page=changes>
---------------------------------------------------------------------
To unsubscribe, e-mail: builds-unsubscribe@beam.apache.org
For additional commands, e-mail: builds-help@beam.apache.org
Build failed in Jenkins: beam_PerformanceTests_InfluxDbIO_IT #2451
Posted by Apache Jenkins Server <je...@builds.apache.org>.
See <https://ci-beam.apache.org/job/beam_PerformanceTests_InfluxDbIO_IT/2451/display/redirect?page=changes>
Changes:
[Moritz Mack] [Jenkins,Spark] Stop running Nexmark suite for deprecated Spark 2 runner
[noreply] [Playground] Examples CI (#23476)
[noreply] [Tour Of Beam] README update (#23318)
------------------------------------------
[...truncated 186.95 KB...]
Task ':runners:java-fn-execution:compileJava' is not up-to-date because:
No history is available.
Loaded cache entry for task ':runners:java-fn-execution:compileJava' with cache key 86158a51c27cc249c846025f8e1c3ade
:runners:java-fn-execution:compileJava (Thread[Execution worker Thread 5,5,main]) completed. Took 0.108 secs.
Resolve mutations for :runners:java-fn-execution:classes (Thread[Execution worker Thread 2,5,main]) started.
Resolve mutations for :runners:java-fn-execution:classes (Thread[Execution worker Thread 2,5,main]) completed. Took 0.0 secs.
:runners:java-fn-execution:classes (Thread[included builds,5,main]) started.
> Task :runners:java-fn-execution:classes UP-TO-DATE
Skipping task ':runners:java-fn-execution:classes' as it has no actions.
:runners:java-fn-execution:classes (Thread[included builds,5,main]) completed. Took 0.0 secs.
Resolve mutations for :runners:java-fn-execution:jar (Thread[Execution worker Thread 5,5,main]) started.
Resolve mutations for :runners:java-fn-execution:jar (Thread[Execution worker Thread 5,5,main]) completed. Took 0.0 secs.
:runners:java-fn-execution:jar (Thread[Execution worker Thread 2,5,main]) started.
> Task :runners:java-fn-execution:jar
Caching disabled for task ':runners:java-fn-execution:jar' because:
Not worth caching
Task ':runners:java-fn-execution:jar' is not up-to-date because:
No history is available.
file or directory '<https://ci-beam.apache.org/job/beam_PerformanceTests_InfluxDbIO_IT/ws/src/runners/java-fn-execution/build/resources/main',> not found
:runners:java-fn-execution:jar (Thread[Execution worker Thread 2,5,main]) completed. Took 0.047 secs.
work action resolve beam-runners-java-fn-execution.jar (project :runners:java-fn-execution) (Thread[included builds,5,main]) started.
work action null (Thread[included builds,5,main]) completed. Took 0.0 secs.
Resolve mutations for :runners:direct-java:compileJava (Thread[Execution worker,5,main]) started.
Resolve mutations for :runners:direct-java:compileJava (Thread[Execution worker,5,main]) completed. Took 0.0 secs.
:runners:direct-java:compileJava (Thread[Execution worker Thread 7,5,main]) started.
> Task :runners:core-java:compileTestJava FROM-CACHE
Custom actions are attached to task ':runners:core-java:compileTestJava'.
Build cache key for task ':runners:core-java:compileTestJava' is 19f8749b18e66e785918429dd3976a3c
Task ':runners:core-java:compileTestJava' is not up-to-date because:
No history is available.
Loaded cache entry for task ':runners:core-java:compileTestJava' with cache key 19f8749b18e66e785918429dd3976a3c
:runners:core-java:compileTestJava (Thread[Execution worker Thread 3,5,main]) completed. Took 0.407 secs.
Resolve mutations for :runners:core-java:testClasses (Thread[included builds,5,main]) started.
Resolve mutations for :runners:core-java:testClasses (Thread[included builds,5,main]) completed. Took 0.0 secs.
:runners:core-java:testClasses (Thread[Execution worker,5,main]) started.
> Task :runners:core-java:testClasses UP-TO-DATE
Skipping task ':runners:core-java:testClasses' as it has no actions.
:runners:core-java:testClasses (Thread[Execution worker,5,main]) completed. Took 0.0 secs.
Resolve mutations for :runners:core-java:testJar (Thread[Execution worker Thread 3,5,main]) started.
Resolve mutations for :runners:core-java:testJar (Thread[Execution worker Thread 3,5,main]) completed. Took 0.0 secs.
:runners:core-java:testJar (Thread[included builds,5,main]) started.
> Task :runners:core-java:testJar
Caching disabled for task ':runners:core-java:testJar' because:
Not worth caching
Task ':runners:core-java:testJar' is not up-to-date because:
No history is available.
file or directory '<https://ci-beam.apache.org/job/beam_PerformanceTests_InfluxDbIO_IT/ws/src/runners/core-java/build/resources/test',> not found
:runners:core-java:testJar (Thread[included builds,5,main]) completed. Took 0.042 secs.
work action resolve beam-runners-core-java-tests.jar (project :runners:core-java) (Thread[Execution worker Thread 2,5,main]) started.
work action null (Thread[Execution worker Thread 2,5,main]) completed. Took 0.0 secs.
> Task :runners:direct-java:compileJava FROM-CACHE
Custom actions are attached to task ':runners:direct-java:compileJava'.
Build cache key for task ':runners:direct-java:compileJava' is 7deb0fba8cd9e3a4714b01f8a61b6ab5
Task ':runners:direct-java:compileJava' is not up-to-date because:
No history is available.
Loaded cache entry for task ':runners:direct-java:compileJava' with cache key 7deb0fba8cd9e3a4714b01f8a61b6ab5
:runners:direct-java:compileJava (Thread[Execution worker Thread 7,5,main]) completed. Took 0.133 secs.
Resolve mutations for :runners:direct-java:classes (Thread[Execution worker Thread 3,5,main]) started.
Resolve mutations for :runners:direct-java:classes (Thread[Execution worker Thread 3,5,main]) completed. Took 0.0 secs.
:runners:direct-java:classes (Thread[Execution worker Thread 7,5,main]) started.
> Task :runners:direct-java:classes UP-TO-DATE
Skipping task ':runners:direct-java:classes' as it has no actions.
:runners:direct-java:classes (Thread[Execution worker Thread 7,5,main]) completed. Took 0.0 secs.
Resolve mutations for :runners:direct-java:shadowJar (Thread[Execution worker Thread 7,5,main]) started.
Resolve mutations for :runners:direct-java:shadowJar (Thread[Execution worker Thread 7,5,main]) completed. Took 0.0 secs.
:runners:direct-java:shadowJar (Thread[included builds,5,main]) started.
> Task :runners:direct-java:shadowJar FROM-CACHE
Custom actions are attached to task ':runners:direct-java:shadowJar'.
Build cache key for task ':runners:direct-java:shadowJar' is 9914d7cee604e577d0118818dcf3899d
Task ':runners:direct-java:shadowJar' is not up-to-date because:
No history is available.
Loaded cache entry for task ':runners:direct-java:shadowJar' with cache key 9914d7cee604e577d0118818dcf3899d
:runners:direct-java:shadowJar (Thread[included builds,5,main]) completed. Took 0.319 secs.
work action resolve beam-runners-direct-java.jar (project :runners:direct-java) (Thread[Execution worker Thread 2,5,main]) started.
work action null (Thread[Execution worker Thread 2,5,main]) completed. Took 0.0 secs.
work action resolve beam-runners-direct-java.jar (project :runners:direct-java) (Thread[Execution worker Thread 3,5,main]) started.
work action null (Thread[Execution worker Thread 3,5,main]) completed. Took 0.0 secs.
Resolve mutations for :runners:direct-java:compileTestJava (Thread[included builds,5,main]) started.
Resolve mutations for :runners:direct-java:compileTestJava (Thread[included builds,5,main]) completed. Took 0.0 secs.
:runners:direct-java:compileTestJava (Thread[Execution worker Thread 2,5,main]) started.
> Task :runners:direct-java:compileTestJava FROM-CACHE
Custom actions are attached to task ':runners:direct-java:compileTestJava'.
Build cache key for task ':runners:direct-java:compileTestJava' is aeb5c33dcb78e29cbf2b0c27365fb8d0
Task ':runners:direct-java:compileTestJava' is not up-to-date because:
No history is available.
Loaded cache entry for task ':runners:direct-java:compileTestJava' with cache key aeb5c33dcb78e29cbf2b0c27365fb8d0
:runners:direct-java:compileTestJava (Thread[Execution worker Thread 2,5,main]) completed. Took 0.113 secs.
Resolve mutations for :runners:direct-java:testClasses (Thread[Execution worker Thread 3,5,main]) started.
Resolve mutations for :runners:direct-java:testClasses (Thread[Execution worker Thread 3,5,main]) completed. Took 0.0 secs.
:runners:direct-java:testClasses (Thread[Execution worker Thread 7,5,main]) started.
> Task :runners:direct-java:testClasses UP-TO-DATE
Skipping task ':runners:direct-java:testClasses' as it has no actions.
:runners:direct-java:testClasses (Thread[Execution worker Thread 7,5,main]) completed. Took 0.0 secs.
Resolve mutations for :runners:direct-java:shadowTestJar (Thread[Execution worker Thread 2,5,main]) started.
Resolve mutations for :runners:direct-java:shadowTestJar (Thread[Execution worker Thread 2,5,main]) completed. Took 0.0 secs.
:runners:direct-java:shadowTestJar (Thread[Execution worker Thread 3,5,main]) started.
> Task :runners:direct-java:shadowTestJar FROM-CACHE
Build cache key for task ':runners:direct-java:shadowTestJar' is 2f9008d621b1aabd1a6466302fc8f48b
Task ':runners:direct-java:shadowTestJar' is not up-to-date because:
No history is available.
Loaded cache entry for task ':runners:direct-java:shadowTestJar' with cache key 2f9008d621b1aabd1a6466302fc8f48b
:runners:direct-java:shadowTestJar (Thread[Execution worker Thread 3,5,main]) completed. Took 0.227 secs.
work action resolve beam-runners-direct-java-tests.jar (project :runners:direct-java) (Thread[included builds,5,main]) started.
work action null (Thread[included builds,5,main]) completed. Took 0.0 secs.
Resolve mutations for :sdks:java:io:influxdb:integrationTest (Thread[Execution worker Thread 3,5,main]) started.
Resolve mutations for :sdks:java:io:influxdb:integrationTest (Thread[Execution worker Thread 3,5,main]) completed. Took 0.0 secs.
:sdks:java:io:influxdb:integrationTest (Thread[Execution worker,5,main]) started.
producer locations for task group 0 (Thread[Execution worker Thread 5,5,main]) started.
producer locations for task group 0 (Thread[Execution worker Thread 5,5,main]) completed. Took 0.0 secs.
Gradle Test Executor 1 started executing tests.
> Task :sdks:java:io:influxdb:integrationTest
Custom actions are attached to task ':sdks:java:io:influxdb:integrationTest'.
Build cache key for task ':sdks:java:io:influxdb:integrationTest' is 2192952a3840e97770f42d65d37a860b
Task ':sdks:java:io:influxdb:integrationTest' is not up-to-date because:
Task.upToDateWhen is false.
Starting process 'Gradle Test Executor 1'. Working directory: <https://ci-beam.apache.org/job/beam_PerformanceTests_InfluxDbIO_IT/ws/src/sdks/java/io/influxdb> Command: /usr/lib/jvm/java-8-openjdk-amd64/bin/java -DbeamTestPipelineOptions=["--influxDBURL=http://35.226.241.80:8086","--influxDBUserName=superadmin","--influxDBPassword=supersecretpassword","--databaseName=db1"] -Djava.security.manager=worker.org.gradle.process.internal.worker.child.BootstrapSecurityManager -Dorg.gradle.internal.worker.tmpdir=<https://ci-beam.apache.org/job/beam_PerformanceTests_InfluxDbIO_IT/ws/src/sdks/java/io/influxdb/build/tmp/integrationTest/work> -Dorg.gradle.native=false -Xmx2g -Dfile.encoding=UTF-8 -Duser.country=US -Duser.language=en -Duser.variant -ea -cp /home/jenkins/.gradle/caches/7.5.1/workerMain/gradle-worker.jar worker.org.gradle.process.internal.worker.GradleWorkerMain 'Gradle Test Executor 1'
Successfully started process 'Gradle Test Executor 1'
org.apache.beam.sdk.io.influxdb.InfluxDbIOIT > testWriteAndReadWithMultipleMetric FAILED
org.influxdb.InfluxDBIOException: java.net.SocketTimeoutException: connect timed out
at org.influxdb.impl.InfluxDBImpl.execute(InfluxDBImpl.java:836)
at org.influxdb.impl.InfluxDBImpl.executeQuery(InfluxDBImpl.java:819)
at org.influxdb.impl.InfluxDBImpl.query(InfluxDBImpl.java:554)
at org.apache.beam.sdk.io.influxdb.InfluxDbIOIT.initTest(InfluxDbIOIT.java:99)
Caused by:
java.net.SocketTimeoutException: connect timed out
at java.net.PlainSocketImpl.socketConnect(Native Method)
at java.net.AbstractPlainSocketImpl.doConnect(AbstractPlainSocketImpl.java:350)
at java.net.AbstractPlainSocketImpl.connectToAddress(AbstractPlainSocketImpl.java:206)
at java.net.AbstractPlainSocketImpl.connect(AbstractPlainSocketImpl.java:188)
at java.net.SocksSocketImpl.connect(SocksSocketImpl.java:392)
at java.net.Socket.connect(Socket.java:607)
at okhttp3.internal.platform.Platform.connectSocket(Platform.kt:119)
at okhttp3.internal.connection.RealConnection.connectSocket(RealConnection.kt:283)
at okhttp3.internal.connection.RealConnection.connect(RealConnection.kt:195)
at okhttp3.internal.connection.ExchangeFinder.findConnection(ExchangeFinder.kt:249)
at okhttp3.internal.connection.ExchangeFinder.findHealthyConnection(ExchangeFinder.kt:108)
at okhttp3.internal.connection.ExchangeFinder.find(ExchangeFinder.kt:76)
at okhttp3.internal.connection.RealCall.initExchange$okhttp(RealCall.kt:245)
at okhttp3.internal.connection.ConnectInterceptor.intercept(ConnectInterceptor.kt:32)
at okhttp3.internal.http.RealInterceptorChain.proceed(RealInterceptorChain.kt:100)
at okhttp3.internal.cache.CacheInterceptor.intercept(CacheInterceptor.kt:82)
at okhttp3.internal.http.RealInterceptorChain.proceed(RealInterceptorChain.kt:100)
at okhttp3.internal.http.BridgeInterceptor.intercept(BridgeInterceptor.kt:83)
at okhttp3.internal.http.RealInterceptorChain.proceed(RealInterceptorChain.kt:100)
at okhttp3.internal.http.RetryAndFollowUpInterceptor.intercept(RetryAndFollowUpInterceptor.kt:76)
at okhttp3.internal.http.RealInterceptorChain.proceed(RealInterceptorChain.kt:100)
at org.influxdb.impl.BasicAuthInterceptor.intercept(BasicAuthInterceptor.java:22)
at okhttp3.internal.http.RealInterceptorChain.proceed(RealInterceptorChain.kt:100)
at org.influxdb.impl.GzipRequestInterceptor.intercept(GzipRequestInterceptor.java:42)
at okhttp3.internal.http.RealInterceptorChain.proceed(RealInterceptorChain.kt:100)
at okhttp3.logging.HttpLoggingInterceptor.intercept(HttpLoggingInterceptor.kt:152)
at okhttp3.internal.http.RealInterceptorChain.proceed(RealInterceptorChain.kt:100)
at okhttp3.internal.connection.RealCall.getResponseWithInterceptorChain$okhttp(RealCall.kt:197)
at okhttp3.internal.connection.RealCall.execute(RealCall.kt:148)
at retrofit2.OkHttpCall.execute(OkHttpCall.java:190)
at org.influxdb.impl.InfluxDBImpl.execute(InfluxDBImpl.java:824)
... 3 more
org.influxdb.InfluxDBIOException: java.net.SocketTimeoutException: connect timed out
at org.influxdb.impl.InfluxDBImpl.execute(InfluxDBImpl.java:836)
at org.influxdb.impl.InfluxDBImpl.executeQuery(InfluxDBImpl.java:819)
at org.influxdb.impl.InfluxDBImpl.query(InfluxDBImpl.java:554)
at org.apache.beam.sdk.io.influxdb.InfluxDbIOIT.clear(InfluxDbIOIT.java:88)
Caused by:
java.net.SocketTimeoutException: connect timed out
at java.net.PlainSocketImpl.socketConnect(Native Method)
at java.net.AbstractPlainSocketImpl.doConnect(AbstractPlainSocketImpl.java:350)
at java.net.AbstractPlainSocketImpl.connectToAddress(AbstractPlainSocketImpl.java:206)
at java.net.AbstractPlainSocketImpl.connect(AbstractPlainSocketImpl.java:188)
at java.net.SocksSocketImpl.connect(SocksSocketImpl.java:392)
at java.net.Socket.connect(Socket.java:607)
at okhttp3.internal.platform.Platform.connectSocket(Platform.kt:119)
at okhttp3.internal.connection.RealConnection.connectSocket(RealConnection.kt:283)
at okhttp3.internal.connection.RealConnection.connect(RealConnection.kt:195)
at okhttp3.internal.connection.ExchangeFinder.findConnection(ExchangeFinder.kt:249)
at okhttp3.internal.connection.ExchangeFinder.findHealthyConnection(ExchangeFinder.kt:108)
at okhttp3.internal.connection.ExchangeFinder.find(ExchangeFinder.kt:76)
at okhttp3.internal.connection.RealCall.initExchange$okhttp(RealCall.kt:245)
at okhttp3.internal.connection.ConnectInterceptor.intercept(ConnectInterceptor.kt:32)
at okhttp3.internal.http.RealInterceptorChain.proceed(RealInterceptorChain.kt:100)
at okhttp3.internal.cache.CacheInterceptor.intercept(CacheInterceptor.kt:82)
at okhttp3.internal.http.RealInterceptorChain.proceed(RealInterceptorChain.kt:100)
at okhttp3.internal.http.BridgeInterceptor.intercept(BridgeInterceptor.kt:83)
at okhttp3.internal.http.RealInterceptorChain.proceed(RealInterceptorChain.kt:100)
at okhttp3.internal.http.RetryAndFollowUpInterceptor.intercept(RetryAndFollowUpInterceptor.kt:76)
at okhttp3.internal.http.RealInterceptorChain.proceed(RealInterceptorChain.kt:100)
at org.influxdb.impl.BasicAuthInterceptor.intercept(BasicAuthInterceptor.java:22)
at okhttp3.internal.http.RealInterceptorChain.proceed(RealInterceptorChain.kt:100)
at org.influxdb.impl.GzipRequestInterceptor.intercept(GzipRequestInterceptor.java:42)
at okhttp3.internal.http.RealInterceptorChain.proceed(RealInterceptorChain.kt:100)
at okhttp3.logging.HttpLoggingInterceptor.intercept(HttpLoggingInterceptor.kt:152)
at okhttp3.internal.http.RealInterceptorChain.proceed(RealInterceptorChain.kt:100)
at okhttp3.internal.connection.RealCall.getResponseWithInterceptorChain$okhttp(RealCall.kt:197)
at okhttp3.internal.connection.RealCall.execute(RealCall.kt:148)
at retrofit2.OkHttpCall.execute(OkHttpCall.java:190)
at org.influxdb.impl.InfluxDBImpl.execute(InfluxDBImpl.java:824)
... 3 more
Gradle Test Executor 1 finished executing tests.
> Task :sdks:java:io:influxdb:integrationTest FAILED
6 tests completed, 1 failed
Finished generating test XML results (0.019 secs) into: <https://ci-beam.apache.org/job/beam_PerformanceTests_InfluxDbIO_IT/ws/src/sdks/java/io/influxdb/build/test-results/integrationTest>
Generating HTML test report...
Finished generating test html results (0.023 secs) into: <https://ci-beam.apache.org/job/beam_PerformanceTests_InfluxDbIO_IT/ws/src/sdks/java/io/influxdb/build/reports/tests/integrationTest>
:sdks:java:io:influxdb:integrationTest (Thread[Execution worker,5,main]) completed. Took 35.034 secs.
FAILURE: Build failed with an exception.
* What went wrong:
Execution failed for task ':sdks:java:io:influxdb:integrationTest'.
> There were failing tests. See the report at: file://<https://ci-beam.apache.org/job/beam_PerformanceTests_InfluxDbIO_IT/ws/src/sdks/java/io/influxdb/build/reports/tests/integrationTest/index.html>
* Try:
> Run with --stacktrace option to get the stack trace.
> Run with --debug option to get more log output.
* Get more help at https://help.gradle.org
Deprecated Gradle features were used in this build, making it incompatible with Gradle 8.0.
You can use '--warning-mode all' to show the individual deprecation warnings and determine if they come from your own scripts or plugins.
See https://docs.gradle.org/7.5.1/userguide/command_line_interface.html#sec:command_line_warnings
BUILD FAILED in 57s
77 actionable tasks: 42 executed, 33 from cache, 2 up-to-date
Publishing build scan...
https://gradle.com/s/cy2nld6corsby
Build step 'Invoke Gradle script' changed build result to FAILURE
Build step 'Invoke Gradle script' marked build as failure
---------------------------------------------------------------------
To unsubscribe, e-mail: builds-unsubscribe@beam.apache.org
For additional commands, e-mail: builds-help@beam.apache.org
Build failed in Jenkins: beam_PerformanceTests_InfluxDbIO_IT #2450
Posted by Apache Jenkins Server <je...@builds.apache.org>.
See <https://ci-beam.apache.org/job/beam_PerformanceTests_InfluxDbIO_IT/2450/display/redirect>
Changes:
------------------------------------------
[...truncated 187.59 KB...]
Loaded cache entry for task ':runners:java-fn-execution:compileJava' with cache key 86158a51c27cc249c846025f8e1c3ade
:runners:java-fn-execution:compileJava (Thread[Execution worker Thread 5,5,main]) completed. Took 0.145 secs.
Resolve mutations for :runners:java-fn-execution:classes (Thread[Execution worker Thread 4,5,main]) started.
Resolve mutations for :runners:java-fn-execution:classes (Thread[Execution worker Thread 4,5,main]) completed. Took 0.0 secs.
:runners:java-fn-execution:classes (Thread[included builds,5,main]) started.
> Task :runners:java-fn-execution:classes UP-TO-DATE
Skipping task ':runners:java-fn-execution:classes' as it has no actions.
:runners:java-fn-execution:classes (Thread[included builds,5,main]) completed. Took 0.0 secs.
Resolve mutations for :runners:java-fn-execution:jar (Thread[Execution worker Thread 7,5,main]) started.
Resolve mutations for :runners:java-fn-execution:jar (Thread[Execution worker Thread 7,5,main]) completed. Took 0.0 secs.
:runners:java-fn-execution:jar (Thread[Execution worker Thread 4,5,main]) started.
> Task :runners:java-fn-execution:jar
Caching disabled for task ':runners:java-fn-execution:jar' because:
Not worth caching
Task ':runners:java-fn-execution:jar' is not up-to-date because:
No history is available.
file or directory '<https://ci-beam.apache.org/job/beam_PerformanceTests_InfluxDbIO_IT/ws/src/runners/java-fn-execution/build/resources/main',> not found
:runners:java-fn-execution:jar (Thread[Execution worker Thread 4,5,main]) completed. Took 0.054 secs.
work action resolve beam-runners-java-fn-execution.jar (project :runners:java-fn-execution) (Thread[Execution worker Thread 5,5,main]) started.
work action null (Thread[Execution worker Thread 5,5,main]) completed. Took 0.0 secs.
Resolve mutations for :runners:direct-java:compileJava (Thread[Execution worker Thread 7,5,main]) started.
Resolve mutations for :runners:direct-java:compileJava (Thread[Execution worker Thread 7,5,main]) completed. Took 0.0 secs.
:runners:direct-java:compileJava (Thread[Execution worker Thread 4,5,main]) started.
> Task :runners:core-java:compileTestJava FROM-CACHE
Custom actions are attached to task ':runners:core-java:compileTestJava'.
Build cache key for task ':runners:core-java:compileTestJava' is 19f8749b18e66e785918429dd3976a3c
Task ':runners:core-java:compileTestJava' is not up-to-date because:
No history is available.
Loaded cache entry for task ':runners:core-java:compileTestJava' with cache key 19f8749b18e66e785918429dd3976a3c
:runners:core-java:compileTestJava (Thread[Execution worker Thread 6,5,main]) completed. Took 0.45 secs.
Resolve mutations for :runners:core-java:testClasses (Thread[Execution worker Thread 5,5,main]) started.
Resolve mutations for :runners:core-java:testClasses (Thread[Execution worker Thread 5,5,main]) completed. Took 0.0 secs.
:runners:core-java:testClasses (Thread[Execution worker,5,main]) started.
> Task :runners:core-java:testClasses UP-TO-DATE
Skipping task ':runners:core-java:testClasses' as it has no actions.
:runners:core-java:testClasses (Thread[Execution worker,5,main]) completed. Took 0.0 secs.
Resolve mutations for :runners:core-java:testJar (Thread[included builds,5,main]) started.
Resolve mutations for :runners:core-java:testJar (Thread[included builds,5,main]) completed. Took 0.0 secs.
:runners:core-java:testJar (Thread[Execution worker Thread 5,5,main]) started.
> Task :runners:direct-java:compileJava FROM-CACHE
Custom actions are attached to task ':runners:direct-java:compileJava'.
Build cache key for task ':runners:direct-java:compileJava' is 7deb0fba8cd9e3a4714b01f8a61b6ab5
Task ':runners:direct-java:compileJava' is not up-to-date because:
No history is available.
Loaded cache entry for task ':runners:direct-java:compileJava' with cache key 7deb0fba8cd9e3a4714b01f8a61b6ab5
:runners:direct-java:compileJava (Thread[Execution worker Thread 4,5,main]) completed. Took 0.131 secs.
Resolve mutations for :runners:direct-java:classes (Thread[Execution worker Thread 2,5,main]) started.
Resolve mutations for :runners:direct-java:classes (Thread[Execution worker Thread 2,5,main]) completed. Took 0.0 secs.
:runners:direct-java:classes (Thread[Execution worker Thread 2,5,main]) started.
> Task :runners:direct-java:classes UP-TO-DATE
Skipping task ':runners:direct-java:classes' as it has no actions.
:runners:direct-java:classes (Thread[Execution worker Thread 2,5,main]) completed. Took 0.0 secs.
Resolve mutations for :runners:direct-java:shadowJar (Thread[Execution worker Thread 4,5,main]) started.
Resolve mutations for :runners:direct-java:shadowJar (Thread[Execution worker Thread 4,5,main]) completed. Took 0.001 secs.
:runners:direct-java:shadowJar (Thread[included builds,5,main]) started.
> Task :runners:core-java:testJar
Caching disabled for task ':runners:core-java:testJar' because:
Not worth caching
Task ':runners:core-java:testJar' is not up-to-date because:
No history is available.
file or directory '<https://ci-beam.apache.org/job/beam_PerformanceTests_InfluxDbIO_IT/ws/src/runners/core-java/build/resources/test',> not found
:runners:core-java:testJar (Thread[Execution worker Thread 5,5,main]) completed. Took 0.045 secs.
work action resolve beam-runners-core-java-tests.jar (project :runners:core-java) (Thread[Execution worker,5,main]) started.
work action null (Thread[Execution worker,5,main]) completed. Took 0.0 secs.
> Task :runners:direct-java:shadowJar FROM-CACHE
Custom actions are attached to task ':runners:direct-java:shadowJar'.
Build cache key for task ':runners:direct-java:shadowJar' is 9914d7cee604e577d0118818dcf3899d
Task ':runners:direct-java:shadowJar' is not up-to-date because:
No history is available.
Loaded cache entry for task ':runners:direct-java:shadowJar' with cache key 9914d7cee604e577d0118818dcf3899d
:runners:direct-java:shadowJar (Thread[included builds,5,main]) completed. Took 0.328 secs.
work action resolve beam-runners-direct-java.jar (project :runners:direct-java) (Thread[Execution worker Thread 5,5,main]) started.
work action null (Thread[Execution worker Thread 5,5,main]) completed. Took 0.0 secs.
work action resolve beam-runners-direct-java.jar (project :runners:direct-java) (Thread[Execution worker,5,main]) started.
work action null (Thread[Execution worker,5,main]) completed. Took 0.0 secs.
Resolve mutations for :runners:direct-java:compileTestJava (Thread[Execution worker Thread 3,5,main]) started.
Resolve mutations for :runners:direct-java:compileTestJava (Thread[Execution worker Thread 3,5,main]) completed. Took 0.0 secs.
:runners:direct-java:compileTestJava (Thread[Execution worker Thread 5,5,main]) started.
> Task :runners:direct-java:compileTestJava FROM-CACHE
Custom actions are attached to task ':runners:direct-java:compileTestJava'.
Build cache key for task ':runners:direct-java:compileTestJava' is aeb5c33dcb78e29cbf2b0c27365fb8d0
Task ':runners:direct-java:compileTestJava' is not up-to-date because:
No history is available.
Loaded cache entry for task ':runners:direct-java:compileTestJava' with cache key aeb5c33dcb78e29cbf2b0c27365fb8d0
:runners:direct-java:compileTestJava (Thread[Execution worker Thread 5,5,main]) completed. Took 0.126 secs.
Resolve mutations for :runners:direct-java:testClasses (Thread[Execution worker Thread 3,5,main]) started.
Resolve mutations for :runners:direct-java:testClasses (Thread[Execution worker Thread 3,5,main]) completed. Took 0.0 secs.
:runners:direct-java:testClasses (Thread[Execution worker Thread 4,5,main]) started.
> Task :runners:direct-java:testClasses UP-TO-DATE
Skipping task ':runners:direct-java:testClasses' as it has no actions.
:runners:direct-java:testClasses (Thread[Execution worker Thread 4,5,main]) completed. Took 0.0 secs.
Resolve mutations for :runners:direct-java:shadowTestJar (Thread[Execution worker Thread 4,5,main]) started.
Resolve mutations for :runners:direct-java:shadowTestJar (Thread[Execution worker Thread 4,5,main]) completed. Took 0.0 secs.
:runners:direct-java:shadowTestJar (Thread[Execution worker Thread 3,5,main]) started.
> Task :runners:direct-java:shadowTestJar FROM-CACHE
Build cache key for task ':runners:direct-java:shadowTestJar' is 2f9008d621b1aabd1a6466302fc8f48b
Task ':runners:direct-java:shadowTestJar' is not up-to-date because:
No history is available.
Loaded cache entry for task ':runners:direct-java:shadowTestJar' with cache key 2f9008d621b1aabd1a6466302fc8f48b
:runners:direct-java:shadowTestJar (Thread[Execution worker Thread 3,5,main]) completed. Took 0.238 secs.
work action resolve beam-runners-direct-java-tests.jar (project :runners:direct-java) (Thread[Execution worker Thread 5,5,main]) started.
work action null (Thread[Execution worker Thread 5,5,main]) completed. Took 0.0 secs.
Resolve mutations for :sdks:java:io:influxdb:integrationTest (Thread[Execution worker Thread 4,5,main]) started.
Resolve mutations for :sdks:java:io:influxdb:integrationTest (Thread[Execution worker Thread 4,5,main]) completed. Took 0.0 secs.
:sdks:java:io:influxdb:integrationTest (Thread[Execution worker Thread 3,5,main]) started.
producer locations for task group 0 (Thread[included builds,5,main]) started.
producer locations for task group 0 (Thread[included builds,5,main]) completed. Took 0.0 secs.
Gradle Test Executor 1 started executing tests.
> Task :sdks:java:io:influxdb:integrationTest
Custom actions are attached to task ':sdks:java:io:influxdb:integrationTest'.
Build cache key for task ':sdks:java:io:influxdb:integrationTest' is 2192952a3840e97770f42d65d37a860b
Task ':sdks:java:io:influxdb:integrationTest' is not up-to-date because:
Task.upToDateWhen is false.
Starting process 'Gradle Test Executor 1'. Working directory: <https://ci-beam.apache.org/job/beam_PerformanceTests_InfluxDbIO_IT/ws/src/sdks/java/io/influxdb> Command: /usr/lib/jvm/java-8-openjdk-amd64/bin/java -DbeamTestPipelineOptions=["--influxDBURL=http://34.133.193.78:8086","--influxDBUserName=superadmin","--influxDBPassword=supersecretpassword","--databaseName=db1"] -Djava.security.manager=worker.org.gradle.process.internal.worker.child.BootstrapSecurityManager -Dorg.gradle.internal.worker.tmpdir=<https://ci-beam.apache.org/job/beam_PerformanceTests_InfluxDbIO_IT/ws/src/sdks/java/io/influxdb/build/tmp/integrationTest/work> -Dorg.gradle.native=false -Xmx2g -Dfile.encoding=UTF-8 -Duser.country=US -Duser.language=en -Duser.variant -ea -cp /home/jenkins/.gradle/caches/7.5.1/workerMain/gradle-worker.jar worker.org.gradle.process.internal.worker.GradleWorkerMain 'Gradle Test Executor 1'
Successfully started process 'Gradle Test Executor 1'
org.apache.beam.sdk.io.influxdb.InfluxDbIOIT > testWriteAndReadWithMultipleMetric FAILED
org.influxdb.InfluxDBIOException: java.net.SocketTimeoutException: connect timed out
at org.influxdb.impl.InfluxDBImpl.execute(InfluxDBImpl.java:836)
at org.influxdb.impl.InfluxDBImpl.executeQuery(InfluxDBImpl.java:819)
at org.influxdb.impl.InfluxDBImpl.query(InfluxDBImpl.java:554)
at org.apache.beam.sdk.io.influxdb.InfluxDbIOIT.initTest(InfluxDbIOIT.java:99)
Caused by:
java.net.SocketTimeoutException: connect timed out
at java.net.PlainSocketImpl.socketConnect(Native Method)
at java.net.AbstractPlainSocketImpl.doConnect(AbstractPlainSocketImpl.java:350)
at java.net.AbstractPlainSocketImpl.connectToAddress(AbstractPlainSocketImpl.java:206)
at java.net.AbstractPlainSocketImpl.connect(AbstractPlainSocketImpl.java:188)
at java.net.SocksSocketImpl.connect(SocksSocketImpl.java:392)
at java.net.Socket.connect(Socket.java:607)
at okhttp3.internal.platform.Platform.connectSocket(Platform.kt:119)
at okhttp3.internal.connection.RealConnection.connectSocket(RealConnection.kt:283)
at okhttp3.internal.connection.RealConnection.connect(RealConnection.kt:195)
at okhttp3.internal.connection.ExchangeFinder.findConnection(ExchangeFinder.kt:249)
at okhttp3.internal.connection.ExchangeFinder.findHealthyConnection(ExchangeFinder.kt:108)
at okhttp3.internal.connection.ExchangeFinder.find(ExchangeFinder.kt:76)
at okhttp3.internal.connection.RealCall.initExchange$okhttp(RealCall.kt:245)
at okhttp3.internal.connection.ConnectInterceptor.intercept(ConnectInterceptor.kt:32)
at okhttp3.internal.http.RealInterceptorChain.proceed(RealInterceptorChain.kt:100)
at okhttp3.internal.cache.CacheInterceptor.intercept(CacheInterceptor.kt:82)
at okhttp3.internal.http.RealInterceptorChain.proceed(RealInterceptorChain.kt:100)
at okhttp3.internal.http.BridgeInterceptor.intercept(BridgeInterceptor.kt:83)
at okhttp3.internal.http.RealInterceptorChain.proceed(RealInterceptorChain.kt:100)
at okhttp3.internal.http.RetryAndFollowUpInterceptor.intercept(RetryAndFollowUpInterceptor.kt:76)
at okhttp3.internal.http.RealInterceptorChain.proceed(RealInterceptorChain.kt:100)
at org.influxdb.impl.BasicAuthInterceptor.intercept(BasicAuthInterceptor.java:22)
at okhttp3.internal.http.RealInterceptorChain.proceed(RealInterceptorChain.kt:100)
at org.influxdb.impl.GzipRequestInterceptor.intercept(GzipRequestInterceptor.java:42)
at okhttp3.internal.http.RealInterceptorChain.proceed(RealInterceptorChain.kt:100)
at okhttp3.logging.HttpLoggingInterceptor.intercept(HttpLoggingInterceptor.kt:152)
at okhttp3.internal.http.RealInterceptorChain.proceed(RealInterceptorChain.kt:100)
at okhttp3.internal.connection.RealCall.getResponseWithInterceptorChain$okhttp(RealCall.kt:197)
at okhttp3.internal.connection.RealCall.execute(RealCall.kt:148)
at retrofit2.OkHttpCall.execute(OkHttpCall.java:190)
at org.influxdb.impl.InfluxDBImpl.execute(InfluxDBImpl.java:824)
... 3 more
org.influxdb.InfluxDBIOException: java.net.SocketTimeoutException: connect timed out
at org.influxdb.impl.InfluxDBImpl.execute(InfluxDBImpl.java:836)
at org.influxdb.impl.InfluxDBImpl.executeQuery(InfluxDBImpl.java:819)
at org.influxdb.impl.InfluxDBImpl.query(InfluxDBImpl.java:554)
at org.apache.beam.sdk.io.influxdb.InfluxDbIOIT.clear(InfluxDbIOIT.java:88)
Caused by:
java.net.SocketTimeoutException: connect timed out
at java.net.PlainSocketImpl.socketConnect(Native Method)
at java.net.AbstractPlainSocketImpl.doConnect(AbstractPlainSocketImpl.java:350)
at java.net.AbstractPlainSocketImpl.connectToAddress(AbstractPlainSocketImpl.java:206)
at java.net.AbstractPlainSocketImpl.connect(AbstractPlainSocketImpl.java:188)
at java.net.SocksSocketImpl.connect(SocksSocketImpl.java:392)
at java.net.Socket.connect(Socket.java:607)
at okhttp3.internal.platform.Platform.connectSocket(Platform.kt:119)
at okhttp3.internal.connection.RealConnection.connectSocket(RealConnection.kt:283)
at okhttp3.internal.connection.RealConnection.connect(RealConnection.kt:195)
at okhttp3.internal.connection.ExchangeFinder.findConnection(ExchangeFinder.kt:249)
at okhttp3.internal.connection.ExchangeFinder.findHealthyConnection(ExchangeFinder.kt:108)
at okhttp3.internal.connection.ExchangeFinder.find(ExchangeFinder.kt:76)
at okhttp3.internal.connection.RealCall.initExchange$okhttp(RealCall.kt:245)
at okhttp3.internal.connection.ConnectInterceptor.intercept(ConnectInterceptor.kt:32)
at okhttp3.internal.http.RealInterceptorChain.proceed(RealInterceptorChain.kt:100)
at okhttp3.internal.cache.CacheInterceptor.intercept(CacheInterceptor.kt:82)
at okhttp3.internal.http.RealInterceptorChain.proceed(RealInterceptorChain.kt:100)
at okhttp3.internal.http.BridgeInterceptor.intercept(BridgeInterceptor.kt:83)
at okhttp3.internal.http.RealInterceptorChain.proceed(RealInterceptorChain.kt:100)
at okhttp3.internal.http.RetryAndFollowUpInterceptor.intercept(RetryAndFollowUpInterceptor.kt:76)
at okhttp3.internal.http.RealInterceptorChain.proceed(RealInterceptorChain.kt:100)
at org.influxdb.impl.BasicAuthInterceptor.intercept(BasicAuthInterceptor.java:22)
at okhttp3.internal.http.RealInterceptorChain.proceed(RealInterceptorChain.kt:100)
at org.influxdb.impl.GzipRequestInterceptor.intercept(GzipRequestInterceptor.java:42)
at okhttp3.internal.http.RealInterceptorChain.proceed(RealInterceptorChain.kt:100)
at okhttp3.logging.HttpLoggingInterceptor.intercept(HttpLoggingInterceptor.kt:152)
at okhttp3.internal.http.RealInterceptorChain.proceed(RealInterceptorChain.kt:100)
at okhttp3.internal.connection.RealCall.getResponseWithInterceptorChain$okhttp(RealCall.kt:197)
at okhttp3.internal.connection.RealCall.execute(RealCall.kt:148)
at retrofit2.OkHttpCall.execute(OkHttpCall.java:190)
at org.influxdb.impl.InfluxDBImpl.execute(InfluxDBImpl.java:824)
... 3 more
Gradle Test Executor 1 finished executing tests.
> Task :sdks:java:io:influxdb:integrationTest
6 tests completed, 1 failed
Finished generating test XML results (0.02 secs) into: <https://ci-beam.apache.org/job/beam_PerformanceTests_InfluxDbIO_IT/ws/src/sdks/java/io/influxdb/build/test-results/integrationTest>
Generating HTML test report...
Finished generating test html results (0.024 secs) into: <https://ci-beam.apache.org/job/beam_PerformanceTests_InfluxDbIO_IT/ws/src/sdks/java/io/influxdb/build/reports/tests/integrationTest>
> Task :sdks:java:io:influxdb:integrationTest FAILED
:sdks:java:io:influxdb:integrationTest (Thread[Execution worker Thread 3,5,main]) completed. Took 34.888 secs.
FAILURE: Build failed with an exception.
* What went wrong:
Execution failed for task ':sdks:java:io:influxdb:integrationTest'.
> There were failing tests. See the report at: file://<https://ci-beam.apache.org/job/beam_PerformanceTests_InfluxDbIO_IT/ws/src/sdks/java/io/influxdb/build/reports/tests/integrationTest/index.html>
* Try:
> Run with --stacktrace option to get the stack trace.
> Run with --debug option to get more log output.
* Get more help at https://help.gradle.org
Deprecated Gradle features were used in this build, making it incompatible with Gradle 8.0.
You can use '--warning-mode all' to show the individual deprecation warnings and determine if they come from your own scripts or plugins.
See https://docs.gradle.org/7.5.1/userguide/command_line_interface.html#sec:command_line_warnings
BUILD FAILED in 58s
77 actionable tasks: 42 executed, 33 from cache, 2 up-to-date
Publishing build scan...
https://gradle.com/s/6sq6pzioph5jk
Build step 'Invoke Gradle script' changed build result to FAILURE
Build step 'Invoke Gradle script' marked build as failure
---------------------------------------------------------------------
To unsubscribe, e-mail: builds-unsubscribe@beam.apache.org
For additional commands, e-mail: builds-help@beam.apache.org
Build failed in Jenkins: beam_PerformanceTests_InfluxDbIO_IT #2449
Posted by Apache Jenkins Server <je...@builds.apache.org>.
See <https://ci-beam.apache.org/job/beam_PerformanceTests_InfluxDbIO_IT/2449/display/redirect?page=changes>
Changes:
[noreply] Blog post for Hop web in Google Cloud (#23652)
------------------------------------------
[...truncated 191.25 KB...]
Resolve mutations for :runners:core-java:testJar (Thread[Execution worker Thread 3,5,main]) started.
Resolve mutations for :runners:core-java:testJar (Thread[Execution worker Thread 3,5,main]) completed. Took 0.0 secs.
:runners:core-java:testJar (Thread[included builds,5,main]) started.
> Task :runners:direct-java:compileJava FROM-CACHE
Custom actions are attached to task ':runners:direct-java:compileJava'.
Build cache key for task ':runners:direct-java:compileJava' is 7deb0fba8cd9e3a4714b01f8a61b6ab5
Task ':runners:direct-java:compileJava' is not up-to-date because:
No history is available.
Loaded cache entry for task ':runners:direct-java:compileJava' with cache key 7deb0fba8cd9e3a4714b01f8a61b6ab5
:runners:direct-java:compileJava (Thread[Execution worker Thread 2,5,main]) completed. Took 0.134 secs.
Resolve mutations for :runners:direct-java:classes (Thread[Execution worker Thread 7,5,main]) started.
Resolve mutations for :runners:direct-java:classes (Thread[Execution worker Thread 7,5,main]) completed. Took 0.0 secs.
:runners:direct-java:classes (Thread[Execution worker Thread 3,5,main]) started.
> Task :runners:direct-java:classes UP-TO-DATE
Skipping task ':runners:direct-java:classes' as it has no actions.
:runners:direct-java:classes (Thread[Execution worker Thread 3,5,main]) completed. Took 0.0 secs.
Resolve mutations for :runners:direct-java:shadowJar (Thread[Execution worker Thread 6,5,main]) started.
Resolve mutations for :runners:direct-java:shadowJar (Thread[Execution worker Thread 6,5,main]) completed. Took 0.0 secs.
:runners:direct-java:shadowJar (Thread[Execution worker Thread 2,5,main]) started.
> Task :runners:core-java:testJar
Caching disabled for task ':runners:core-java:testJar' because:
Not worth caching
Task ':runners:core-java:testJar' is not up-to-date because:
No history is available.
file or directory '<https://ci-beam.apache.org/job/beam_PerformanceTests_InfluxDbIO_IT/ws/src/runners/core-java/build/resources/test',> not found
:runners:core-java:testJar (Thread[included builds,5,main]) completed. Took 0.049 secs.
work action resolve beam-runners-core-java-tests.jar (project :runners:core-java) (Thread[Execution worker Thread 3,5,main]) started.
work action null (Thread[Execution worker Thread 3,5,main]) completed. Took 0.0 secs.
> Task :runners:direct-java:shadowJar FROM-CACHE
Custom actions are attached to task ':runners:direct-java:shadowJar'.
Build cache key for task ':runners:direct-java:shadowJar' is 9914d7cee604e577d0118818dcf3899d
Task ':runners:direct-java:shadowJar' is not up-to-date because:
No history is available.
Loaded cache entry for task ':runners:direct-java:shadowJar' with cache key 9914d7cee604e577d0118818dcf3899d
:runners:direct-java:shadowJar (Thread[Execution worker Thread 2,5,main]) completed. Took 0.317 secs.
work action resolve beam-runners-direct-java.jar (project :runners:direct-java) (Thread[Execution worker Thread 3,5,main]) started.
work action null (Thread[Execution worker Thread 3,5,main]) completed. Took 0.0 secs.
work action resolve beam-runners-direct-java.jar (project :runners:direct-java) (Thread[included builds,5,main]) started.
work action null (Thread[included builds,5,main]) completed. Took 0.0 secs.
Resolve mutations for :runners:direct-java:compileTestJava (Thread[Execution worker Thread 2,5,main]) started.
Resolve mutations for :runners:direct-java:compileTestJava (Thread[Execution worker Thread 2,5,main]) completed. Took 0.0 secs.
:runners:direct-java:compileTestJava (Thread[Execution worker Thread 3,5,main]) started.
> Task :runners:direct-java:compileTestJava FROM-CACHE
Custom actions are attached to task ':runners:direct-java:compileTestJava'.
Build cache key for task ':runners:direct-java:compileTestJava' is aeb5c33dcb78e29cbf2b0c27365fb8d0
Task ':runners:direct-java:compileTestJava' is not up-to-date because:
No history is available.
Loaded cache entry for task ':runners:direct-java:compileTestJava' with cache key aeb5c33dcb78e29cbf2b0c27365fb8d0
:runners:direct-java:compileTestJava (Thread[Execution worker Thread 3,5,main]) completed. Took 0.124 secs.
Resolve mutations for :runners:direct-java:testClasses (Thread[Execution worker Thread 2,5,main]) started.
Resolve mutations for :runners:direct-java:testClasses (Thread[Execution worker Thread 2,5,main]) completed. Took 0.0 secs.
:runners:direct-java:testClasses (Thread[Execution worker Thread 6,5,main]) started.
> Task :runners:direct-java:testClasses UP-TO-DATE
Skipping task ':runners:direct-java:testClasses' as it has no actions.
:runners:direct-java:testClasses (Thread[Execution worker Thread 6,5,main]) completed. Took 0.0 secs.
Resolve mutations for :runners:direct-java:shadowTestJar (Thread[included builds,5,main]) started.
Resolve mutations for :runners:direct-java:shadowTestJar (Thread[included builds,5,main]) completed. Took 0.0 secs.
:runners:direct-java:shadowTestJar (Thread[Execution worker Thread 2,5,main]) started.
> Task :runners:direct-java:shadowTestJar FROM-CACHE
Build cache key for task ':runners:direct-java:shadowTestJar' is 2f9008d621b1aabd1a6466302fc8f48b
Task ':runners:direct-java:shadowTestJar' is not up-to-date because:
No history is available.
Loaded cache entry for task ':runners:direct-java:shadowTestJar' with cache key 2f9008d621b1aabd1a6466302fc8f48b
:runners:direct-java:shadowTestJar (Thread[Execution worker Thread 2,5,main]) completed. Took 0.212 secs.
work action resolve beam-runners-direct-java-tests.jar (project :runners:direct-java) (Thread[Execution worker Thread 6,5,main]) started.
work action null (Thread[Execution worker Thread 6,5,main]) completed. Took 0.0 secs.
Resolve mutations for :sdks:java:io:influxdb:integrationTest (Thread[included builds,5,main]) started.
Resolve mutations for :sdks:java:io:influxdb:integrationTest (Thread[included builds,5,main]) completed. Took 0.0 secs.
:sdks:java:io:influxdb:integrationTest (Thread[Execution worker Thread 2,5,main]) started.
producer locations for task group 0 (Thread[included builds,5,main]) started.
producer locations for task group 0 (Thread[included builds,5,main]) completed. Took 0.0 secs.
Gradle Test Executor 9 started executing tests.
> Task :sdks:java:io:influxdb:integrationTest
Custom actions are attached to task ':sdks:java:io:influxdb:integrationTest'.
Build cache key for task ':sdks:java:io:influxdb:integrationTest' is 2192952a3840e97770f42d65d37a860b
Task ':sdks:java:io:influxdb:integrationTest' is not up-to-date because:
Task.upToDateWhen is false.
Starting process 'Gradle Test Executor 9'. Working directory: <https://ci-beam.apache.org/job/beam_PerformanceTests_InfluxDbIO_IT/ws/src/sdks/java/io/influxdb> Command: /usr/lib/jvm/java-8-openjdk-amd64/bin/java -DbeamTestPipelineOptions=["--influxDBURL=http://34.135.29.190:8086","--influxDBUserName=superadmin","--influxDBPassword=supersecretpassword","--databaseName=db1"] -Djava.security.manager=worker.org.gradle.process.internal.worker.child.BootstrapSecurityManager -Dorg.gradle.internal.worker.tmpdir=<https://ci-beam.apache.org/job/beam_PerformanceTests_InfluxDbIO_IT/ws/src/sdks/java/io/influxdb/build/tmp/integrationTest/work> -Dorg.gradle.native=false -Xmx2g -Dfile.encoding=UTF-8 -Duser.country=US -Duser.language=en -Duser.variant -ea -cp /home/jenkins/.gradle/caches/7.5.1/workerMain/gradle-worker.jar worker.org.gradle.process.internal.worker.GradleWorkerMain 'Gradle Test Executor 9'
Successfully started process 'Gradle Test Executor 9'
org.apache.beam.sdk.io.influxdb.InfluxDbIOIT > testWriteAndReadWithMultipleMetric FAILED
org.influxdb.InfluxDBIOException: java.net.SocketTimeoutException: connect timed out
at org.influxdb.impl.InfluxDBImpl.execute(InfluxDBImpl.java:836)
at org.influxdb.impl.InfluxDBImpl.executeQuery(InfluxDBImpl.java:819)
at org.influxdb.impl.InfluxDBImpl.query(InfluxDBImpl.java:554)
at org.apache.beam.sdk.io.influxdb.InfluxDbIOIT.initTest(InfluxDbIOIT.java:99)
Caused by:
java.net.SocketTimeoutException: connect timed out
at java.net.PlainSocketImpl.socketConnect(Native Method)
at java.net.AbstractPlainSocketImpl.doConnect(AbstractPlainSocketImpl.java:350)
at java.net.AbstractPlainSocketImpl.connectToAddress(AbstractPlainSocketImpl.java:206)
at java.net.AbstractPlainSocketImpl.connect(AbstractPlainSocketImpl.java:188)
at java.net.SocksSocketImpl.connect(SocksSocketImpl.java:392)
at java.net.Socket.connect(Socket.java:607)
at okhttp3.internal.platform.Platform.connectSocket(Platform.kt:119)
at okhttp3.internal.connection.RealConnection.connectSocket(RealConnection.kt:283)
at okhttp3.internal.connection.RealConnection.connect(RealConnection.kt:195)
at okhttp3.internal.connection.ExchangeFinder.findConnection(ExchangeFinder.kt:249)
at okhttp3.internal.connection.ExchangeFinder.findHealthyConnection(ExchangeFinder.kt:108)
at okhttp3.internal.connection.ExchangeFinder.find(ExchangeFinder.kt:76)
at okhttp3.internal.connection.RealCall.initExchange$okhttp(RealCall.kt:245)
at okhttp3.internal.connection.ConnectInterceptor.intercept(ConnectInterceptor.kt:32)
at okhttp3.internal.http.RealInterceptorChain.proceed(RealInterceptorChain.kt:100)
at okhttp3.internal.cache.CacheInterceptor.intercept(CacheInterceptor.kt:82)
at okhttp3.internal.http.RealInterceptorChain.proceed(RealInterceptorChain.kt:100)
at okhttp3.internal.http.BridgeInterceptor.intercept(BridgeInterceptor.kt:83)
at okhttp3.internal.http.RealInterceptorChain.proceed(RealInterceptorChain.kt:100)
at okhttp3.internal.http.RetryAndFollowUpInterceptor.intercept(RetryAndFollowUpInterceptor.kt:76)
at okhttp3.internal.http.RealInterceptorChain.proceed(RealInterceptorChain.kt:100)
at org.influxdb.impl.BasicAuthInterceptor.intercept(BasicAuthInterceptor.java:22)
at okhttp3.internal.http.RealInterceptorChain.proceed(RealInterceptorChain.kt:100)
at org.influxdb.impl.GzipRequestInterceptor.intercept(GzipRequestInterceptor.java:42)
at okhttp3.internal.http.RealInterceptorChain.proceed(RealInterceptorChain.kt:100)
at okhttp3.logging.HttpLoggingInterceptor.intercept(HttpLoggingInterceptor.kt:152)
at okhttp3.internal.http.RealInterceptorChain.proceed(RealInterceptorChain.kt:100)
at okhttp3.internal.connection.RealCall.getResponseWithInterceptorChain$okhttp(RealCall.kt:197)
at okhttp3.internal.connection.RealCall.execute(RealCall.kt:148)
at retrofit2.OkHttpCall.execute(OkHttpCall.java:190)
at org.influxdb.impl.InfluxDBImpl.execute(InfluxDBImpl.java:824)
... 3 more
org.influxdb.InfluxDBIOException: java.net.SocketTimeoutException: connect timed out
at org.influxdb.impl.InfluxDBImpl.execute(InfluxDBImpl.java:836)
at org.influxdb.impl.InfluxDBImpl.executeQuery(InfluxDBImpl.java:819)
at org.influxdb.impl.InfluxDBImpl.query(InfluxDBImpl.java:554)
at org.apache.beam.sdk.io.influxdb.InfluxDbIOIT.clear(InfluxDbIOIT.java:88)
Caused by:
java.net.SocketTimeoutException: connect timed out
at java.net.PlainSocketImpl.socketConnect(Native Method)
at java.net.AbstractPlainSocketImpl.doConnect(AbstractPlainSocketImpl.java:350)
at java.net.AbstractPlainSocketImpl.connectToAddress(AbstractPlainSocketImpl.java:206)
at java.net.AbstractPlainSocketImpl.connect(AbstractPlainSocketImpl.java:188)
at java.net.SocksSocketImpl.connect(SocksSocketImpl.java:392)
at java.net.Socket.connect(Socket.java:607)
at okhttp3.internal.platform.Platform.connectSocket(Platform.kt:119)
at okhttp3.internal.connection.RealConnection.connectSocket(RealConnection.kt:283)
at okhttp3.internal.connection.RealConnection.connect(RealConnection.kt:195)
at okhttp3.internal.connection.ExchangeFinder.findConnection(ExchangeFinder.kt:249)
at okhttp3.internal.connection.ExchangeFinder.findHealthyConnection(ExchangeFinder.kt:108)
at okhttp3.internal.connection.ExchangeFinder.find(ExchangeFinder.kt:76)
at okhttp3.internal.connection.RealCall.initExchange$okhttp(RealCall.kt:245)
at okhttp3.internal.connection.ConnectInterceptor.intercept(ConnectInterceptor.kt:32)
at okhttp3.internal.http.RealInterceptorChain.proceed(RealInterceptorChain.kt:100)
at okhttp3.internal.cache.CacheInterceptor.intercept(CacheInterceptor.kt:82)
at okhttp3.internal.http.RealInterceptorChain.proceed(RealInterceptorChain.kt:100)
at okhttp3.internal.http.BridgeInterceptor.intercept(BridgeInterceptor.kt:83)
at okhttp3.internal.http.RealInterceptorChain.proceed(RealInterceptorChain.kt:100)
at okhttp3.internal.http.RetryAndFollowUpInterceptor.intercept(RetryAndFollowUpInterceptor.kt:76)
at okhttp3.internal.http.RealInterceptorChain.proceed(RealInterceptorChain.kt:100)
at org.influxdb.impl.BasicAuthInterceptor.intercept(BasicAuthInterceptor.java:22)
at okhttp3.internal.http.RealInterceptorChain.proceed(RealInterceptorChain.kt:100)
at org.influxdb.impl.GzipRequestInterceptor.intercept(GzipRequestInterceptor.java:42)
at okhttp3.internal.http.RealInterceptorChain.proceed(RealInterceptorChain.kt:100)
at okhttp3.logging.HttpLoggingInterceptor.intercept(HttpLoggingInterceptor.kt:152)
at okhttp3.internal.http.RealInterceptorChain.proceed(RealInterceptorChain.kt:100)
at okhttp3.internal.connection.RealCall.getResponseWithInterceptorChain$okhttp(RealCall.kt:197)
at okhttp3.internal.connection.RealCall.execute(RealCall.kt:148)
at retrofit2.OkHttpCall.execute(OkHttpCall.java:190)
at org.influxdb.impl.InfluxDBImpl.execute(InfluxDBImpl.java:824)
... 3 more
org.apache.beam.sdk.io.influxdb.InfluxDbIOIT > testZeroRecordFormNonExistentMetric FAILED
org.influxdb.InfluxDBIOException: java.net.SocketTimeoutException: connect timed out
at org.influxdb.impl.InfluxDBImpl.execute(InfluxDBImpl.java:836)
at org.influxdb.impl.InfluxDBImpl.executeQuery(InfluxDBImpl.java:819)
at org.influxdb.impl.InfluxDBImpl.query(InfluxDBImpl.java:554)
at org.apache.beam.sdk.io.influxdb.InfluxDbIOIT.initTest(InfluxDbIOIT.java:99)
Caused by:
java.net.SocketTimeoutException: connect timed out
at java.net.PlainSocketImpl.socketConnect(Native Method)
at java.net.AbstractPlainSocketImpl.doConnect(AbstractPlainSocketImpl.java:350)
at java.net.AbstractPlainSocketImpl.connectToAddress(AbstractPlainSocketImpl.java:206)
at java.net.AbstractPlainSocketImpl.connect(AbstractPlainSocketImpl.java:188)
at java.net.SocksSocketImpl.connect(SocksSocketImpl.java:392)
at java.net.Socket.connect(Socket.java:607)
at okhttp3.internal.platform.Platform.connectSocket(Platform.kt:119)
at okhttp3.internal.connection.RealConnection.connectSocket(RealConnection.kt:283)
at okhttp3.internal.connection.RealConnection.connect(RealConnection.kt:195)
at okhttp3.internal.connection.ExchangeFinder.findConnection(ExchangeFinder.kt:249)
at okhttp3.internal.connection.ExchangeFinder.findHealthyConnection(ExchangeFinder.kt:108)
at okhttp3.internal.connection.ExchangeFinder.find(ExchangeFinder.kt:76)
at okhttp3.internal.connection.RealCall.initExchange$okhttp(RealCall.kt:245)
at okhttp3.internal.connection.ConnectInterceptor.intercept(ConnectInterceptor.kt:32)
at okhttp3.internal.http.RealInterceptorChain.proceed(RealInterceptorChain.kt:100)
at okhttp3.internal.cache.CacheInterceptor.intercept(CacheInterceptor.kt:82)
at okhttp3.internal.http.RealInterceptorChain.proceed(RealInterceptorChain.kt:100)
at okhttp3.internal.http.BridgeInterceptor.intercept(BridgeInterceptor.kt:83)
at okhttp3.internal.http.RealInterceptorChain.proceed(RealInterceptorChain.kt:100)
at okhttp3.internal.http.RetryAndFollowUpInterceptor.intercept(RetryAndFollowUpInterceptor.kt:76)
at okhttp3.internal.http.RealInterceptorChain.proceed(RealInterceptorChain.kt:100)
at org.influxdb.impl.BasicAuthInterceptor.intercept(BasicAuthInterceptor.java:22)
at okhttp3.internal.http.RealInterceptorChain.proceed(RealInterceptorChain.kt:100)
at org.influxdb.impl.GzipRequestInterceptor.intercept(GzipRequestInterceptor.java:42)
at okhttp3.internal.http.RealInterceptorChain.proceed(RealInterceptorChain.kt:100)
at okhttp3.logging.HttpLoggingInterceptor.intercept(HttpLoggingInterceptor.kt:152)
at okhttp3.internal.http.RealInterceptorChain.proceed(RealInterceptorChain.kt:100)
at okhttp3.internal.connection.RealCall.getResponseWithInterceptorChain$okhttp(RealCall.kt:197)
at okhttp3.internal.connection.RealCall.execute(RealCall.kt:148)
at retrofit2.OkHttpCall.execute(OkHttpCall.java:190)
at org.influxdb.impl.InfluxDBImpl.execute(InfluxDBImpl.java:824)
... 3 more
Gradle Test Executor 9 finished executing tests.
> Task :sdks:java:io:influxdb:integrationTest FAILED
6 tests completed, 2 failed
Finished generating test XML results (0.004 secs) into: <https://ci-beam.apache.org/job/beam_PerformanceTests_InfluxDbIO_IT/ws/src/sdks/java/io/influxdb/build/test-results/integrationTest>
Generating HTML test report...
Finished generating test html results (0.003 secs) into: <https://ci-beam.apache.org/job/beam_PerformanceTests_InfluxDbIO_IT/ws/src/sdks/java/io/influxdb/build/reports/tests/integrationTest>
:sdks:java:io:influxdb:integrationTest (Thread[Execution worker Thread 2,5,main]) completed. Took 46.842 secs.
FAILURE: Build failed with an exception.
* What went wrong:
Execution failed for task ':sdks:java:io:influxdb:integrationTest'.
> There were failing tests. See the report at: file://<https://ci-beam.apache.org/job/beam_PerformanceTests_InfluxDbIO_IT/ws/src/sdks/java/io/influxdb/build/reports/tests/integrationTest/index.html>
* Try:
> Run with --stacktrace option to get the stack trace.
> Run with --debug option to get more log output.
* Get more help at https://help.gradle.org
Deprecated Gradle features were used in this build, making it incompatible with Gradle 8.0.
You can use '--warning-mode all' to show the individual deprecation warnings and determine if they come from your own scripts or plugins.
See https://docs.gradle.org/7.5.1/userguide/command_line_interface.html#sec:command_line_warnings
BUILD FAILED in 56s
77 actionable tasks: 42 executed, 33 from cache, 2 up-to-date
Publishing build scan...
https://gradle.com/s/fhuhfwbne7cli
Build step 'Invoke Gradle script' changed build result to FAILURE
Build step 'Invoke Gradle script' marked build as failure
---------------------------------------------------------------------
To unsubscribe, e-mail: builds-unsubscribe@beam.apache.org
For additional commands, e-mail: builds-help@beam.apache.org
Build failed in Jenkins: beam_PerformanceTests_InfluxDbIO_IT #2448
Posted by Apache Jenkins Server <je...@builds.apache.org>.
See <https://ci-beam.apache.org/job/beam_PerformanceTests_InfluxDbIO_IT/2448/display/redirect>
Changes:
------------------------------------------
[...truncated 187.45 KB...]
Loaded cache entry for task ':runners:java-fn-execution:compileJava' with cache key 86158a51c27cc249c846025f8e1c3ade
:runners:java-fn-execution:compileJava (Thread[Execution worker Thread 4,5,main]) completed. Took 0.116 secs.
Resolve mutations for :runners:java-fn-execution:classes (Thread[Execution worker Thread 2,5,main]) started.
Resolve mutations for :runners:java-fn-execution:classes (Thread[Execution worker Thread 2,5,main]) completed. Took 0.0 secs.
:runners:java-fn-execution:classes (Thread[Execution worker Thread 3,5,main]) started.
> Task :runners:java-fn-execution:classes UP-TO-DATE
Skipping task ':runners:java-fn-execution:classes' as it has no actions.
:runners:java-fn-execution:classes (Thread[Execution worker Thread 3,5,main]) completed. Took 0.0 secs.
Resolve mutations for :runners:java-fn-execution:jar (Thread[Execution worker Thread 4,5,main]) started.
Resolve mutations for :runners:java-fn-execution:jar (Thread[Execution worker Thread 4,5,main]) completed. Took 0.0 secs.
:runners:java-fn-execution:jar (Thread[Execution worker Thread 2,5,main]) started.
> Task :runners:java-fn-execution:jar
Caching disabled for task ':runners:java-fn-execution:jar' because:
Not worth caching
Task ':runners:java-fn-execution:jar' is not up-to-date because:
No history is available.
file or directory '<https://ci-beam.apache.org/job/beam_PerformanceTests_InfluxDbIO_IT/ws/src/runners/java-fn-execution/build/resources/main',> not found
:runners:java-fn-execution:jar (Thread[Execution worker Thread 2,5,main]) completed. Took 0.051 secs.
work action resolve beam-runners-java-fn-execution.jar (project :runners:java-fn-execution) (Thread[Execution worker Thread 6,5,main]) started.
work action null (Thread[Execution worker Thread 6,5,main]) completed. Took 0.0 secs.
Resolve mutations for :runners:direct-java:compileJava (Thread[Execution worker Thread 3,5,main]) started.
Resolve mutations for :runners:direct-java:compileJava (Thread[Execution worker Thread 3,5,main]) completed. Took 0.0 secs.
:runners:direct-java:compileJava (Thread[Execution worker Thread 2,5,main]) started.
> Task :runners:core-java:compileTestJava FROM-CACHE
Custom actions are attached to task ':runners:core-java:compileTestJava'.
Build cache key for task ':runners:core-java:compileTestJava' is 19f8749b18e66e785918429dd3976a3c
Task ':runners:core-java:compileTestJava' is not up-to-date because:
No history is available.
Loaded cache entry for task ':runners:core-java:compileTestJava' with cache key 19f8749b18e66e785918429dd3976a3c
:runners:core-java:compileTestJava (Thread[Execution worker,5,main]) completed. Took 0.411 secs.
Resolve mutations for :runners:core-java:testClasses (Thread[Execution worker Thread 5,5,main]) started.
Resolve mutations for :runners:core-java:testClasses (Thread[Execution worker Thread 5,5,main]) completed. Took 0.0 secs.
:runners:core-java:testClasses (Thread[Execution worker Thread 3,5,main]) started.
> Task :runners:core-java:testClasses UP-TO-DATE
Skipping task ':runners:core-java:testClasses' as it has no actions.
:runners:core-java:testClasses (Thread[Execution worker Thread 3,5,main]) completed. Took 0.0 secs.
Resolve mutations for :runners:core-java:testJar (Thread[Execution worker,5,main]) started.
Resolve mutations for :runners:core-java:testJar (Thread[Execution worker,5,main]) completed. Took 0.0 secs.
:runners:core-java:testJar (Thread[Execution worker Thread 5,5,main]) started.
> Task :runners:direct-java:compileJava FROM-CACHE
Custom actions are attached to task ':runners:direct-java:compileJava'.
Build cache key for task ':runners:direct-java:compileJava' is 7deb0fba8cd9e3a4714b01f8a61b6ab5
Task ':runners:direct-java:compileJava' is not up-to-date because:
No history is available.
Loaded cache entry for task ':runners:direct-java:compileJava' with cache key 7deb0fba8cd9e3a4714b01f8a61b6ab5
:runners:direct-java:compileJava (Thread[Execution worker Thread 2,5,main]) completed. Took 0.13 secs.
Resolve mutations for :runners:direct-java:classes (Thread[Execution worker Thread 6,5,main]) started.
Resolve mutations for :runners:direct-java:classes (Thread[Execution worker Thread 6,5,main]) completed. Took 0.0 secs.
:runners:direct-java:classes (Thread[Execution worker,5,main]) started.
> Task :runners:direct-java:classes UP-TO-DATE
Skipping task ':runners:direct-java:classes' as it has no actions.
:runners:direct-java:classes (Thread[Execution worker,5,main]) completed. Took 0.0 secs.
Resolve mutations for :runners:direct-java:shadowJar (Thread[Execution worker Thread 2,5,main]) started.
Resolve mutations for :runners:direct-java:shadowJar (Thread[Execution worker Thread 2,5,main]) completed. Took 0.0 secs.
:runners:direct-java:shadowJar (Thread[Execution worker Thread 6,5,main]) started.
> Task :runners:core-java:testJar
Caching disabled for task ':runners:core-java:testJar' because:
Not worth caching
Task ':runners:core-java:testJar' is not up-to-date because:
No history is available.
file or directory '<https://ci-beam.apache.org/job/beam_PerformanceTests_InfluxDbIO_IT/ws/src/runners/core-java/build/resources/test',> not found
:runners:core-java:testJar (Thread[Execution worker Thread 5,5,main]) completed. Took 0.092 secs.
work action resolve beam-runners-core-java-tests.jar (project :runners:core-java) (Thread[Execution worker Thread 3,5,main]) started.
work action null (Thread[Execution worker Thread 3,5,main]) completed. Took 0.0 secs.
> Task :runners:direct-java:shadowJar FROM-CACHE
Custom actions are attached to task ':runners:direct-java:shadowJar'.
Build cache key for task ':runners:direct-java:shadowJar' is 9914d7cee604e577d0118818dcf3899d
Task ':runners:direct-java:shadowJar' is not up-to-date because:
No history is available.
Loaded cache entry for task ':runners:direct-java:shadowJar' with cache key 9914d7cee604e577d0118818dcf3899d
:runners:direct-java:shadowJar (Thread[Execution worker Thread 6,5,main]) completed. Took 0.381 secs.
work action resolve beam-runners-direct-java.jar (project :runners:direct-java) (Thread[Execution worker Thread 5,5,main]) started.
work action null (Thread[Execution worker Thread 5,5,main]) completed. Took 0.0 secs.
work action resolve beam-runners-direct-java.jar (project :runners:direct-java) (Thread[Execution worker,5,main]) started.
work action null (Thread[Execution worker,5,main]) completed. Took 0.0 secs.
Resolve mutations for :runners:direct-java:compileTestJava (Thread[Execution worker Thread 6,5,main]) started.
Resolve mutations for :runners:direct-java:compileTestJava (Thread[Execution worker Thread 6,5,main]) completed. Took 0.0 secs.
:runners:direct-java:compileTestJava (Thread[Execution worker Thread 5,5,main]) started.
> Task :runners:direct-java:compileTestJava FROM-CACHE
Custom actions are attached to task ':runners:direct-java:compileTestJava'.
Build cache key for task ':runners:direct-java:compileTestJava' is aeb5c33dcb78e29cbf2b0c27365fb8d0
Task ':runners:direct-java:compileTestJava' is not up-to-date because:
No history is available.
Loaded cache entry for task ':runners:direct-java:compileTestJava' with cache key aeb5c33dcb78e29cbf2b0c27365fb8d0
:runners:direct-java:compileTestJava (Thread[Execution worker Thread 5,5,main]) completed. Took 0.114 secs.
Resolve mutations for :runners:direct-java:testClasses (Thread[Execution worker Thread 6,5,main]) started.
Resolve mutations for :runners:direct-java:testClasses (Thread[Execution worker Thread 6,5,main]) completed. Took 0.0 secs.
:runners:direct-java:testClasses (Thread[Execution worker Thread 3,5,main]) started.
> Task :runners:direct-java:testClasses UP-TO-DATE
Skipping task ':runners:direct-java:testClasses' as it has no actions.
:runners:direct-java:testClasses (Thread[Execution worker Thread 3,5,main]) completed. Took 0.0 secs.
Resolve mutations for :runners:direct-java:shadowTestJar (Thread[Execution worker Thread 5,5,main]) started.
Resolve mutations for :runners:direct-java:shadowTestJar (Thread[Execution worker Thread 5,5,main]) completed. Took 0.0 secs.
:runners:direct-java:shadowTestJar (Thread[Execution worker Thread 6,5,main]) started.
> Task :runners:direct-java:shadowTestJar FROM-CACHE
Build cache key for task ':runners:direct-java:shadowTestJar' is 2f9008d621b1aabd1a6466302fc8f48b
Task ':runners:direct-java:shadowTestJar' is not up-to-date because:
No history is available.
Loaded cache entry for task ':runners:direct-java:shadowTestJar' with cache key 2f9008d621b1aabd1a6466302fc8f48b
:runners:direct-java:shadowTestJar (Thread[Execution worker Thread 6,5,main]) completed. Took 0.23 secs.
work action resolve beam-runners-direct-java-tests.jar (project :runners:direct-java) (Thread[Execution worker Thread 3,5,main]) started.
work action null (Thread[Execution worker Thread 3,5,main]) completed. Took 0.0 secs.
Resolve mutations for :sdks:java:io:influxdb:integrationTest (Thread[Execution worker Thread 5,5,main]) started.
Resolve mutations for :sdks:java:io:influxdb:integrationTest (Thread[Execution worker Thread 5,5,main]) completed. Took 0.0 secs.
:sdks:java:io:influxdb:integrationTest (Thread[Execution worker Thread 6,5,main]) started.
producer locations for task group 0 (Thread[Execution worker Thread 4,5,main]) started.
producer locations for task group 0 (Thread[Execution worker Thread 4,5,main]) completed. Took 0.0 secs.
Gradle Test Executor 1 started executing tests.
> Task :sdks:java:io:influxdb:integrationTest
Custom actions are attached to task ':sdks:java:io:influxdb:integrationTest'.
Build cache key for task ':sdks:java:io:influxdb:integrationTest' is 2192952a3840e97770f42d65d37a860b
Task ':sdks:java:io:influxdb:integrationTest' is not up-to-date because:
Task.upToDateWhen is false.
Starting process 'Gradle Test Executor 1'. Working directory: <https://ci-beam.apache.org/job/beam_PerformanceTests_InfluxDbIO_IT/ws/src/sdks/java/io/influxdb> Command: /usr/lib/jvm/java-8-openjdk-amd64/bin/java -DbeamTestPipelineOptions=["--influxDBURL=http://34.69.36.232:8086","--influxDBUserName=superadmin","--influxDBPassword=supersecretpassword","--databaseName=db1"] -Djava.security.manager=worker.org.gradle.process.internal.worker.child.BootstrapSecurityManager -Dorg.gradle.internal.worker.tmpdir=<https://ci-beam.apache.org/job/beam_PerformanceTests_InfluxDbIO_IT/ws/src/sdks/java/io/influxdb/build/tmp/integrationTest/work> -Dorg.gradle.native=false -Xmx2g -Dfile.encoding=UTF-8 -Duser.country=US -Duser.language=en -Duser.variant -ea -cp /home/jenkins/.gradle/caches/7.5.1/workerMain/gradle-worker.jar worker.org.gradle.process.internal.worker.GradleWorkerMain 'Gradle Test Executor 1'
Successfully started process 'Gradle Test Executor 1'
org.apache.beam.sdk.io.influxdb.InfluxDbIOIT > testWriteAndReadWithMultipleMetric FAILED
org.influxdb.InfluxDBIOException: java.net.SocketTimeoutException: connect timed out
at org.influxdb.impl.InfluxDBImpl.execute(InfluxDBImpl.java:836)
at org.influxdb.impl.InfluxDBImpl.executeQuery(InfluxDBImpl.java:819)
at org.influxdb.impl.InfluxDBImpl.query(InfluxDBImpl.java:554)
at org.apache.beam.sdk.io.influxdb.InfluxDbIOIT.initTest(InfluxDbIOIT.java:99)
Caused by:
java.net.SocketTimeoutException: connect timed out
at java.net.PlainSocketImpl.socketConnect(Native Method)
at java.net.AbstractPlainSocketImpl.doConnect(AbstractPlainSocketImpl.java:350)
at java.net.AbstractPlainSocketImpl.connectToAddress(AbstractPlainSocketImpl.java:206)
at java.net.AbstractPlainSocketImpl.connect(AbstractPlainSocketImpl.java:188)
at java.net.SocksSocketImpl.connect(SocksSocketImpl.java:392)
at java.net.Socket.connect(Socket.java:607)
at okhttp3.internal.platform.Platform.connectSocket(Platform.kt:119)
at okhttp3.internal.connection.RealConnection.connectSocket(RealConnection.kt:283)
at okhttp3.internal.connection.RealConnection.connect(RealConnection.kt:195)
at okhttp3.internal.connection.ExchangeFinder.findConnection(ExchangeFinder.kt:249)
at okhttp3.internal.connection.ExchangeFinder.findHealthyConnection(ExchangeFinder.kt:108)
at okhttp3.internal.connection.ExchangeFinder.find(ExchangeFinder.kt:76)
at okhttp3.internal.connection.RealCall.initExchange$okhttp(RealCall.kt:245)
at okhttp3.internal.connection.ConnectInterceptor.intercept(ConnectInterceptor.kt:32)
at okhttp3.internal.http.RealInterceptorChain.proceed(RealInterceptorChain.kt:100)
at okhttp3.internal.cache.CacheInterceptor.intercept(CacheInterceptor.kt:82)
at okhttp3.internal.http.RealInterceptorChain.proceed(RealInterceptorChain.kt:100)
at okhttp3.internal.http.BridgeInterceptor.intercept(BridgeInterceptor.kt:83)
at okhttp3.internal.http.RealInterceptorChain.proceed(RealInterceptorChain.kt:100)
at okhttp3.internal.http.RetryAndFollowUpInterceptor.intercept(RetryAndFollowUpInterceptor.kt:76)
at okhttp3.internal.http.RealInterceptorChain.proceed(RealInterceptorChain.kt:100)
at org.influxdb.impl.BasicAuthInterceptor.intercept(BasicAuthInterceptor.java:22)
at okhttp3.internal.http.RealInterceptorChain.proceed(RealInterceptorChain.kt:100)
at org.influxdb.impl.GzipRequestInterceptor.intercept(GzipRequestInterceptor.java:42)
at okhttp3.internal.http.RealInterceptorChain.proceed(RealInterceptorChain.kt:100)
at okhttp3.logging.HttpLoggingInterceptor.intercept(HttpLoggingInterceptor.kt:152)
at okhttp3.internal.http.RealInterceptorChain.proceed(RealInterceptorChain.kt:100)
at okhttp3.internal.connection.RealCall.getResponseWithInterceptorChain$okhttp(RealCall.kt:197)
at okhttp3.internal.connection.RealCall.execute(RealCall.kt:148)
at retrofit2.OkHttpCall.execute(OkHttpCall.java:190)
at org.influxdb.impl.InfluxDBImpl.execute(InfluxDBImpl.java:824)
... 3 more
org.influxdb.InfluxDBIOException: java.net.SocketTimeoutException: connect timed out
at org.influxdb.impl.InfluxDBImpl.execute(InfluxDBImpl.java:836)
at org.influxdb.impl.InfluxDBImpl.executeQuery(InfluxDBImpl.java:819)
at org.influxdb.impl.InfluxDBImpl.query(InfluxDBImpl.java:554)
at org.apache.beam.sdk.io.influxdb.InfluxDbIOIT.clear(InfluxDbIOIT.java:88)
Caused by:
java.net.SocketTimeoutException: connect timed out
at java.net.PlainSocketImpl.socketConnect(Native Method)
at java.net.AbstractPlainSocketImpl.doConnect(AbstractPlainSocketImpl.java:350)
at java.net.AbstractPlainSocketImpl.connectToAddress(AbstractPlainSocketImpl.java:206)
at java.net.AbstractPlainSocketImpl.connect(AbstractPlainSocketImpl.java:188)
at java.net.SocksSocketImpl.connect(SocksSocketImpl.java:392)
at java.net.Socket.connect(Socket.java:607)
at okhttp3.internal.platform.Platform.connectSocket(Platform.kt:119)
at okhttp3.internal.connection.RealConnection.connectSocket(RealConnection.kt:283)
at okhttp3.internal.connection.RealConnection.connect(RealConnection.kt:195)
at okhttp3.internal.connection.ExchangeFinder.findConnection(ExchangeFinder.kt:249)
at okhttp3.internal.connection.ExchangeFinder.findHealthyConnection(ExchangeFinder.kt:108)
at okhttp3.internal.connection.ExchangeFinder.find(ExchangeFinder.kt:76)
at okhttp3.internal.connection.RealCall.initExchange$okhttp(RealCall.kt:245)
at okhttp3.internal.connection.ConnectInterceptor.intercept(ConnectInterceptor.kt:32)
at okhttp3.internal.http.RealInterceptorChain.proceed(RealInterceptorChain.kt:100)
at okhttp3.internal.cache.CacheInterceptor.intercept(CacheInterceptor.kt:82)
at okhttp3.internal.http.RealInterceptorChain.proceed(RealInterceptorChain.kt:100)
at okhttp3.internal.http.BridgeInterceptor.intercept(BridgeInterceptor.kt:83)
at okhttp3.internal.http.RealInterceptorChain.proceed(RealInterceptorChain.kt:100)
at okhttp3.internal.http.RetryAndFollowUpInterceptor.intercept(RetryAndFollowUpInterceptor.kt:76)
at okhttp3.internal.http.RealInterceptorChain.proceed(RealInterceptorChain.kt:100)
at org.influxdb.impl.BasicAuthInterceptor.intercept(BasicAuthInterceptor.java:22)
at okhttp3.internal.http.RealInterceptorChain.proceed(RealInterceptorChain.kt:100)
at org.influxdb.impl.GzipRequestInterceptor.intercept(GzipRequestInterceptor.java:42)
at okhttp3.internal.http.RealInterceptorChain.proceed(RealInterceptorChain.kt:100)
at okhttp3.logging.HttpLoggingInterceptor.intercept(HttpLoggingInterceptor.kt:152)
at okhttp3.internal.http.RealInterceptorChain.proceed(RealInterceptorChain.kt:100)
at okhttp3.internal.connection.RealCall.getResponseWithInterceptorChain$okhttp(RealCall.kt:197)
at okhttp3.internal.connection.RealCall.execute(RealCall.kt:148)
at retrofit2.OkHttpCall.execute(OkHttpCall.java:190)
at org.influxdb.impl.InfluxDBImpl.execute(InfluxDBImpl.java:824)
... 3 more
Gradle Test Executor 1 finished executing tests.
> Task :sdks:java:io:influxdb:integrationTest
6 tests completed, 1 failed
Finished generating test XML results (0.02 secs) into: <https://ci-beam.apache.org/job/beam_PerformanceTests_InfluxDbIO_IT/ws/src/sdks/java/io/influxdb/build/test-results/integrationTest>
Generating HTML test report...
Finished generating test html results (0.024 secs) into: <https://ci-beam.apache.org/job/beam_PerformanceTests_InfluxDbIO_IT/ws/src/sdks/java/io/influxdb/build/reports/tests/integrationTest>
> Task :sdks:java:io:influxdb:integrationTest FAILED
:sdks:java:io:influxdb:integrationTest (Thread[Execution worker Thread 6,5,main]) completed. Took 27.739 secs.
FAILURE: Build failed with an exception.
* What went wrong:
Execution failed for task ':sdks:java:io:influxdb:integrationTest'.
> There were failing tests. See the report at: file://<https://ci-beam.apache.org/job/beam_PerformanceTests_InfluxDbIO_IT/ws/src/sdks/java/io/influxdb/build/reports/tests/integrationTest/index.html>
* Try:
> Run with --stacktrace option to get the stack trace.
> Run with --debug option to get more log output.
* Get more help at https://help.gradle.org
Deprecated Gradle features were used in this build, making it incompatible with Gradle 8.0.
You can use '--warning-mode all' to show the individual deprecation warnings and determine if they come from your own scripts or plugins.
See https://docs.gradle.org/7.5.1/userguide/command_line_interface.html#sec:command_line_warnings
BUILD FAILED in 54s
77 actionable tasks: 42 executed, 33 from cache, 2 up-to-date
Publishing build scan...
https://gradle.com/s/weo6qrpmvr3dg
Build step 'Invoke Gradle script' changed build result to FAILURE
Build step 'Invoke Gradle script' marked build as failure
---------------------------------------------------------------------
To unsubscribe, e-mail: builds-unsubscribe@beam.apache.org
For additional commands, e-mail: builds-help@beam.apache.org
Build failed in Jenkins: beam_PerformanceTests_InfluxDbIO_IT #2447
Posted by Apache Jenkins Server <je...@builds.apache.org>.
See <https://ci-beam.apache.org/job/beam_PerformanceTests_InfluxDbIO_IT/2447/display/redirect>
Changes:
------------------------------------------
[...truncated 197.74 KB...]
Resolve mutations for :runners:direct-java:compileTestJava (Thread[Execution worker Thread 5,5,main]) started.
Resolve mutations for :runners:direct-java:compileTestJava (Thread[Execution worker Thread 5,5,main]) completed. Took 0.0 secs.
:runners:direct-java:compileTestJava (Thread[Execution worker Thread 2,5,main]) started.
> Task :runners:direct-java:compileTestJava FROM-CACHE
Custom actions are attached to task ':runners:direct-java:compileTestJava'.
Build cache key for task ':runners:direct-java:compileTestJava' is aeb5c33dcb78e29cbf2b0c27365fb8d0
Task ':runners:direct-java:compileTestJava' is not up-to-date because:
No history is available.
Loaded cache entry for task ':runners:direct-java:compileTestJava' with cache key aeb5c33dcb78e29cbf2b0c27365fb8d0
:runners:direct-java:compileTestJava (Thread[Execution worker Thread 2,5,main]) completed. Took 0.113 secs.
Resolve mutations for :runners:direct-java:testClasses (Thread[Execution worker Thread 4,5,main]) started.
Resolve mutations for :runners:direct-java:testClasses (Thread[Execution worker Thread 4,5,main]) completed. Took 0.0 secs.
:runners:direct-java:testClasses (Thread[Execution worker Thread 7,5,main]) started.
> Task :runners:direct-java:testClasses UP-TO-DATE
Skipping task ':runners:direct-java:testClasses' as it has no actions.
:runners:direct-java:testClasses (Thread[Execution worker Thread 7,5,main]) completed. Took 0.0 secs.
Resolve mutations for :runners:direct-java:shadowTestJar (Thread[Execution worker Thread 5,5,main]) started.
Resolve mutations for :runners:direct-java:shadowTestJar (Thread[Execution worker Thread 5,5,main]) completed. Took 0.0 secs.
:runners:direct-java:shadowTestJar (Thread[Execution worker Thread 4,5,main]) started.
> Task :runners:direct-java:shadowTestJar FROM-CACHE
Build cache key for task ':runners:direct-java:shadowTestJar' is 2f9008d621b1aabd1a6466302fc8f48b
Task ':runners:direct-java:shadowTestJar' is not up-to-date because:
No history is available.
Loaded cache entry for task ':runners:direct-java:shadowTestJar' with cache key 2f9008d621b1aabd1a6466302fc8f48b
:runners:direct-java:shadowTestJar (Thread[Execution worker Thread 4,5,main]) completed. Took 0.227 secs.
work action resolve beam-runners-direct-java-tests.jar (project :runners:direct-java) (Thread[Execution worker Thread 4,5,main]) started.
work action null (Thread[Execution worker Thread 4,5,main]) completed. Took 0.0 secs.
Resolve mutations for :sdks:java:io:influxdb:integrationTest (Thread[Execution worker Thread 4,5,main]) started.
Resolve mutations for :sdks:java:io:influxdb:integrationTest (Thread[Execution worker Thread 4,5,main]) completed. Took 0.0 secs.
:sdks:java:io:influxdb:integrationTest (Thread[Execution worker Thread 3,5,main]) started.
producer locations for task group 0 (Thread[Execution worker Thread 7,5,main]) started.
producer locations for task group 0 (Thread[Execution worker Thread 7,5,main]) completed. Took 0.0 secs.
Gradle Test Executor 1 started executing tests.
> Task :sdks:java:io:influxdb:integrationTest
Custom actions are attached to task ':sdks:java:io:influxdb:integrationTest'.
Build cache key for task ':sdks:java:io:influxdb:integrationTest' is 2192952a3840e97770f42d65d37a860b
Task ':sdks:java:io:influxdb:integrationTest' is not up-to-date because:
Task.upToDateWhen is false.
Starting process 'Gradle Test Executor 1'. Working directory: <https://ci-beam.apache.org/job/beam_PerformanceTests_InfluxDbIO_IT/ws/src/sdks/java/io/influxdb> Command: /usr/lib/jvm/java-8-openjdk-amd64/bin/java -DbeamTestPipelineOptions=["--influxDBURL=http://34.172.171.132:8086","--influxDBUserName=superadmin","--influxDBPassword=supersecretpassword","--databaseName=db1"] -Djava.security.manager=worker.org.gradle.process.internal.worker.child.BootstrapSecurityManager -Dorg.gradle.internal.worker.tmpdir=<https://ci-beam.apache.org/job/beam_PerformanceTests_InfluxDbIO_IT/ws/src/sdks/java/io/influxdb/build/tmp/integrationTest/work> -Dorg.gradle.native=false -Xmx2g -Dfile.encoding=UTF-8 -Duser.country=US -Duser.language=en -Duser.variant -ea -cp /home/jenkins/.gradle/caches/7.5.1/workerMain/gradle-worker.jar worker.org.gradle.process.internal.worker.GradleWorkerMain 'Gradle Test Executor 1'
Successfully started process 'Gradle Test Executor 1'
org.apache.beam.sdk.io.influxdb.InfluxDbIOIT > testWriteAndReadWithMultipleMetric FAILED
org.influxdb.InfluxDBIOException: java.net.SocketTimeoutException: connect timed out
at org.influxdb.impl.InfluxDBImpl.execute(InfluxDBImpl.java:836)
at org.influxdb.impl.InfluxDBImpl.executeQuery(InfluxDBImpl.java:819)
at org.influxdb.impl.InfluxDBImpl.query(InfluxDBImpl.java:554)
at org.apache.beam.sdk.io.influxdb.InfluxDbIOIT.initTest(InfluxDbIOIT.java:99)
Caused by:
java.net.SocketTimeoutException: connect timed out
at java.net.PlainSocketImpl.socketConnect(Native Method)
at java.net.AbstractPlainSocketImpl.doConnect(AbstractPlainSocketImpl.java:350)
at java.net.AbstractPlainSocketImpl.connectToAddress(AbstractPlainSocketImpl.java:206)
at java.net.AbstractPlainSocketImpl.connect(AbstractPlainSocketImpl.java:188)
at java.net.SocksSocketImpl.connect(SocksSocketImpl.java:392)
at java.net.Socket.connect(Socket.java:607)
at okhttp3.internal.platform.Platform.connectSocket(Platform.kt:119)
at okhttp3.internal.connection.RealConnection.connectSocket(RealConnection.kt:283)
at okhttp3.internal.connection.RealConnection.connect(RealConnection.kt:195)
at okhttp3.internal.connection.ExchangeFinder.findConnection(ExchangeFinder.kt:249)
at okhttp3.internal.connection.ExchangeFinder.findHealthyConnection(ExchangeFinder.kt:108)
at okhttp3.internal.connection.ExchangeFinder.find(ExchangeFinder.kt:76)
at okhttp3.internal.connection.RealCall.initExchange$okhttp(RealCall.kt:245)
at okhttp3.internal.connection.ConnectInterceptor.intercept(ConnectInterceptor.kt:32)
at okhttp3.internal.http.RealInterceptorChain.proceed(RealInterceptorChain.kt:100)
at okhttp3.internal.cache.CacheInterceptor.intercept(CacheInterceptor.kt:82)
at okhttp3.internal.http.RealInterceptorChain.proceed(RealInterceptorChain.kt:100)
at okhttp3.internal.http.BridgeInterceptor.intercept(BridgeInterceptor.kt:83)
at okhttp3.internal.http.RealInterceptorChain.proceed(RealInterceptorChain.kt:100)
at okhttp3.internal.http.RetryAndFollowUpInterceptor.intercept(RetryAndFollowUpInterceptor.kt:76)
at okhttp3.internal.http.RealInterceptorChain.proceed(RealInterceptorChain.kt:100)
at org.influxdb.impl.BasicAuthInterceptor.intercept(BasicAuthInterceptor.java:22)
at okhttp3.internal.http.RealInterceptorChain.proceed(RealInterceptorChain.kt:100)
at org.influxdb.impl.GzipRequestInterceptor.intercept(GzipRequestInterceptor.java:42)
at okhttp3.internal.http.RealInterceptorChain.proceed(RealInterceptorChain.kt:100)
at okhttp3.logging.HttpLoggingInterceptor.intercept(HttpLoggingInterceptor.kt:152)
at okhttp3.internal.http.RealInterceptorChain.proceed(RealInterceptorChain.kt:100)
at okhttp3.internal.connection.RealCall.getResponseWithInterceptorChain$okhttp(RealCall.kt:197)
at okhttp3.internal.connection.RealCall.execute(RealCall.kt:148)
at retrofit2.OkHttpCall.execute(OkHttpCall.java:190)
at org.influxdb.impl.InfluxDBImpl.execute(InfluxDBImpl.java:824)
... 3 more
org.influxdb.InfluxDBIOException: java.net.SocketTimeoutException: connect timed out
at org.influxdb.impl.InfluxDBImpl.execute(InfluxDBImpl.java:836)
at org.influxdb.impl.InfluxDBImpl.executeQuery(InfluxDBImpl.java:819)
at org.influxdb.impl.InfluxDBImpl.query(InfluxDBImpl.java:554)
at org.apache.beam.sdk.io.influxdb.InfluxDbIOIT.clear(InfluxDbIOIT.java:88)
Caused by:
java.net.SocketTimeoutException: connect timed out
at java.net.PlainSocketImpl.socketConnect(Native Method)
at java.net.AbstractPlainSocketImpl.doConnect(AbstractPlainSocketImpl.java:350)
at java.net.AbstractPlainSocketImpl.connectToAddress(AbstractPlainSocketImpl.java:206)
at java.net.AbstractPlainSocketImpl.connect(AbstractPlainSocketImpl.java:188)
at java.net.SocksSocketImpl.connect(SocksSocketImpl.java:392)
at java.net.Socket.connect(Socket.java:607)
at okhttp3.internal.platform.Platform.connectSocket(Platform.kt:119)
at okhttp3.internal.connection.RealConnection.connectSocket(RealConnection.kt:283)
at okhttp3.internal.connection.RealConnection.connect(RealConnection.kt:195)
at okhttp3.internal.connection.ExchangeFinder.findConnection(ExchangeFinder.kt:249)
at okhttp3.internal.connection.ExchangeFinder.findHealthyConnection(ExchangeFinder.kt:108)
at okhttp3.internal.connection.ExchangeFinder.find(ExchangeFinder.kt:76)
at okhttp3.internal.connection.RealCall.initExchange$okhttp(RealCall.kt:245)
at okhttp3.internal.connection.ConnectInterceptor.intercept(ConnectInterceptor.kt:32)
at okhttp3.internal.http.RealInterceptorChain.proceed(RealInterceptorChain.kt:100)
at okhttp3.internal.cache.CacheInterceptor.intercept(CacheInterceptor.kt:82)
at okhttp3.internal.http.RealInterceptorChain.proceed(RealInterceptorChain.kt:100)
at okhttp3.internal.http.BridgeInterceptor.intercept(BridgeInterceptor.kt:83)
at okhttp3.internal.http.RealInterceptorChain.proceed(RealInterceptorChain.kt:100)
at okhttp3.internal.http.RetryAndFollowUpInterceptor.intercept(RetryAndFollowUpInterceptor.kt:76)
at okhttp3.internal.http.RealInterceptorChain.proceed(RealInterceptorChain.kt:100)
at org.influxdb.impl.BasicAuthInterceptor.intercept(BasicAuthInterceptor.java:22)
at okhttp3.internal.http.RealInterceptorChain.proceed(RealInterceptorChain.kt:100)
at org.influxdb.impl.GzipRequestInterceptor.intercept(GzipRequestInterceptor.java:42)
at okhttp3.internal.http.RealInterceptorChain.proceed(RealInterceptorChain.kt:100)
at okhttp3.logging.HttpLoggingInterceptor.intercept(HttpLoggingInterceptor.kt:152)
at okhttp3.internal.http.RealInterceptorChain.proceed(RealInterceptorChain.kt:100)
at okhttp3.internal.connection.RealCall.getResponseWithInterceptorChain$okhttp(RealCall.kt:197)
at okhttp3.internal.connection.RealCall.execute(RealCall.kt:148)
at retrofit2.OkHttpCall.execute(OkHttpCall.java:190)
at org.influxdb.impl.InfluxDBImpl.execute(InfluxDBImpl.java:824)
... 3 more
org.apache.beam.sdk.io.influxdb.InfluxDbIOIT > testZeroRecordFormNonExistentMetric FAILED
org.influxdb.InfluxDBIOException: java.net.SocketTimeoutException: connect timed out
at org.influxdb.impl.InfluxDBImpl.execute(InfluxDBImpl.java:836)
at org.influxdb.impl.InfluxDBImpl.executeQuery(InfluxDBImpl.java:819)
at org.influxdb.impl.InfluxDBImpl.query(InfluxDBImpl.java:554)
at org.apache.beam.sdk.io.influxdb.InfluxDbIOIT.initTest(InfluxDbIOIT.java:99)
Caused by:
java.net.SocketTimeoutException: connect timed out
at java.net.PlainSocketImpl.socketConnect(Native Method)
at java.net.AbstractPlainSocketImpl.doConnect(AbstractPlainSocketImpl.java:350)
at java.net.AbstractPlainSocketImpl.connectToAddress(AbstractPlainSocketImpl.java:206)
at java.net.AbstractPlainSocketImpl.connect(AbstractPlainSocketImpl.java:188)
at java.net.SocksSocketImpl.connect(SocksSocketImpl.java:392)
at java.net.Socket.connect(Socket.java:607)
at okhttp3.internal.platform.Platform.connectSocket(Platform.kt:119)
at okhttp3.internal.connection.RealConnection.connectSocket(RealConnection.kt:283)
at okhttp3.internal.connection.RealConnection.connect(RealConnection.kt:195)
at okhttp3.internal.connection.ExchangeFinder.findConnection(ExchangeFinder.kt:249)
at okhttp3.internal.connection.ExchangeFinder.findHealthyConnection(ExchangeFinder.kt:108)
at okhttp3.internal.connection.ExchangeFinder.find(ExchangeFinder.kt:76)
at okhttp3.internal.connection.RealCall.initExchange$okhttp(RealCall.kt:245)
at okhttp3.internal.connection.ConnectInterceptor.intercept(ConnectInterceptor.kt:32)
at okhttp3.internal.http.RealInterceptorChain.proceed(RealInterceptorChain.kt:100)
at okhttp3.internal.cache.CacheInterceptor.intercept(CacheInterceptor.kt:82)
at okhttp3.internal.http.RealInterceptorChain.proceed(RealInterceptorChain.kt:100)
at okhttp3.internal.http.BridgeInterceptor.intercept(BridgeInterceptor.kt:83)
at okhttp3.internal.http.RealInterceptorChain.proceed(RealInterceptorChain.kt:100)
at okhttp3.internal.http.RetryAndFollowUpInterceptor.intercept(RetryAndFollowUpInterceptor.kt:76)
at okhttp3.internal.http.RealInterceptorChain.proceed(RealInterceptorChain.kt:100)
at org.influxdb.impl.BasicAuthInterceptor.intercept(BasicAuthInterceptor.java:22)
at okhttp3.internal.http.RealInterceptorChain.proceed(RealInterceptorChain.kt:100)
at org.influxdb.impl.GzipRequestInterceptor.intercept(GzipRequestInterceptor.java:42)
at okhttp3.internal.http.RealInterceptorChain.proceed(RealInterceptorChain.kt:100)
at okhttp3.logging.HttpLoggingInterceptor.intercept(HttpLoggingInterceptor.kt:152)
at okhttp3.internal.http.RealInterceptorChain.proceed(RealInterceptorChain.kt:100)
at okhttp3.internal.connection.RealCall.getResponseWithInterceptorChain$okhttp(RealCall.kt:197)
at okhttp3.internal.connection.RealCall.execute(RealCall.kt:148)
at retrofit2.OkHttpCall.execute(OkHttpCall.java:190)
at org.influxdb.impl.InfluxDBImpl.execute(InfluxDBImpl.java:824)
... 3 more
org.influxdb.InfluxDBIOException: java.net.SocketTimeoutException: connect timed out
at org.influxdb.impl.InfluxDBImpl.execute(InfluxDBImpl.java:836)
at org.influxdb.impl.InfluxDBImpl.executeQuery(InfluxDBImpl.java:819)
at org.influxdb.impl.InfluxDBImpl.query(InfluxDBImpl.java:554)
at org.apache.beam.sdk.io.influxdb.InfluxDbIOIT.clear(InfluxDbIOIT.java:88)
Caused by:
java.net.SocketTimeoutException: connect timed out
at java.net.PlainSocketImpl.socketConnect(Native Method)
at java.net.AbstractPlainSocketImpl.doConnect(AbstractPlainSocketImpl.java:350)
at java.net.AbstractPlainSocketImpl.connectToAddress(AbstractPlainSocketImpl.java:206)
at java.net.AbstractPlainSocketImpl.connect(AbstractPlainSocketImpl.java:188)
at java.net.SocksSocketImpl.connect(SocksSocketImpl.java:392)
at java.net.Socket.connect(Socket.java:607)
at okhttp3.internal.platform.Platform.connectSocket(Platform.kt:119)
at okhttp3.internal.connection.RealConnection.connectSocket(RealConnection.kt:283)
at okhttp3.internal.connection.RealConnection.connect(RealConnection.kt:195)
at okhttp3.internal.connection.ExchangeFinder.findConnection(ExchangeFinder.kt:249)
at okhttp3.internal.connection.ExchangeFinder.findHealthyConnection(ExchangeFinder.kt:108)
at okhttp3.internal.connection.ExchangeFinder.find(ExchangeFinder.kt:76)
at okhttp3.internal.connection.RealCall.initExchange$okhttp(RealCall.kt:245)
at okhttp3.internal.connection.ConnectInterceptor.intercept(ConnectInterceptor.kt:32)
at okhttp3.internal.http.RealInterceptorChain.proceed(RealInterceptorChain.kt:100)
at okhttp3.internal.cache.CacheInterceptor.intercept(CacheInterceptor.kt:82)
at okhttp3.internal.http.RealInterceptorChain.proceed(RealInterceptorChain.kt:100)
at okhttp3.internal.http.BridgeInterceptor.intercept(BridgeInterceptor.kt:83)
at okhttp3.internal.http.RealInterceptorChain.proceed(RealInterceptorChain.kt:100)
at okhttp3.internal.http.RetryAndFollowUpInterceptor.intercept(RetryAndFollowUpInterceptor.kt:76)
at okhttp3.internal.http.RealInterceptorChain.proceed(RealInterceptorChain.kt:100)
at org.influxdb.impl.BasicAuthInterceptor.intercept(BasicAuthInterceptor.java:22)
at okhttp3.internal.http.RealInterceptorChain.proceed(RealInterceptorChain.kt:100)
at org.influxdb.impl.GzipRequestInterceptor.intercept(GzipRequestInterceptor.java:42)
at okhttp3.internal.http.RealInterceptorChain.proceed(RealInterceptorChain.kt:100)
at okhttp3.logging.HttpLoggingInterceptor.intercept(HttpLoggingInterceptor.kt:152)
at okhttp3.internal.http.RealInterceptorChain.proceed(RealInterceptorChain.kt:100)
at okhttp3.internal.connection.RealCall.getResponseWithInterceptorChain$okhttp(RealCall.kt:197)
at okhttp3.internal.connection.RealCall.execute(RealCall.kt:148)
at retrofit2.OkHttpCall.execute(OkHttpCall.java:190)
at org.influxdb.impl.InfluxDBImpl.execute(InfluxDBImpl.java:824)
... 3 more
Gradle Test Executor 1 finished executing tests.
> Task :sdks:java:io:influxdb:integrationTest
6 tests completed, 2 failed
Finished generating test XML results (0.02 secs) into: <https://ci-beam.apache.org/job/beam_PerformanceTests_InfluxDbIO_IT/ws/src/sdks/java/io/influxdb/build/test-results/integrationTest>
Generating HTML test report...
Finished generating test html results (0.024 secs) into: <https://ci-beam.apache.org/job/beam_PerformanceTests_InfluxDbIO_IT/ws/src/sdks/java/io/influxdb/build/reports/tests/integrationTest>
> Task :sdks:java:io:influxdb:integrationTest FAILED
:sdks:java:io:influxdb:integrationTest (Thread[Execution worker Thread 3,5,main]) completed. Took 49.567 secs.
FAILURE: Build failed with an exception.
* What went wrong:
Execution failed for task ':sdks:java:io:influxdb:integrationTest'.
> There were failing tests. See the report at: file://<https://ci-beam.apache.org/job/beam_PerformanceTests_InfluxDbIO_IT/ws/src/sdks/java/io/influxdb/build/reports/tests/integrationTest/index.html>
* Try:
> Run with --stacktrace option to get the stack trace.
> Run with --debug option to get more log output.
* Get more help at https://help.gradle.org
Deprecated Gradle features were used in this build, making it incompatible with Gradle 8.0.
You can use '--warning-mode all' to show the individual deprecation warnings and determine if they come from your own scripts or plugins.
See https://docs.gradle.org/7.5.1/userguide/command_line_interface.html#sec:command_line_warnings
BUILD FAILED in 1m 10s
77 actionable tasks: 42 executed, 33 from cache, 2 up-to-date
Publishing build scan...
https://gradle.com/s/sngkl5ctgvlwc
Build step 'Invoke Gradle script' changed build result to FAILURE
Build step 'Invoke Gradle script' marked build as failure
---------------------------------------------------------------------
To unsubscribe, e-mail: builds-unsubscribe@beam.apache.org
For additional commands, e-mail: builds-help@beam.apache.org
Build failed in Jenkins: beam_PerformanceTests_InfluxDbIO_IT #2446
Posted by Apache Jenkins Server <je...@builds.apache.org>.
See <https://ci-beam.apache.org/job/beam_PerformanceTests_InfluxDbIO_IT/2446/display/redirect?page=changes>
Changes:
[noreply] [GitHub Actions] - Verify Release Build Workflow (#23390)
------------------------------------------
[...truncated 187.27 KB...]
Loaded cache entry for task ':runners:java-fn-execution:compileJava' with cache key 86158a51c27cc249c846025f8e1c3ade
:runners:java-fn-execution:compileJava (Thread[Execution worker Thread 2,5,main]) completed. Took 0.161 secs.
Resolve mutations for :runners:java-fn-execution:classes (Thread[Execution worker Thread 5,5,main]) started.
Resolve mutations for :runners:java-fn-execution:classes (Thread[Execution worker Thread 5,5,main]) completed. Took 0.0 secs.
:runners:java-fn-execution:classes (Thread[included builds,5,main]) started.
> Task :runners:java-fn-execution:classes UP-TO-DATE
Skipping task ':runners:java-fn-execution:classes' as it has no actions.
:runners:java-fn-execution:classes (Thread[included builds,5,main]) completed. Took 0.0 secs.
Resolve mutations for :runners:java-fn-execution:jar (Thread[Execution worker Thread 2,5,main]) started.
Resolve mutations for :runners:java-fn-execution:jar (Thread[Execution worker Thread 2,5,main]) completed. Took 0.0 secs.
:runners:java-fn-execution:jar (Thread[Execution worker Thread 5,5,main]) started.
> Task :runners:java-fn-execution:jar
Caching disabled for task ':runners:java-fn-execution:jar' because:
Not worth caching
Task ':runners:java-fn-execution:jar' is not up-to-date because:
No history is available.
file or directory '<https://ci-beam.apache.org/job/beam_PerformanceTests_InfluxDbIO_IT/ws/src/runners/java-fn-execution/build/resources/main',> not found
:runners:java-fn-execution:jar (Thread[Execution worker Thread 5,5,main]) completed. Took 0.047 secs.
work action resolve beam-runners-java-fn-execution.jar (project :runners:java-fn-execution) (Thread[Execution worker Thread 4,5,main]) started.
work action null (Thread[Execution worker Thread 4,5,main]) completed. Took 0.0 secs.
Resolve mutations for :runners:direct-java:compileJava (Thread[included builds,5,main]) started.
Resolve mutations for :runners:direct-java:compileJava (Thread[included builds,5,main]) completed. Took 0.0 secs.
:runners:direct-java:compileJava (Thread[Execution worker Thread 5,5,main]) started.
> Task :runners:core-java:compileTestJava FROM-CACHE
Custom actions are attached to task ':runners:core-java:compileTestJava'.
Build cache key for task ':runners:core-java:compileTestJava' is 19f8749b18e66e785918429dd3976a3c
Task ':runners:core-java:compileTestJava' is not up-to-date because:
No history is available.
Loaded cache entry for task ':runners:core-java:compileTestJava' with cache key 19f8749b18e66e785918429dd3976a3c
:runners:core-java:compileTestJava (Thread[Execution worker Thread 3,5,main]) completed. Took 0.471 secs.
Resolve mutations for :runners:core-java:testClasses (Thread[Execution worker Thread 7,5,main]) started.
Resolve mutations for :runners:core-java:testClasses (Thread[Execution worker Thread 7,5,main]) completed. Took 0.0 secs.
:runners:core-java:testClasses (Thread[included builds,5,main]) started.
> Task :runners:core-java:testClasses UP-TO-DATE
Skipping task ':runners:core-java:testClasses' as it has no actions.
:runners:core-java:testClasses (Thread[included builds,5,main]) completed. Took 0.0 secs.
Resolve mutations for :runners:core-java:testJar (Thread[Execution worker Thread 4,5,main]) started.
Resolve mutations for :runners:core-java:testJar (Thread[Execution worker Thread 4,5,main]) completed. Took 0.0 secs.
:runners:core-java:testJar (Thread[Execution worker Thread 7,5,main]) started.
> Task :runners:core-java:testJar
Caching disabled for task ':runners:core-java:testJar' because:
Not worth caching
Task ':runners:core-java:testJar' is not up-to-date because:
No history is available.
file or directory '<https://ci-beam.apache.org/job/beam_PerformanceTests_InfluxDbIO_IT/ws/src/runners/core-java/build/resources/test',> not found
:runners:core-java:testJar (Thread[Execution worker Thread 7,5,main]) completed. Took 0.041 secs.
work action resolve beam-runners-core-java-tests.jar (project :runners:core-java) (Thread[Execution worker Thread 2,5,main]) started.
work action null (Thread[Execution worker Thread 2,5,main]) completed. Took 0.0 secs.
> Task :runners:direct-java:compileJava FROM-CACHE
Custom actions are attached to task ':runners:direct-java:compileJava'.
Build cache key for task ':runners:direct-java:compileJava' is 7deb0fba8cd9e3a4714b01f8a61b6ab5
Task ':runners:direct-java:compileJava' is not up-to-date because:
No history is available.
Loaded cache entry for task ':runners:direct-java:compileJava' with cache key 7deb0fba8cd9e3a4714b01f8a61b6ab5
:runners:direct-java:compileJava (Thread[Execution worker Thread 5,5,main]) completed. Took 0.114 secs.
Resolve mutations for :runners:direct-java:classes (Thread[Execution worker Thread 7,5,main]) started.
Resolve mutations for :runners:direct-java:classes (Thread[Execution worker Thread 7,5,main]) completed. Took 0.0 secs.
:runners:direct-java:classes (Thread[Execution worker Thread 2,5,main]) started.
> Task :runners:direct-java:classes UP-TO-DATE
Skipping task ':runners:direct-java:classes' as it has no actions.
:runners:direct-java:classes (Thread[Execution worker Thread 2,5,main]) completed. Took 0.0 secs.
Resolve mutations for :runners:direct-java:shadowJar (Thread[Execution worker Thread 5,5,main]) started.
Resolve mutations for :runners:direct-java:shadowJar (Thread[Execution worker Thread 5,5,main]) completed. Took 0.0 secs.
:runners:direct-java:shadowJar (Thread[Execution worker Thread 7,5,main]) started.
> Task :runners:direct-java:shadowJar FROM-CACHE
Custom actions are attached to task ':runners:direct-java:shadowJar'.
Build cache key for task ':runners:direct-java:shadowJar' is 9914d7cee604e577d0118818dcf3899d
Task ':runners:direct-java:shadowJar' is not up-to-date because:
No history is available.
Loaded cache entry for task ':runners:direct-java:shadowJar' with cache key 9914d7cee604e577d0118818dcf3899d
:runners:direct-java:shadowJar (Thread[Execution worker Thread 7,5,main]) completed. Took 0.34 secs.
work action resolve beam-runners-direct-java.jar (project :runners:direct-java) (Thread[Execution worker Thread 2,5,main]) started.
work action null (Thread[Execution worker Thread 2,5,main]) completed. Took 0.0 secs.
work action resolve beam-runners-direct-java.jar (project :runners:direct-java) (Thread[Execution worker Thread 5,5,main]) started.
work action null (Thread[Execution worker Thread 5,5,main]) completed. Took 0.0 secs.
Resolve mutations for :runners:direct-java:compileTestJava (Thread[Execution worker Thread 7,5,main]) started.
Resolve mutations for :runners:direct-java:compileTestJava (Thread[Execution worker Thread 7,5,main]) completed. Took 0.0 secs.
:runners:direct-java:compileTestJava (Thread[Execution worker Thread 2,5,main]) started.
> Task :runners:direct-java:compileTestJava FROM-CACHE
Custom actions are attached to task ':runners:direct-java:compileTestJava'.
Build cache key for task ':runners:direct-java:compileTestJava' is aeb5c33dcb78e29cbf2b0c27365fb8d0
Task ':runners:direct-java:compileTestJava' is not up-to-date because:
No history is available.
Loaded cache entry for task ':runners:direct-java:compileTestJava' with cache key aeb5c33dcb78e29cbf2b0c27365fb8d0
:runners:direct-java:compileTestJava (Thread[Execution worker Thread 2,5,main]) completed. Took 0.117 secs.
Resolve mutations for :runners:direct-java:testClasses (Thread[Execution worker Thread 7,5,main]) started.
Resolve mutations for :runners:direct-java:testClasses (Thread[Execution worker Thread 7,5,main]) completed. Took 0.0 secs.
:runners:direct-java:testClasses (Thread[Execution worker Thread 5,5,main]) started.
> Task :runners:direct-java:testClasses UP-TO-DATE
Skipping task ':runners:direct-java:testClasses' as it has no actions.
:runners:direct-java:testClasses (Thread[Execution worker Thread 5,5,main]) completed. Took 0.0 secs.
Resolve mutations for :runners:direct-java:shadowTestJar (Thread[Execution worker Thread 2,5,main]) started.
Resolve mutations for :runners:direct-java:shadowTestJar (Thread[Execution worker Thread 2,5,main]) completed. Took 0.0 secs.
:runners:direct-java:shadowTestJar (Thread[Execution worker Thread 7,5,main]) started.
> Task :runners:direct-java:shadowTestJar FROM-CACHE
Build cache key for task ':runners:direct-java:shadowTestJar' is 2f9008d621b1aabd1a6466302fc8f48b
Task ':runners:direct-java:shadowTestJar' is not up-to-date because:
No history is available.
Loaded cache entry for task ':runners:direct-java:shadowTestJar' with cache key 2f9008d621b1aabd1a6466302fc8f48b
:runners:direct-java:shadowTestJar (Thread[Execution worker Thread 7,5,main]) completed. Took 0.234 secs.
work action resolve beam-runners-direct-java-tests.jar (project :runners:direct-java) (Thread[Execution worker,5,main]) started.
work action null (Thread[Execution worker,5,main]) completed. Took 0.0 secs.
Resolve mutations for :sdks:java:io:influxdb:integrationTest (Thread[Execution worker Thread 2,5,main]) started.
Resolve mutations for :sdks:java:io:influxdb:integrationTest (Thread[Execution worker Thread 2,5,main]) completed. Took 0.0 secs.
:sdks:java:io:influxdb:integrationTest (Thread[Execution worker Thread 7,5,main]) started.
producer locations for task group 0 (Thread[Execution worker Thread 5,5,main]) started.
producer locations for task group 0 (Thread[Execution worker Thread 5,5,main]) completed. Took 0.0 secs.
Gradle Test Executor 1 started executing tests.
> Task :sdks:java:io:influxdb:integrationTest
Custom actions are attached to task ':sdks:java:io:influxdb:integrationTest'.
Build cache key for task ':sdks:java:io:influxdb:integrationTest' is 2192952a3840e97770f42d65d37a860b
Task ':sdks:java:io:influxdb:integrationTest' is not up-to-date because:
Task.upToDateWhen is false.
Starting process 'Gradle Test Executor 1'. Working directory: <https://ci-beam.apache.org/job/beam_PerformanceTests_InfluxDbIO_IT/ws/src/sdks/java/io/influxdb> Command: /usr/lib/jvm/java-8-openjdk-amd64/bin/java -DbeamTestPipelineOptions=["--influxDBURL=http://35.225.194.64:8086","--influxDBUserName=superadmin","--influxDBPassword=supersecretpassword","--databaseName=db1"] -Djava.security.manager=worker.org.gradle.process.internal.worker.child.BootstrapSecurityManager -Dorg.gradle.internal.worker.tmpdir=<https://ci-beam.apache.org/job/beam_PerformanceTests_InfluxDbIO_IT/ws/src/sdks/java/io/influxdb/build/tmp/integrationTest/work> -Dorg.gradle.native=false -Xmx2g -Dfile.encoding=UTF-8 -Duser.country=US -Duser.language=en -Duser.variant -ea -cp /home/jenkins/.gradle/caches/7.5.1/workerMain/gradle-worker.jar worker.org.gradle.process.internal.worker.GradleWorkerMain 'Gradle Test Executor 1'
Successfully started process 'Gradle Test Executor 1'
org.apache.beam.sdk.io.influxdb.InfluxDbIOIT > testWriteAndReadWithMultipleMetric FAILED
org.influxdb.InfluxDBIOException: java.net.SocketTimeoutException: connect timed out
at org.influxdb.impl.InfluxDBImpl.execute(InfluxDBImpl.java:836)
at org.influxdb.impl.InfluxDBImpl.executeQuery(InfluxDBImpl.java:819)
at org.influxdb.impl.InfluxDBImpl.query(InfluxDBImpl.java:554)
at org.apache.beam.sdk.io.influxdb.InfluxDbIOIT.initTest(InfluxDbIOIT.java:99)
Caused by:
java.net.SocketTimeoutException: connect timed out
at java.net.PlainSocketImpl.socketConnect(Native Method)
at java.net.AbstractPlainSocketImpl.doConnect(AbstractPlainSocketImpl.java:350)
at java.net.AbstractPlainSocketImpl.connectToAddress(AbstractPlainSocketImpl.java:206)
at java.net.AbstractPlainSocketImpl.connect(AbstractPlainSocketImpl.java:188)
at java.net.SocksSocketImpl.connect(SocksSocketImpl.java:392)
at java.net.Socket.connect(Socket.java:607)
at okhttp3.internal.platform.Platform.connectSocket(Platform.kt:119)
at okhttp3.internal.connection.RealConnection.connectSocket(RealConnection.kt:283)
at okhttp3.internal.connection.RealConnection.connect(RealConnection.kt:195)
at okhttp3.internal.connection.ExchangeFinder.findConnection(ExchangeFinder.kt:249)
at okhttp3.internal.connection.ExchangeFinder.findHealthyConnection(ExchangeFinder.kt:108)
at okhttp3.internal.connection.ExchangeFinder.find(ExchangeFinder.kt:76)
at okhttp3.internal.connection.RealCall.initExchange$okhttp(RealCall.kt:245)
at okhttp3.internal.connection.ConnectInterceptor.intercept(ConnectInterceptor.kt:32)
at okhttp3.internal.http.RealInterceptorChain.proceed(RealInterceptorChain.kt:100)
at okhttp3.internal.cache.CacheInterceptor.intercept(CacheInterceptor.kt:82)
at okhttp3.internal.http.RealInterceptorChain.proceed(RealInterceptorChain.kt:100)
at okhttp3.internal.http.BridgeInterceptor.intercept(BridgeInterceptor.kt:83)
at okhttp3.internal.http.RealInterceptorChain.proceed(RealInterceptorChain.kt:100)
at okhttp3.internal.http.RetryAndFollowUpInterceptor.intercept(RetryAndFollowUpInterceptor.kt:76)
at okhttp3.internal.http.RealInterceptorChain.proceed(RealInterceptorChain.kt:100)
at org.influxdb.impl.BasicAuthInterceptor.intercept(BasicAuthInterceptor.java:22)
at okhttp3.internal.http.RealInterceptorChain.proceed(RealInterceptorChain.kt:100)
at org.influxdb.impl.GzipRequestInterceptor.intercept(GzipRequestInterceptor.java:42)
at okhttp3.internal.http.RealInterceptorChain.proceed(RealInterceptorChain.kt:100)
at okhttp3.logging.HttpLoggingInterceptor.intercept(HttpLoggingInterceptor.kt:152)
at okhttp3.internal.http.RealInterceptorChain.proceed(RealInterceptorChain.kt:100)
at okhttp3.internal.connection.RealCall.getResponseWithInterceptorChain$okhttp(RealCall.kt:197)
at okhttp3.internal.connection.RealCall.execute(RealCall.kt:148)
at retrofit2.OkHttpCall.execute(OkHttpCall.java:190)
at org.influxdb.impl.InfluxDBImpl.execute(InfluxDBImpl.java:824)
... 3 more
org.influxdb.InfluxDBIOException: java.net.SocketTimeoutException: connect timed out
at org.influxdb.impl.InfluxDBImpl.execute(InfluxDBImpl.java:836)
at org.influxdb.impl.InfluxDBImpl.executeQuery(InfluxDBImpl.java:819)
at org.influxdb.impl.InfluxDBImpl.query(InfluxDBImpl.java:554)
at org.apache.beam.sdk.io.influxdb.InfluxDbIOIT.clear(InfluxDbIOIT.java:88)
Caused by:
java.net.SocketTimeoutException: connect timed out
at java.net.PlainSocketImpl.socketConnect(Native Method)
at java.net.AbstractPlainSocketImpl.doConnect(AbstractPlainSocketImpl.java:350)
at java.net.AbstractPlainSocketImpl.connectToAddress(AbstractPlainSocketImpl.java:206)
at java.net.AbstractPlainSocketImpl.connect(AbstractPlainSocketImpl.java:188)
at java.net.SocksSocketImpl.connect(SocksSocketImpl.java:392)
at java.net.Socket.connect(Socket.java:607)
at okhttp3.internal.platform.Platform.connectSocket(Platform.kt:119)
at okhttp3.internal.connection.RealConnection.connectSocket(RealConnection.kt:283)
at okhttp3.internal.connection.RealConnection.connect(RealConnection.kt:195)
at okhttp3.internal.connection.ExchangeFinder.findConnection(ExchangeFinder.kt:249)
at okhttp3.internal.connection.ExchangeFinder.findHealthyConnection(ExchangeFinder.kt:108)
at okhttp3.internal.connection.ExchangeFinder.find(ExchangeFinder.kt:76)
at okhttp3.internal.connection.RealCall.initExchange$okhttp(RealCall.kt:245)
at okhttp3.internal.connection.ConnectInterceptor.intercept(ConnectInterceptor.kt:32)
at okhttp3.internal.http.RealInterceptorChain.proceed(RealInterceptorChain.kt:100)
at okhttp3.internal.cache.CacheInterceptor.intercept(CacheInterceptor.kt:82)
at okhttp3.internal.http.RealInterceptorChain.proceed(RealInterceptorChain.kt:100)
at okhttp3.internal.http.BridgeInterceptor.intercept(BridgeInterceptor.kt:83)
at okhttp3.internal.http.RealInterceptorChain.proceed(RealInterceptorChain.kt:100)
at okhttp3.internal.http.RetryAndFollowUpInterceptor.intercept(RetryAndFollowUpInterceptor.kt:76)
at okhttp3.internal.http.RealInterceptorChain.proceed(RealInterceptorChain.kt:100)
at org.influxdb.impl.BasicAuthInterceptor.intercept(BasicAuthInterceptor.java:22)
at okhttp3.internal.http.RealInterceptorChain.proceed(RealInterceptorChain.kt:100)
at org.influxdb.impl.GzipRequestInterceptor.intercept(GzipRequestInterceptor.java:42)
at okhttp3.internal.http.RealInterceptorChain.proceed(RealInterceptorChain.kt:100)
at okhttp3.logging.HttpLoggingInterceptor.intercept(HttpLoggingInterceptor.kt:152)
at okhttp3.internal.http.RealInterceptorChain.proceed(RealInterceptorChain.kt:100)
at okhttp3.internal.connection.RealCall.getResponseWithInterceptorChain$okhttp(RealCall.kt:197)
at okhttp3.internal.connection.RealCall.execute(RealCall.kt:148)
at retrofit2.OkHttpCall.execute(OkHttpCall.java:190)
at org.influxdb.impl.InfluxDBImpl.execute(InfluxDBImpl.java:824)
... 3 more
Gradle Test Executor 1 finished executing tests.
> Task :sdks:java:io:influxdb:integrationTest
6 tests completed, 1 failed
Finished generating test XML results (0.019 secs) into: <https://ci-beam.apache.org/job/beam_PerformanceTests_InfluxDbIO_IT/ws/src/sdks/java/io/influxdb/build/test-results/integrationTest>
Generating HTML test report...
Finished generating test html results (0.023 secs) into: <https://ci-beam.apache.org/job/beam_PerformanceTests_InfluxDbIO_IT/ws/src/sdks/java/io/influxdb/build/reports/tests/integrationTest>
> Task :sdks:java:io:influxdb:integrationTest FAILED
:sdks:java:io:influxdb:integrationTest (Thread[Execution worker Thread 7,5,main]) completed. Took 34.249 secs.
FAILURE: Build failed with an exception.
* What went wrong:
Execution failed for task ':sdks:java:io:influxdb:integrationTest'.
> There were failing tests. See the report at: file://<https://ci-beam.apache.org/job/beam_PerformanceTests_InfluxDbIO_IT/ws/src/sdks/java/io/influxdb/build/reports/tests/integrationTest/index.html>
* Try:
> Run with --stacktrace option to get the stack trace.
> Run with --debug option to get more log output.
* Get more help at https://help.gradle.org
Deprecated Gradle features were used in this build, making it incompatible with Gradle 8.0.
You can use '--warning-mode all' to show the individual deprecation warnings and determine if they come from your own scripts or plugins.
See https://docs.gradle.org/7.5.1/userguide/command_line_interface.html#sec:command_line_warnings
BUILD FAILED in 58s
77 actionable tasks: 42 executed, 33 from cache, 2 up-to-date
Publishing build scan...
https://gradle.com/s/bkn4jx7jel3lq
Build step 'Invoke Gradle script' changed build result to FAILURE
Build step 'Invoke Gradle script' marked build as failure
---------------------------------------------------------------------
To unsubscribe, e-mail: builds-unsubscribe@beam.apache.org
For additional commands, e-mail: builds-help@beam.apache.org