You are viewing a plain text version of this content. The canonical link for it is here.
Posted to builds@solr.apache.org by Apache Jenkins Server <je...@builds.apache.org> on 2026/04/09 17:12:48 UTC

[JENKINS] Solr » Solr-TestIntegration-10.0 - Build # 175 - Still Failing!

Build: https://ci-builds.apache.org/job/Solr/job/Solr-TestIntegration-10.0/175/

No tests ran.

Build Log:
[...truncated 1127 lines...]
BUILD FAILED in 28m 31s
130 actionable tasks: 130 executed

Publishing build scan...
https://develocity.apache.org/s/onl57l4ykgdhw

Build step 'Invoke Gradle script' changed build result to FAILURE
Build step 'Invoke Gradle script' marked build as failure
Archiving artifacts
Email was triggered for: Failure - Any
Sending email for trigger: Failure - Any

[JENKINS] Solr » Solr-TestIntegration-10.0 - Build # 187 - Still Failing!

Posted by Apache Jenkins Server <je...@builds.apache.org>.
Build: https://ci-builds.apache.org/job/Solr/job/Solr-TestIntegration-10.0/187/

No tests ran.

Build Log:
[...truncated 1127 lines...]
BUILD FAILED in 29m 56s
130 actionable tasks: 130 executed

Publishing build scan...
https://develocity.apache.org/s/dj64eaxqtw4pm

Build step 'Invoke Gradle script' changed build result to FAILURE
Build step 'Invoke Gradle script' marked build as failure
Archiving artifacts
Email was triggered for: Failure - Any
Sending email for trigger: Failure - Any

[JENKINS] Solr » Solr-TestIntegration-10.0 - Build # 186 - Still Failing!

Posted by Apache Jenkins Server <je...@builds.apache.org>.
Build: https://ci-builds.apache.org/job/Solr/job/Solr-TestIntegration-10.0/186/

No tests ran.

Build Log:
[...truncated 1127 lines...]
BUILD FAILED in 28m 22s
130 actionable tasks: 130 executed

Publishing build scan...
https://develocity.apache.org/s/ajbfavu66ffki

Build step 'Invoke Gradle script' changed build result to FAILURE
Build step 'Invoke Gradle script' marked build as failure
Archiving artifacts
Email was triggered for: Failure - Any
Sending email for trigger: Failure - Any

[JENKINS] Solr » Solr-TestIntegration-10.0 - Build # 185 - Still Failing!

Posted by Apache Jenkins Server <je...@builds.apache.org>.
Build: https://ci-builds.apache.org/job/Solr/job/Solr-TestIntegration-10.0/185/

No tests ran.

Build Log:
[...truncated 1127 lines...]
BUILD FAILED in 27m 25s
130 actionable tasks: 130 executed

Publishing build scan...
https://develocity.apache.org/s/p34fkana7xp2o

Build step 'Invoke Gradle script' changed build result to FAILURE
Build step 'Invoke Gradle script' marked build as failure
Archiving artifacts
Email was triggered for: Failure - Any
Sending email for trigger: Failure - Any

[JENKINS] Solr » Solr-TestIntegration-10.0 - Build # 184 - Still Failing!

Posted by Apache Jenkins Server <je...@builds.apache.org>.
Build: https://ci-builds.apache.org/job/Solr/job/Solr-TestIntegration-10.0/184/

No tests ran.

Build Log:
[...truncated 1127 lines...]
BUILD FAILED in 27m 13s
130 actionable tasks: 130 executed

Publishing build scan...
https://develocity.apache.org/s/f2oflhb3nu5rg

Build step 'Invoke Gradle script' changed build result to FAILURE
Build step 'Invoke Gradle script' marked build as failure
Archiving artifacts
Email was triggered for: Failure - Any
Sending email for trigger: Failure - Any

[JENKINS] Solr » Solr-TestIntegration-10.0 - Build # 183 - Still Failing!

Posted by Apache Jenkins Server <je...@builds.apache.org>.
Build: https://ci-builds.apache.org/job/Solr/job/Solr-TestIntegration-10.0/183/

No tests ran.

Build Log:
[...truncated 1127 lines...]
BUILD FAILED in 30m 27s
130 actionable tasks: 130 executed

Publishing build scan...
https://develocity.apache.org/s/47e7r3uqidi64

Build step 'Invoke Gradle script' changed build result to FAILURE
Build step 'Invoke Gradle script' marked build as failure
Archiving artifacts
Email was triggered for: Failure - Any
Sending email for trigger: Failure - Any

[JENKINS] Solr » Solr-TestIntegration-10.0 - Build # 182 - Still Failing!

Posted by Apache Jenkins Server <je...@builds.apache.org>.
Build: https://ci-builds.apache.org/job/Solr/job/Solr-TestIntegration-10.0/182/

No tests ran.

Build Log:
[...truncated 1127 lines...]
BUILD FAILED in 27m 20s
130 actionable tasks: 130 executed

Publishing build scan...
https://develocity.apache.org/s/kh3tc6xbuzyhg

Build step 'Invoke Gradle script' changed build result to FAILURE
Build step 'Invoke Gradle script' marked build as failure
Archiving artifacts
Email was triggered for: Failure - Any
Sending email for trigger: Failure - Any

[JENKINS] Solr » Solr-TestIntegration-10.0 - Build # 181 - Still Failing!

Posted by Apache Jenkins Server <je...@builds.apache.org>.
Build: https://ci-builds.apache.org/job/Solr/job/Solr-TestIntegration-10.0/181/

No tests ran.

Build Log:
[...truncated 1127 lines...]
BUILD FAILED in 27m 21s
130 actionable tasks: 130 executed

Publishing build scan...
https://develocity.apache.org/s/ye3nas2o4775c

Build step 'Invoke Gradle script' changed build result to FAILURE
Build step 'Invoke Gradle script' marked build as failure
Archiving artifacts
Email was triggered for: Failure - Any
Sending email for trigger: Failure - Any

[JENKINS] Solr » Solr-TestIntegration-10.0 - Build # 180 - Still Failing!

Posted by Apache Jenkins Server <je...@builds.apache.org>.
Build: https://ci-builds.apache.org/job/Solr/job/Solr-TestIntegration-10.0/180/

No tests ran.

Build Log:
[...truncated 1127 lines...]
BUILD FAILED in 28m 48s
130 actionable tasks: 130 executed

Publishing build scan...
https://develocity.apache.org/s/lhjmopkv55t3s

Build step 'Invoke Gradle script' changed build result to FAILURE
Build step 'Invoke Gradle script' marked build as failure
Archiving artifacts
Email was triggered for: Failure - Any
Sending email for trigger: Failure - Any

[JENKINS] Solr » Solr-TestIntegration-10.0 - Build # 179 - Still Failing!

Posted by Apache Jenkins Server <je...@builds.apache.org>.
Build: https://ci-builds.apache.org/job/Solr/job/Solr-TestIntegration-10.0/179/

No tests ran.

Build Log:
[...truncated 1127 lines...]
BUILD FAILED in 28m 55s
130 actionable tasks: 130 executed

Publishing build scan...
https://develocity.apache.org/s/wvf7fv4xeyeby

Build step 'Invoke Gradle script' changed build result to FAILURE
Build step 'Invoke Gradle script' marked build as failure
Archiving artifacts
Email was triggered for: Failure - Any
Sending email for trigger: Failure - Any

[JENKINS] Solr » Solr-TestIntegration-10.0 - Build # 178 - Still Failing!

Posted by Apache Jenkins Server <je...@builds.apache.org>.
Build: https://ci-builds.apache.org/job/Solr/job/Solr-TestIntegration-10.0/178/

No tests ran.

Build Log:
[...truncated 1127 lines...]
BUILD FAILED in 27m 16s
130 actionable tasks: 130 executed

Publishing build scan...
https://develocity.apache.org/s/ysgmzt5tt7nfc

Build step 'Invoke Gradle script' changed build result to FAILURE
Build step 'Invoke Gradle script' marked build as failure
Archiving artifacts
Email was triggered for: Failure - Any
Sending email for trigger: Failure - Any

[JENKINS] Solr » Solr-TestIntegration-10.0 - Build # 177 - Still Failing!

Posted by Apache Jenkins Server <je...@builds.apache.org>.
Build: https://ci-builds.apache.org/job/Solr/job/Solr-TestIntegration-10.0/177/

No tests ran.

Build Log:
[...truncated 1127 lines...]
BUILD FAILED in 27m 24s
130 actionable tasks: 130 executed

Publishing build scan...
https://develocity.apache.org/s/5weg6tnkkkqsq

Build step 'Invoke Gradle script' changed build result to FAILURE
Build step 'Invoke Gradle script' marked build as failure
Archiving artifacts
Email was triggered for: Failure - Any
Sending email for trigger: Failure - Any

[JENKINS] Solr » Solr-TestIntegration-10.0 - Build # 176 - Still Failing!

Posted by Apache Jenkins Server <je...@builds.apache.org>.
Build: https://ci-builds.apache.org/job/Solr/job/Solr-TestIntegration-10.0/176/

No tests ran.

Build Log:
[...truncated 1127 lines...]
BUILD FAILED in 29m 13s
130 actionable tasks: 130 executed

Publishing build scan...
https://develocity.apache.org/s/2nbj5bgqilirk

Build step 'Invoke Gradle script' changed build result to FAILURE
Build step 'Invoke Gradle script' marked build as failure
Archiving artifacts
Email was triggered for: Failure - Any
Sending email for trigger: Failure - Any