You are viewing a plain text version of this content. The canonical link for it is here.
Posted to builds@beam.apache.org by Apache Jenkins Server <je...@builds.apache.org> on 2021/03/28 12:17:28 UTC

Build failed in Jenkins: beam_PostRelease_NightlySnapshot #1324

See <https://ci-beam.apache.org/job/beam_PostRelease_NightlySnapshot/1324/display/redirect?page=changes>

Changes:

[Sylvain Wallez] [BEAM-12044] JdbcIO read: always force autocommit to false


------------------------------------------
[...truncated 5.30 MB...]
INFO: 2021-03-28T12:14:35.130Z: Fusing consumer WriteUserScoreSums/BigQueryIO.Write/StreamingInserts/StreamingWriteTables/ShardTableWrites into WriteUserScoreSums/BigQueryIO.Write/StreamingInserts/CreateTables/ParDo(CreateTables)
Mar 28, 2021 12:14:37 PM org.apache.beam.runners.dataflow.util.MonitoringUtil$LoggingHandler process
INFO: 2021-03-28T12:14:35.161Z: Fusing consumer WriteUserScoreSums/BigQueryIO.Write/StreamingInserts/StreamingWriteTables/TagWithUniqueIds into WriteUserScoreSums/BigQueryIO.Write/StreamingInserts/StreamingWriteTables/ShardTableWrites
Mar 28, 2021 12:14:37 PM org.apache.beam.runners.dataflow.util.MonitoringUtil$LoggingHandler process
INFO: 2021-03-28T12:14:35.185Z: Fusing consumer WriteUserScoreSums/BigQueryIO.Write/StreamingInserts/StreamingWriteTables/Reshuffle/Window.Into()/Window.Assign into WriteUserScoreSums/BigQueryIO.Write/StreamingInserts/StreamingWriteTables/TagWithUniqueIds
Mar 28, 2021 12:14:37 PM org.apache.beam.runners.dataflow.util.MonitoringUtil$LoggingHandler process
INFO: 2021-03-28T12:14:35.218Z: Fusing consumer WriteUserScoreSums/BigQueryIO.Write/StreamingInserts/StreamingWriteTables/Reshuffle/GroupByKey/WriteStream into WriteUserScoreSums/BigQueryIO.Write/StreamingInserts/StreamingWriteTables/Reshuffle/Window.Into()/Window.Assign
Mar 28, 2021 12:14:37 PM org.apache.beam.runners.dataflow.util.MonitoringUtil$LoggingHandler process
INFO: 2021-03-28T12:14:35.255Z: Fusing consumer WriteUserScoreSums/BigQueryIO.Write/StreamingInserts/StreamingWriteTables/Reshuffle/GroupByKey/MergeBuckets into WriteUserScoreSums/BigQueryIO.Write/StreamingInserts/StreamingWriteTables/Reshuffle/GroupByKey/ReadStream
Mar 28, 2021 12:14:37 PM org.apache.beam.runners.dataflow.util.MonitoringUtil$LoggingHandler process
INFO: 2021-03-28T12:14:35.287Z: Fusing consumer WriteUserScoreSums/BigQueryIO.Write/StreamingInserts/StreamingWriteTables/Reshuffle/ExpandIterable into WriteUserScoreSums/BigQueryIO.Write/StreamingInserts/StreamingWriteTables/Reshuffle/GroupByKey/MergeBuckets
Mar 28, 2021 12:14:37 PM org.apache.beam.runners.dataflow.util.MonitoringUtil$LoggingHandler process
INFO: 2021-03-28T12:14:35.310Z: Fusing consumer WriteUserScoreSums/BigQueryIO.Write/StreamingInserts/StreamingWriteTables/GlobalWindow/Window.Assign into WriteUserScoreSums/BigQueryIO.Write/StreamingInserts/StreamingWriteTables/Reshuffle/ExpandIterable
Mar 28, 2021 12:14:37 PM org.apache.beam.runners.dataflow.util.MonitoringUtil$LoggingHandler process
INFO: 2021-03-28T12:14:35.336Z: Fusing consumer WriteUserScoreSums/BigQueryIO.Write/StreamingInserts/StreamingWriteTables/StripShardId/Map into WriteUserScoreSums/BigQueryIO.Write/StreamingInserts/StreamingWriteTables/GlobalWindow/Window.Assign
Mar 28, 2021 12:14:37 PM org.apache.beam.runners.dataflow.util.MonitoringUtil$LoggingHandler process
INFO: 2021-03-28T12:14:35.365Z: Fusing consumer WriteUserScoreSums/BigQueryIO.Write/StreamingInserts/StreamingWriteTables/StreamingWrite/BatchedStreamingWrite.ViaBundleFinalization/ParMultiDo(BatchAndInsertElements) into WriteUserScoreSums/BigQueryIO.Write/StreamingInserts/StreamingWriteTables/StripShardId/Map
Mar 28, 2021 12:14:37 PM org.apache.beam.runners.dataflow.util.MonitoringUtil$LoggingHandler process
INFO: 2021-03-28T12:14:35.414Z: The pubsub read for: projects/apache-beam-testing/subscriptions/java_mobile_gaming_topic.subscription-14765760150214997391 is configured to compute input data watermarks based on custom timestamp attribute timestamp_ms. Cloud Dataflow has created an additional tracking subscription to do this, which will be cleaned up automatically. For details, see: https://cloud.google.com/dataflow/model/pubsub-io#timestamps-ids
Mar 28, 2021 12:14:39 PM org.apache.beam.runners.dataflow.util.MonitoringUtil$LoggingHandler process
INFO: 2021-03-28T12:14:38.028Z: Pub/Sub resources set up for topic 'projects/apache-beam-testing/topics/java_mobile_gaming_topic'.
Mar 28, 2021 12:14:39 PM org.apache.beam.runners.dataflow.util.MonitoringUtil$LoggingHandler process
INFO: 2021-03-28T12:14:39.255Z: Starting 1 workers in us-central1-f...
Mar 28, 2021 12:14:42 PM org.apache.beam.runners.dataflow.util.MonitoringUtil$LoggingHandler process
INFO: 2021-03-28T12:14:40.904Z: Your project already contains 100 Dataflow-created metric descriptors, so new user metrics of the form custom.googleapis.com/* will not be created. However, all user metrics are also available in the metric dataflow.googleapis.com/job/user_counter. If you rely on the custom metrics, you can delete old / unused metric descriptors. See https://developers.google.com/apis-explorer/#p/monitoring/v3/monitoring.projects.metricDescriptors.list and https://developers.google.com/apis-explorer/#p/monitoring/v3/monitoring.projects.metricDescriptors.delete
bq query SELECT table_id FROM beam_postrelease_mobile_gaming.__TABLES_SUMMARY__

Waiting on bqjob_r1f66fed86faf9f5b_0000017878c250e6_1 ... (0s) Current status: RUNNING
                                                                                      
Waiting on bqjob_r1f66fed86faf9f5b_0000017878c250e6_1 ... (0s) Current status: DONE   
+-----------------------------------+
|             table_id              |
+-----------------------------------+
| hourly_team_score_python_dataflow |
| hourly_team_score_python_direct   |
| leaderboard_DataflowRunner_user   |
| leaderboard_DirectRunner_team     |
| leaderboard_DirectRunner_user     |
+-----------------------------------+
Waiting for pipeline to produce more results...
Mar 28, 2021 12:15:14 PM org.apache.beam.runners.dataflow.util.MonitoringUtil$LoggingHandler process
INFO: 2021-03-28T12:15:13.322Z: Autoscaling: Raised the number of workers to 1 so that the pipeline can catch up with its backlog and keep up with its input rate.
Mar 28, 2021 12:16:03 PM org.apache.beam.runners.dataflow.util.MonitoringUtil$LoggingHandler process
INFO: 2021-03-28T12:16:03.033Z: Workers have started successfully.
Mar 28, 2021 12:16:03 PM org.apache.beam.runners.dataflow.util.MonitoringUtil$LoggingHandler process
INFO: 2021-03-28T12:16:03.062Z: Workers have started successfully.
bq query SELECT table_id FROM beam_postrelease_mobile_gaming.__TABLES_SUMMARY__

Waiting on bqjob_r56e03c2a3018a2b0_0000017878c34a27_1 ... (0s) Current status: RUNNING
                                                                                      
Waiting on bqjob_r56e03c2a3018a2b0_0000017878c34a27_1 ... (0s) Current status: DONE   
+-----------------------------------+
|             table_id              |
+-----------------------------------+
| hourly_team_score_python_dataflow |
| hourly_team_score_python_direct   |
| leaderboard_DataflowRunner_team   |
| leaderboard_DataflowRunner_user   |
| leaderboard_DirectRunner_team     |
| leaderboard_DirectRunner_user     |
+-----------------------------------+
bq query --batch "SELECT user FROM [apache-beam-testing:beam_postrelease_mobile_gaming.leaderboard_DataflowRunner_user] LIMIT 10"

Waiting on bqjob_r2ae67f6114e672ab_0000017878c358b1_1 ... (0s) Current status: PENDING
                                                                                      
Waiting on bqjob_r2ae67f6114e672ab_0000017878c358b1_1 ... (1s) Current status: PENDING
                                                                                      
Waiting on bqjob_r2ae67f6114e672ab_0000017878c358b1_1 ... (2s) Current status: PENDING
                                                                                      
Waiting on bqjob_r2ae67f6114e672ab_0000017878c358b1_1 ... (3s) Current status: PENDING
                                                                                      
Waiting on bqjob_r2ae67f6114e672ab_0000017878c358b1_1 ... (4s) Current status: PENDING
                                                                                      
Waiting on bqjob_r2ae67f6114e672ab_0000017878c358b1_1 ... (5s) Current status: PENDING
                                                                                      
Waiting on bqjob_r2ae67f6114e672ab_0000017878c358b1_1 ... (6s) Current status: PENDING
                                                                                      
Waiting on bqjob_r2ae67f6114e672ab_0000017878c358b1_1 ... (7s) Current status: PENDING
                                                                                      
Waiting on bqjob_r2ae67f6114e672ab_0000017878c358b1_1 ... (8s) Current status: PENDING
                                                                                      
Waiting on bqjob_r2ae67f6114e672ab_0000017878c358b1_1 ... (9s) Current status: PENDING
                                                                                      
Waiting on bqjob_r2ae67f6114e672ab_0000017878c358b1_1 ... (10s) Current status: PENDING
                                                                                       
Waiting on bqjob_r2ae67f6114e672ab_0000017878c358b1_1 ... (11s) Current status: PENDING
                                                                                       
Waiting on bqjob_r2ae67f6114e672ab_0000017878c358b1_1 ... (12s) Current status: PENDING
                                                                                       
Waiting on bqjob_r2ae67f6114e672ab_0000017878c358b1_1 ... (13s) Current status: PENDING
                                                                                       
Waiting on bqjob_r2ae67f6114e672ab_0000017878c358b1_1 ... (14s) Current status: PENDING
                                                                                       
Waiting on bqjob_r2ae67f6114e672ab_0000017878c358b1_1 ... (15s) Current status: PENDING
                                                                                       
Waiting on bqjob_r2ae67f6114e672ab_0000017878c358b1_1 ... (16s) Current status: PENDING
                                                                                       
Waiting on bqjob_r2ae67f6114e672ab_0000017878c358b1_1 ... (17s) Current status: PENDING
                                                                                       
Waiting on bqjob_r2ae67f6114e672ab_0000017878c358b1_1 ... (18s) Current status: PENDING
                                                                                       
Waiting on bqjob_r2ae67f6114e672ab_0000017878c358b1_1 ... (19s) Current status: PENDING
                                                                                       
Waiting on bqjob_r2ae67f6114e672ab_0000017878c358b1_1 ... (20s) Current status: PENDING
                                                                                       
Waiting on bqjob_r2ae67f6114e672ab_0000017878c358b1_1 ... (21s) Current status: PENDING
                                                                                       
Waiting on bqjob_r2ae67f6114e672ab_0000017878c358b1_1 ... (22s) Current status: PENDING
                                                                                       
Waiting on bqjob_r2ae67f6114e672ab_0000017878c358b1_1 ... (23s) Current status: PENDING
                                                                                       
Waiting on bqjob_r2ae67f6114e672ab_0000017878c358b1_1 ... (24s) Current status: PENDING
                                                                                       
Waiting on bqjob_r2ae67f6114e672ab_0000017878c358b1_1 ... (25s) Current status: PENDING
                                                                                       
Waiting on bqjob_r2ae67f6114e672ab_0000017878c358b1_1 ... (26s) Current status: PENDING
                                                                                       
Waiting on bqjob_r2ae67f6114e672ab_0000017878c358b1_1 ... (27s) Current status: PENDING
                                                                                       
Waiting on bqjob_r2ae67f6114e672ab_0000017878c358b1_1 ... (28s) Current status: PENDING
                                                                                       
Waiting on bqjob_r2ae67f6114e672ab_0000017878c358b1_1 ... (29s) Current status: PENDING
                                                                                       
Waiting on bqjob_r2ae67f6114e672ab_0000017878c358b1_1 ... (30s) Current status: PENDING
                                                                                       
Waiting on bqjob_r2ae67f6114e672ab_0000017878c358b1_1 ... (31s) Current status: PENDING
                                                                                       
Waiting on bqjob_r2ae67f6114e672ab_0000017878c358b1_1 ... (32s) Current status: PENDING
                                                                                       
Waiting on bqjob_r2ae67f6114e672ab_0000017878c358b1_1 ... (33s) Current status: PENDING
                                                                                       
Waiting on bqjob_r2ae67f6114e672ab_0000017878c358b1_1 ... (34s) Current status: PENDING
                                                                                       
Waiting on bqjob_r2ae67f6114e672ab_0000017878c358b1_1 ... (35s) Current status: PENDING
                                                                                       
Waiting on bqjob_r2ae67f6114e672ab_0000017878c358b1_1 ... (36s) Current status: PENDING
                                                                                       
Waiting on bqjob_r2ae67f6114e672ab_0000017878c358b1_1 ... (37s) Current status: PENDING
                                                                                       
Waiting on bqjob_r2ae67f6114e672ab_0000017878c358b1_1 ... (38s) Current status: PENDING
                                                                                       
Waiting on bqjob_r2ae67f6114e672ab_0000017878c358b1_1 ... (39s) Current status: PENDING
                                                                                       
Waiting on bqjob_r2ae67f6114e672ab_0000017878c358b1_1 ... (40s) Current status: PENDING
                                                                                       
Waiting on bqjob_r2ae67f6114e672ab_0000017878c358b1_1 ... (41s) Current status: PENDING
                                                                                       
Waiting on bqjob_r2ae67f6114e672ab_0000017878c358b1_1 ... (42s) Current status: PENDING
                                                                                       
Waiting on bqjob_r2ae67f6114e672ab_0000017878c358b1_1 ... (43s) Current status: PENDING
                                                                                       
Waiting on bqjob_r2ae67f6114e672ab_0000017878c358b1_1 ... (44s) Current status: PENDING
                                                                                       
Waiting on bqjob_r2ae67f6114e672ab_0000017878c358b1_1 ... (45s) Current status: PENDING
                                                                                       
Waiting on bqjob_r2ae67f6114e672ab_0000017878c358b1_1 ... (46s) Current status: PENDING
                                                                                       
Waiting on bqjob_r2ae67f6114e672ab_0000017878c358b1_1 ... (47s) Current status: PENDING
                                                                                       
Waiting on bqjob_r2ae67f6114e672ab_0000017878c358b1_1 ... (48s) Current status: PENDING
                                                                                       
Waiting on bqjob_r2ae67f6114e672ab_0000017878c358b1_1 ... (49s) Current status: PENDING
                                                                                       
Waiting on bqjob_r2ae67f6114e672ab_0000017878c358b1_1 ... (50s) Current status: PENDING
                                                                                       
Waiting on bqjob_r2ae67f6114e672ab_0000017878c358b1_1 ... (51s) Current status: PENDING
                                                                                       
Waiting on bqjob_r2ae67f6114e672ab_0000017878c358b1_1 ... (52s) Current status: PENDING
                                                                                       
Waiting on bqjob_r2ae67f6114e672ab_0000017878c358b1_1 ... (53s) Current status: PENDING
                                                                                       
Waiting on bqjob_r2ae67f6114e672ab_0000017878c358b1_1 ... (54s) Current status: PENDING
                                                                                       
Waiting on bqjob_r2ae67f6114e672ab_0000017878c358b1_1 ... (55s) Current status: PENDING
                                                                                       
...............................................................................................................................................................................................................................................................................................................................Introducing a parse error.
Waiting on bqjob_r2ae67f6114e672ab_0000017878c358b1_1 ... (56s) Current status: PENDING
                                                                                       
Waiting on bqjob_r2ae67f6114e672ab_0000017878c358b1_1 ... (57s) Current status: PENDING
                                                                                       
Waiting on bqjob_r2ae67f6114e672ab_0000017878c358b1_1 ... (58s) Current status: PENDING
                                                                                       
Waiting on bqjob_r2ae67f6114e672ab_0000017878c358b1_1 ... (59s) Current status: PENDING
                                                                                       
Waiting on bqjob_r2ae67f6114e672ab_0000017878c358b1_1 ... (60s) Current status: PENDING
                                                                                       
Waiting on bqjob_r2ae67f6114e672ab_0000017878c358b1_1 ... (61s) Current status: PENDING
                                                                                       
Waiting on bqjob_r2ae67f6114e672ab_0000017878c358b1_1 ... (62s) Current status: PENDING
                                                                                       
Waiting on bqjob_r2ae67f6114e672ab_0000017878c358b1_1 ... (63s) Current status: PENDING
                                                                                       
Waiting on bqjob_r2ae67f6114e672ab_0000017878c358b1_1 ... (64s) Current status: PENDING
                                                                                       
Waiting on bqjob_r2ae67f6114e672ab_0000017878c358b1_1 ... (64s) Current status: DONE   
+------------------------------+
|             user             |
+------------------------------+
| user16_AndroidGreenCassowary |
| user1_BisqueCockatoo         |
| user4_AliceBlueCockatoo      |
| user1_AndroidGreenBandicoot  |
| user3_AlmondMarmot           |
| user13_FuchsiaKangaroo       |
| user0_BisquePlatypus         |
| user8_AndroidGreenBandicoot  |
| user1_AlmondMarmot           |
| user2_AliceBlueCockatoo      |
+------------------------------+
Verified AliceBlue
RUNNING_JOB=`gcloud dataflow jobs list | grep leaderboard-validation-1616933634845-118 | grep Running | cut -d' ' -f1`
if [ ! -z "${RUNNING_JOB}" ] 
  then 
    gcloud dataflow jobs cancel ${RUNNING_JOB}
  else 
    echo "Job 'leaderboard-validation-1616933634845-118' is not running."
fi 

Cancelled job [2021-03-28_05_14_23-13216340680240304156]

**************************************
* SUCCESS: LeaderBoard successfully run on DataflowRunner. with Streaming Engine
**************************************

[SUCCESS]

FAILURE: Build failed with an exception.

* What went wrong:
Execution failed for task ':runners:google-cloud-dataflow-java:runMobileGamingJavaDataflow'.
> Process 'command '/usr/lib/jvm/java-8-openjdk-amd64/bin/java'' finished with non-zero exit value 1

* Try:
Run with --stacktrace option to get the stack trace. Run with --info or --debug option to get more log output. Run with --scan to get full insights.

* Get more help at https://help.gradle.org

Deprecated Gradle features were used in this build, making it incompatible with Gradle 7.0.
Use '--warning-mode all' to show the individual deprecation warnings.
See https://docs.gradle.org/6.8/userguide/command_line_interface.html#sec:command_line_warnings

BUILD FAILED in 1h 17m 5s
9 actionable tasks: 8 executed, 1 from cache

Publishing build scan...
https://gradle.com/s/lzcfzedv6kcga

Build step 'Invoke Gradle script' changed build result to FAILURE
Build step 'Invoke Gradle script' marked build as failure

---------------------------------------------------------------------
To unsubscribe, e-mail: builds-unsubscribe@beam.apache.org
For additional commands, e-mail: builds-help@beam.apache.org


Jenkins build is back to normal : beam_PostRelease_NightlySnapshot #1326

Posted by Apache Jenkins Server <je...@builds.apache.org>.
See <https://ci-beam.apache.org/job/beam_PostRelease_NightlySnapshot/1326/display/redirect?page=changes>


---------------------------------------------------------------------
To unsubscribe, e-mail: builds-unsubscribe@beam.apache.org
For additional commands, e-mail: builds-help@beam.apache.org


Build failed in Jenkins: beam_PostRelease_NightlySnapshot #1325

Posted by Apache Jenkins Server <je...@builds.apache.org>.
See <https://ci-beam.apache.org/job/beam_PostRelease_NightlySnapshot/1325/display/redirect>

Changes:


------------------------------------------
[...truncated 4.66 MB...]
Mar 29, 2021 11:41:37 AM org.apache.beam.runners.dataflow.util.MonitoringUtil$LoggingHandler process
INFO: 2021-03-29T11:41:37.031Z: Fusing consumer WriteUserScoreSums/BigQueryIO.Write/StreamingInserts/StreamingWriteTables/Reshuffle/ExpandIterable into WriteUserScoreSums/BigQueryIO.Write/StreamingInserts/StreamingWriteTables/Reshuffle/GroupByKey/MergeBuckets
Mar 29, 2021 11:41:37 AM org.apache.beam.runners.dataflow.util.MonitoringUtil$LoggingHandler process
INFO: 2021-03-29T11:41:37.052Z: Fusing consumer WriteUserScoreSums/BigQueryIO.Write/StreamingInserts/StreamingWriteTables/GlobalWindow/Window.Assign into WriteUserScoreSums/BigQueryIO.Write/StreamingInserts/StreamingWriteTables/Reshuffle/ExpandIterable
Mar 29, 2021 11:41:37 AM org.apache.beam.runners.dataflow.util.MonitoringUtil$LoggingHandler process
INFO: 2021-03-29T11:41:37.073Z: Fusing consumer WriteUserScoreSums/BigQueryIO.Write/StreamingInserts/StreamingWriteTables/StripShardId/Map into WriteUserScoreSums/BigQueryIO.Write/StreamingInserts/StreamingWriteTables/GlobalWindow/Window.Assign
Mar 29, 2021 11:41:37 AM org.apache.beam.runners.dataflow.util.MonitoringUtil$LoggingHandler process
INFO: 2021-03-29T11:41:37.099Z: Fusing consumer WriteUserScoreSums/BigQueryIO.Write/StreamingInserts/StreamingWriteTables/StreamingWrite/BatchedStreamingWrite.ViaBundleFinalization/ParMultiDo(BatchAndInsertElements) into WriteUserScoreSums/BigQueryIO.Write/StreamingInserts/StreamingWriteTables/StripShardId/Map
Mar 29, 2021 11:41:37 AM org.apache.beam.runners.dataflow.util.MonitoringUtil$LoggingHandler process
INFO: 2021-03-29T11:41:37.149Z: The pubsub read for: projects/apache-beam-testing/subscriptions/java_mobile_gaming_topic.subscription-825630647081021506 is configured to compute input data watermarks based on custom timestamp attribute timestamp_ms. Cloud Dataflow has created an additional tracking subscription to do this, which will be cleaned up automatically. For details, see: https://cloud.google.com/dataflow/model/pubsub-io#timestamps-ids
Mar 29, 2021 11:41:40 AM org.apache.beam.runners.dataflow.util.MonitoringUtil$LoggingHandler process
INFO: 2021-03-29T11:41:39.207Z: Pub/Sub resources set up for topic 'projects/apache-beam-testing/topics/java_mobile_gaming_topic'.
Mar 29, 2021 11:41:42 AM org.apache.beam.runners.dataflow.util.MonitoringUtil$LoggingHandler process
INFO: 2021-03-29T11:41:40.366Z: Starting 1 workers in us-central1-f...
Mar 29, 2021 11:41:54 AM org.apache.beam.runners.dataflow.util.MonitoringUtil$LoggingHandler process
INFO: 2021-03-29T11:41:54.516Z: Your project already contains 100 Dataflow-created metric descriptors, so new user metrics of the form custom.googleapis.com/* will not be created. However, all user metrics are also available in the metric dataflow.googleapis.com/job/user_counter. If you rely on the custom metrics, you can delete old / unused metric descriptors. See https://developers.google.com/apis-explorer/#p/monitoring/v3/monitoring.projects.metricDescriptors.list and https://developers.google.com/apis-explorer/#p/monitoring/v3/monitoring.projects.metricDescriptors.delete
bq query SELECT table_id FROM beam_postrelease_mobile_gaming.__TABLES_SUMMARY__

Mar 29, 2021 11:42:18 AM org.apache.beam.runners.dataflow.util.MonitoringUtil$LoggingHandler process
INFO: 2021-03-29T11:42:17.969Z: Autoscaling: Raised the number of workers to 1 so that the pipeline can catch up with its backlog and keep up with its input rate.
Waiting on bqjob_r52727445efc5801_000001787dcaa793_1 ... (0s) Current status: RUNNING
                                                                                     
Waiting on bqjob_r52727445efc5801_000001787dcaa793_1 ... (0s) Current status: DONE   
+-----------------------------------+
|             table_id              |
+-----------------------------------+
| hourly_team_score_python_dataflow |
| hourly_team_score_python_direct   |
| leaderboard_DirectRunner_team     |
| leaderboard_DirectRunner_user     |
+-----------------------------------+
Waiting for pipeline to produce more results...
..............................................................................................................................................................................................................................[WARNING] 
java.lang.OutOfMemoryError: unable to create new native thread
    at java.lang.Thread.start0 (Native Method)
    at java.lang.Thread.start (Thread.java:717)
    at org.apache.beam.examples.complete.game.injector.Injector.main (Injector.java:439)
    at sun.reflect.NativeMethodAccessorImpl.invoke0 (Native Method)
    at sun.reflect.NativeMethodAccessorImpl.invoke (NativeMethodAccessorImpl.java:62)
    at sun.reflect.DelegatingMethodAccessorImpl.invoke (DelegatingMethodAccessorImpl.java:43)
    at java.lang.reflect.Method.invoke (Method.java:498)
    at org.codehaus.mojo.exec.ExecJavaMojo$1.run (ExecJavaMojo.java:282)
    at java.lang.Thread.run (Thread.java:748)
[INFO] ------------------------------------------------------------------------
[INFO] BUILD FAILURE
[INFO] ------------------------------------------------------------------------
[INFO] Total time: 01:56 min
[INFO] Finished at: 2021-03-29T11:43:07Z
[INFO] ------------------------------------------------------------------------
[ERROR] Failed to execute goal org.codehaus.mojo:exec-maven-plugin:1.6.0:java (default-cli) on project word-count-beam: An exception occured while executing the Java class. unable to create new native thread -> [Help 1]
[ERROR] 
[ERROR] To see the full stack trace of the errors, re-run Maven with the -e switch.
[ERROR] Re-run Maven using the -X switch to enable full debug logging.
[ERROR] 
[ERROR] For more information about the errors and possible solutions, please read the following articles:
[ERROR] [Help 1] http://cwiki.apache.org/confluence/display/MAVEN/MojoExecutionException
[INFO] Scanning for projects...
[INFO] 
[INFO] --------------------< org.example:word-count-beam >---------------------
[INFO] Building word-count-beam 0.1
[INFO] --------------------------------[ jar ]---------------------------------
[INFO] 
[INFO] --- maven-resources-plugin:2.6:resources (default-resources) @ word-count-beam ---
[WARNING] Using platform encoding (UTF-8 actually) to copy filtered resources, i.e. build is platform dependent!
[INFO] skip non existing resourceDirectory /tmp/groovy-generated-5307329673862717159-tmpdir/word-count-beam/src/main/resources
[INFO] 
[INFO] --- maven-compiler-plugin:3.7.0:compile (default-compile) @ word-count-beam ---
[INFO] Nothing to compile - all classes are up to date
[INFO] 
[INFO] --- exec-maven-plugin:1.6.0:java (default-cli) @ word-count-beam ---
fullTopicName projects/apache-beam-testing/topics/java_mobile_gaming_topic
Injecting to topic: projects/apache-beam-testing/topics/java_mobile_gaming_topic
Starting Injector
[+(ApricotKoala, num members: 6, starting at: 1617018076390, expires in: 21, robot: Robot-9)]
[+(AmberKoala, num members: 14, starting at: 1617018076391, expires in: 21, robot: Robot-0)]
[+(AppleGreenEchidna, num members: 14, starting at: 1617018076391, expires in: 35, robot: null)]
[+(ApricotWombat, num members: 10, starting at: 1617018076391, expires in: 33, robot: null)]
[+(AsparagusAntechinus, num members: 18, starting at: 1617018076392, expires in: 26, robot: null)]
[+(AliceBlueEmu, num members: 18, starting at: 1617018076392, expires in: 37, robot: Robot-19)]
[+(BarnRedPlatypus, num members: 5, starting at: 1617018076393, expires in: 39, robot: null)]
[+(AndroidGreenCaneToad, num members: 9, starting at: 1617018076393, expires in: 37, robot: Robot-1)]
[+(AntiqueBrassKangaroo, num members: 6, starting at: 1617018076393, expires in: 20, robot: null)]
[+(BisqueWallaby, num members: 12, starting at: 1617018076394, expires in: 20, robot: Robot-16)]
[+(ApricotWombat, num members: 6, starting at: 1617018076394, expires in: 34, robot: null)]
[+(AsparagusBilby, num members: 13, starting at: 1617018076394, expires in: 31, robot: Robot-8)]
[+(RubyQuokka, num members: 13, starting at: 1617018076394, expires in: 38, robot: null)]
[+(MagentaPossum, num members: 17, starting at: 1617018076395, expires in: 34, robot: Robot-19)]
[+(RubyCassowary, num members: 7, starting at: 1617018076396, expires in: 33, robot: null)]
DELAY(404630, 1)
{timestamp_ms=1617017671000}
late data for: Robot-8,AsparagusBilby,18,1617017671000,2021-03-29 04:41:16.398
..............................................................................................................................................................................................................................[WARNING] 
java.lang.OutOfMemoryError: unable to create new native thread
    at java.lang.Thread.start0 (Native Method)
    at java.lang.Thread.start (Thread.java:717)
    at org.apache.beam.examples.complete.game.injector.Injector.main (Injector.java:439)
    at sun.reflect.NativeMethodAccessorImpl.invoke0 (Native Method)
    at sun.reflect.NativeMethodAccessorImpl.invoke (NativeMethodAccessorImpl.java:62)
    at sun.reflect.DelegatingMethodAccessorImpl.invoke (DelegatingMethodAccessorImpl.java:43)
    at java.lang.reflect.Method.invoke (Method.java:498)
    at org.codehaus.mojo.exec.ExecJavaMojo$1.run (ExecJavaMojo.java:282)
    at java.lang.Thread.run (Thread.java:748)
[INFO] ------------------------------------------------------------------------
[INFO] BUILD FAILURE
[INFO] ------------------------------------------------------------------------
[INFO] Total time: 01:56 min
[INFO] Finished at: 2021-03-29T11:43:07Z
[INFO] ------------------------------------------------------------------------
[ERROR] Failed to execute goal org.codehaus.mojo:exec-maven-plugin:1.6.0:java (default-cli) on project word-count-beam: An exception occured while executing the Java class. unable to create new native thread -> [Help 1]
[ERROR] 
[ERROR] To see the full stack trace of the errors, re-run Maven with the -e switch.
[ERROR] Re-run Maven using the -X switch to enable full debug logging.
[ERROR] 
[ERROR] For more information about the errors and possible solutions, please read the following articles:
[ERROR] [Help 1] http://cwiki.apache.org/confluence/display/MAVEN/MojoExecutionException
[ERROR] Failed to execute goal org.codehaus.mojo:exec-maven-plugin:1.6.0:java (default-cli) on project word-count-beam: An exception occured while executing the Java class. unable to create new native thread -> [Help 1]
[ERROR] 
[ERROR] To see the full stack trace of the errors, re-run Maven with the -e switch.
[ERROR] Re-run Maven using the -X switch to enable full debug logging.
[ERROR] 
[ERROR] For more information about the errors and possible solutions, please read the following articles:
[ERROR] [Help 1] http://cwiki.apache.org/confluence/display/MAVEN/MojoExecutionException
[ERROR] Failed command

> Task :runners:google-cloud-dataflow-java:runMobileGamingJavaDataflowBom FAILED

> Task :runners:google-cloud-dataflow-java:runMobileGamingJavaDataflow
Repository URL: https://repository.apache.org/content/repositories/snapshots
Version: 2.30.0-SNAPSHOT
GCS Project: apache-beam-testing
GCS Region: us-central1
GCS Storage bucket: temp-storage-for-release-validation-tests/nightly-snapshot-validation
BigQuery Dataset: beam_postrelease_mobile_gaming
PubSub Topic: java_mobile_gaming_topic
**************************************
* Scenario: Run Apache Beam Java SDK Mobile Gaming Examples - Dataflow
**************************************
mvn archetype:generate       --update-snapshots       -DarchetypeGroupId=org.apache.beam       -DarchetypeArtifactId=beam-sdks-java-maven-archetypes-examples       -DarchetypeVersion=2.30.0-SNAPSHOT       -DgroupId=org.example       -DartifactId=word-count-beam       -Dversion="0.1"       -Dpackage=org.apache.beam.examples       -DinteractiveMode=false
Using maven /home/jenkins/tools/maven/apache-maven-3.5.4
Exception in thread "main" java.lang.OutOfMemoryError: unable to create new native thread
	at java.lang.Thread.start0(Native Method)
	at java.lang.Thread.start(Thread.java:717)
	at java.util.concurrent.ThreadPoolExecutor.addWorker(ThreadPoolExecutor.java:957)
	at java.util.concurrent.ThreadPoolExecutor.execute(ThreadPoolExecutor.java:1378)
	at java.lang.UNIXProcess.initStreams(UNIXProcess.java:288)
	at java.lang.UNIXProcess.lambda$new$2(UNIXProcess.java:258)
	at java.security.AccessController.doPrivileged(Native Method)
	at java.lang.UNIXProcess.<init>(UNIXProcess.java:257)
	at java.lang.ProcessImpl.start(ProcessImpl.java:134)
	at java.lang.ProcessBuilder.start(ProcessBuilder.java:1029)
	at java_lang_ProcessBuilder$start$1.call(Unknown Source)
	at org.codehaus.groovy.runtime.callsite.CallSiteArray.defaultCall(CallSiteArray.java:48)
	at org.codehaus.groovy.runtime.callsite.AbstractCallSite.call(AbstractCallSite.java:113)
	at org.codehaus.groovy.runtime.callsite.AbstractCallSite.call(AbstractCallSite.java:117)
	at TestScripts._execute(TestScripts.groovy:168)
	at sun.reflect.NativeMethodAccessorImpl.invoke0(Native Method)
	at sun.reflect.NativeMethodAccessorImpl.invoke(NativeMethodAccessorImpl.java:62)
	at sun.reflect.DelegatingMethodAccessorImpl.invoke(DelegatingMethodAccessorImpl.java:43)
	at java.lang.reflect.Method.invoke(Method.java:498)
	at org.codehaus.groovy.runtime.callsite.PogoMetaMethodSite$PogoCachedMethodSiteNoUnwrap.invoke(PogoMetaMethodSite.java:190)
	at org.codehaus.groovy.runtime.callsite.PogoMetaMethodSite.callCurrent(PogoMetaMethodSite.java:59)
	at org.codehaus.groovy.runtime.callsite.CallSiteArray.defaultCallCurrent(CallSiteArray.java:52)
	at org.codehaus.groovy.runtime.callsite.AbstractCallSite.callCurrent(AbstractCallSite.java:154)
	at org.codehaus.groovy.runtime.callsite.AbstractCallSite.callCurrent(AbstractCallSite.java:166)
	at TestScripts._mvn(TestScripts.groovy:221)
	at sun.reflect.NativeMethodAccessorImpl.invoke0(Native Method)
	at sun.reflect.NativeMethodAccessorImpl.invoke(NativeMethodAccessorImpl.java:62)
	at sun.reflect.DelegatingMethodAccessorImpl.invoke(DelegatingMethodAccessorImpl.java:43)
	at java.lang.reflect.Method.invoke(Method.java:498)
	at org.codehaus.groovy.runtime.callsite.PogoMetaMethodSite$PogoCachedMethodSiteNoUnwrapNoCoerce.invoke(PogoMetaMethodSite.java:210)
	at org.codehaus.groovy.runtime.callsite.PogoMetaMethodSite.callCurrent(PogoMetaMethodSite.java:59)
	at org.codehaus.groovy.runtime.callsite.CallSiteArray.defaultCallCurrent(CallSiteArray.java:52)
	at org.codehaus.groovy.runtime.callsite.AbstractCallSite.callCurrent(AbstractCallSite.java:154)
	at org.codehaus.groovy.runtime.callsite.AbstractCallSite.callCurrent(AbstractCallSite.java:166)
	at TestScripts.run(TestScripts.groovy:126)
	at sun.reflect.NativeMethodAccessorImpl.invoke0(Native Method)
	at sun.reflect.NativeMethodAccessorImpl.invoke(NativeMethodAccessorImpl.java:62)
	at sun.reflect.DelegatingMethodAccessorImpl.invoke(DelegatingMethodAccessorImpl.java:43)
	at java.lang.reflect.Method.invoke(Method.java:498)
	at org.codehaus.groovy.runtime.callsite.PogoMetaMethodSite$PogoCachedMethodSiteNoUnwrap.invoke(PogoMetaMethodSite.java:190)
	at org.codehaus.groovy.runtime.callsite.PogoMetaMethodSite.call(PogoMetaMethodSite.java:71)
	at org.codehaus.groovy.runtime.callsite.CallSiteArray.defaultCall(CallSiteArray.java:48)
	at org.codehaus.groovy.runtime.callsite.AbstractCallSite.call(AbstractCallSite.java:113)
	at org.codehaus.groovy.runtime.callsite.AbstractCallSite.call(AbstractCallSite.java:125)
	at QuickstartArchetype.generate(QuickstartArchetype.groovy:27)
	at QuickstartArchetype$generate.call(Unknown Source)
	at org.codehaus.groovy.runtime.callsite.CallSiteArray.defaultCall(CallSiteArray.java:48)
	at org.codehaus.groovy.runtime.callsite.AbstractCallSite.call(AbstractCallSite.java:113)
	at org.codehaus.groovy.runtime.callsite.AbstractCallSite.call(AbstractCallSite.java:125)
	at mobilegaming-java-dataflow.run(mobilegaming-java-dataflow.groovy:30)
	at sun.reflect.NativeMethodAccessorImpl.invoke0(Native Method)
	at sun.reflect.NativeMethodAccessorImpl.invoke(NativeMethodAccessorImpl.java:62)
	at sun.reflect.DelegatingMethodAccessorImpl.invoke(DelegatingMethodAccessorImpl.java:43)
	at java.lang.reflect.Method.invoke(Method.java:498)
	at org.codehaus.groovy.reflection.CachedMethod.invoke(CachedMethod.java:93)
	at groovy.lang.MetaMethod.doMethodInvoke(MetaMethod.java:325)
	at groovy.lang.MetaClassImpl.invokeMethod(MetaClassImpl.java:1213)
	at groovy.lang.MetaClassImpl.invokeMethod(MetaClassImpl.java:1022)
	at org.codehaus.groovy.runtime.InvokerHelper.invokePogoMethod(InvokerHelper.java:925)
	at org.codehaus.groovy.runtime.InvokerHelper.invokeMethod(InvokerHelper.java:908)
	at org.codehaus.groovy.runtime.InvokerHelper.runScript(InvokerHelper.java:412)
	at org.codehaus.groovy.runtime.InvokerHelper$runScript.call(Unknown Source)
	at org.codehaus.groovy.runtime.callsite.CallSiteArray.defaultCall(CallSiteArray.java:48)
	at org.codehaus.groovy.runtime.callsite.AbstractCallSite.call(AbstractCallSite.java:113)
	at org.codehaus.groovy.runtime.callsite.AbstractCallSite.call(AbstractCallSite.java:133)
	at mobilegaming-java-dataflow.main(mobilegaming-java-dataflow.groovy)

> Task :runners:google-cloud-dataflow-java:runMobileGamingJavaDataflow FAILED

FAILURE: Build completed with 2 failures.

1: Task failed with an exception.
-----------
* What went wrong:
Execution failed for task ':runners:google-cloud-dataflow-java:runMobileGamingJavaDataflowBom'.
> Process 'command '/usr/lib/jvm/java-8-openjdk-amd64/bin/java'' finished with non-zero exit value 1

* Try:
Run with --stacktrace option to get the stack trace. Run with --info or --debug option to get more log output. Run with --scan to get full insights.
==============================================================================

2: Task failed with an exception.
-----------
* What went wrong:
Execution failed for task ':runners:google-cloud-dataflow-java:runMobileGamingJavaDataflow'.
> Process 'command '/usr/lib/jvm/java-8-openjdk-amd64/bin/java'' finished with non-zero exit value 1

* Try:
Run with --stacktrace option to get the stack trace. Run with --info or --debug option to get more log output. Run with --scan to get full insights.
==============================================================================

* Get more help at https://help.gradle.org

Deprecated Gradle features were used in this build, making it incompatible with Gradle 7.0.
Use '--warning-mode all' to show the individual deprecation warnings.
See https://docs.gradle.org/6.8/userguide/command_line_interface.html#sec:command_line_warnings

BUILD FAILED in 42m 50s
9 actionable tasks: 8 executed, 1 from cache

Publishing build scan...

The upload failed to start in the background and will now be performed by the build process.
For more information, please see https://gradle.com/help/gradle-build-scan-background-upload-failure.

https://gradle.com/s/nlvn54ompcsps

Build step 'Invoke Gradle script' changed build result to FAILURE
Build step 'Invoke Gradle script' marked build as failure

---------------------------------------------------------------------
To unsubscribe, e-mail: builds-unsubscribe@beam.apache.org
For additional commands, e-mail: builds-help@beam.apache.org