You are viewing a plain text version of this content. The canonical link for it is here.
Posted to builds@beam.apache.org by Apache Jenkins Server <je...@builds.apache.org> on 2023/05/16 16:33:30 UTC
Build failed in Jenkins: beam_Publish_Beam_SDK_Snapshots #5373
See <https://ci-beam.apache.org/job/beam_Publish_Beam_SDK_Snapshots/5373/display/redirect?page=changes>
Changes:
[noreply] Improve ValueError message in Deduplicate (#26665)
------------------------------------------
[...truncated 2.46 MB...]
#16 1.079 greenlet==2.0.2
#16 1.079 grpc-google-iam-v1==0.12.6
#16 1.079 grpcio==1.54.2
#16 1.079 grpcio-status==1.54.2
#16 1.079 guppy3==3.1.3
#16 1.079 h5py==3.8.0
#16 1.079 hdfs==2.7.0
#16 1.079 httplib2==0.22.0
#16 1.079 hypothesis==6.75.3
#16 1.079 idna==3.4
#16 1.079 importlib-metadata==6.6.0
#16 1.079 iniconfig==2.0.0
#16 1.079 jax==0.4.10
#16 1.079 joblib==1.2.0
#16 1.079 keras==2.12.0
#16 1.079 libclang==16.0.0
#16 1.079 Markdown==3.4.3
#16 1.079 MarkupSafe==2.1.2
#16 1.079 ml-dtypes==0.1.0
#16 1.079 mmh3==3.1.0
#16 1.079 mock==5.0.2
#16 1.079 nltk==3.8.1
#16 1.079 nose==1.3.7
#16 1.079 numpy==1.23.5
#16 1.079 oauth2client==4.1.3
#16 1.079 oauthlib==3.2.2
#16 1.079 objsize==0.6.1
#16 1.079 opt-einsum==3.3.0
#16 1.079 orjson==3.8.12
#16 1.079 overrides==6.5.0
#16 1.079 packaging==23.1
#16 1.079 pandas==1.5.3
#16 1.079 parameterized==0.9.0
#16 1.079 pip==23.1.2
#16 1.079 pluggy==1.0.0
#16 1.079 proto-plus==1.22.2
#16 1.079 protobuf==4.22.5
#16 1.079 psycopg2-binary==2.9.6
#16 1.079 pyarrow==11.0.0
#16 1.079 pyasn1==0.5.0
#16 1.079 pyasn1-modules==0.3.0
#16 1.079 pycparser==2.21
#16 1.079 pydot==1.4.2
#16 1.079 PyHamcrest==2.0.4
#16 1.079 pymongo==4.3.3
#16 1.079 PyMySQL==1.0.3
#16 1.079 pyparsing==3.0.9
#16 1.079 pytest==7.3.1
#16 1.079 pytest-timeout==2.1.0
#16 1.079 pytest-xdist==3.3.0
#16 1.079 python-dateutil==2.8.2
#16 1.079 python-snappy==0.6.1
#16 1.079 pytz==2023.3
#16 1.079 PyYAML==6.0
#16 1.079 regex==2023.5.5
#16 1.079 requests==2.30.0
#16 1.079 requests-mock==1.10.0
#16 1.079 requests-oauthlib==1.3.1
#16 1.079 rsa==4.9
#16 1.079 scikit-learn==1.2.2
#16 1.079 scipy==1.10.1
#16 1.079 setuptools==67.7.2
#16 1.079 six==1.16.0
#16 1.079 sortedcontainers==2.4.0
#16 1.079 soupsieve==2.4.1
#16 1.079 SQLAlchemy==1.4.48
#16 1.079 sqlparse==0.4.4
#16 1.079 tenacity==8.2.2
#16 1.079 tensorboard==2.12.3
#16 1.079 tensorboard-data-server==0.7.0
#16 1.079 tensorflow==2.12.0
#16 1.079 tensorflow-estimator==2.12.0
#16 1.079 tensorflow-io-gcs-filesystem==0.32.0
#16 1.079 termcolor==2.3.0
#16 1.079 testcontainers==3.7.1
#16 1.079 threadpoolctl==3.1.0
#16 1.079 tomli==2.0.1
#16 1.079 tqdm==4.65.0
#16 1.079 typing_extensions==4.5.0
#16 1.079 uritemplate==4.1.1
#16 1.079 urllib3==1.26.15
#16 1.079 websocket-client==1.5.1
#16 1.079 Werkzeug==2.3.4
#16 1.079 wheel==0.40.0
#16 1.079 wrapt==1.14.1
#16 1.079 zipp==3.15.0
#16 1.079 zstandard==0.21.0
#16 DONE 1.2s
#17 [beam 13/16] COPY target/LICENSE /opt/apache/beam/
#17 DONE 0.0s
#18 [beam 14/16] COPY target/LICENSE.python /opt/apache/beam/
#18 DONE 0.0s
#19 [beam 15/16] COPY target/NOTICE /opt/apache/beam/
#19 DONE 0.0s
#20 [beam 16/16] COPY target/launcher/linux_amd64/boot /opt/apache/beam/
#20 DONE 0.2s
#21 [third_party_licenses 1/4] COPY target/license_scripts /tmp/license_scripts/
#21 DONE 0.1s
#22 [third_party_licenses 2/4] COPY target/go-licenses/* /opt/apache/beam/third_party_licenses/golang/
#22 DONE 0.1s
#23 [third_party_licenses 3/4] COPY target/license_scripts /tmp/license_scripts/
#23 DONE 0.1s
#24 [third_party_licenses 4/4] RUN if [ "true" = "true" ] ; then pip install 'pip-licenses<5' pyyaml tenacity && python /tmp/license_scripts/pull_licenses_py.py ; fi
#24 1.050 Collecting pip-licenses<5
#24 1.126 Downloading pip_licenses-4.3.1-py3-none-any.whl (19 kB)
#24 1.137 Requirement already satisfied: pyyaml in /usr/local/lib/python3.9/site-packages (6.0)
#24 1.137 Requirement already satisfied: tenacity in /usr/local/lib/python3.9/site-packages (8.2.2)
#24 1.206 Collecting prettytable>=2.3.0 (from pip-licenses<5)
#24 1.222 Downloading prettytable-3.7.0-py3-none-any.whl (27 kB)
#24 1.376 Collecting wcwidth (from prettytable>=2.3.0->pip-licenses<5)
#24 1.394 Downloading wcwidth-0.2.6-py2.py3-none-any.whl (29 kB)
#24 2.742 Installing collected packages: wcwidth, prettytable, pip-licenses
#24 2.913 Successfully installed pip-licenses-4.3.1 prettytable-3.7.0 wcwidth-0.2.6
#24 2.914 WARNING: Running pip as the 'root' user can result in broken permissions and conflicting behaviour with the system package manager. It is recommended to use a virtual environment instead: https://pip.pypa.io/warnings/venv
#24 9.143 INFO:root:Successfully pulled licenses for 135 dependencies
#24 9.143 Skip pulling license for bs4
#24 DONE 9.3s
#25 [stage-2 1/2] COPY --from=third_party_licenses /opt/apache/beam/third_party_licenses /opt/apache/beam/third_party_licenses
#25 DONE 0.2s
#26 [stage-2 2/2] RUN if [ "true" != "true" ] ; then rm -rf /opt/apache/beam/third_party_licenses ; fi
#26 DONE 1.3s
#27 exporting to image
#27 exporting layers
> Task :sdks:python:container:py37:docker
#24 7.477 INFO:root:Successfully pulled licenses for 112 dependencies
#24 7.477 Skip pulling license for bs4
#24 DONE 7.5s
#25 [stage-2 1/2] COPY --from=third_party_licenses /opt/apache/beam/third_party_licenses /opt/apache/beam/third_party_licenses
#25 DONE 0.2s
#26 [stage-2 2/2] RUN if [ "true" != "true" ] ; then rm -rf /opt/apache/beam/third_party_licenses ; fi
#26 DONE 1.5s
#27 exporting to image
#27 exporting layers
#27 exporting layers 17.3s done
#27 writing image sha256:c79cc906924ba4f5b56d60809e6eeddfb3f81cd786e2d86bc7f945c906395131 done
#27 naming to gcr.io/apache-beam-testing/beam-sdk/beam_python3.7_sdk:2.48.0.dev done
#27 DONE 17.3s
> Task :sdks:python:container:py37:dockerTag2.48.0-SNAPSHOT
> Task :sdks:python:container:py311:docker
#27 exporting layers 20.5s done
#27 writing image sha256:6e8e61218ac2bf27d9d44710a4aedb33c55f0ec567d4adb5350b5dde3b50c380
#27 writing image sha256:6e8e61218ac2bf27d9d44710a4aedb33c55f0ec567d4adb5350b5dde3b50c380 done
#27 naming to gcr.io/apache-beam-testing/beam-sdk/beam_python3.11_sdk:2.48.0.dev done
#27 DONE 20.6s
> Task :sdks:python:container:py311:dockerTag2.48.0-SNAPSHOT
> Task :sdks:python:container:py310:docker
#27 exporting layers 21.3s done
#27 writing image sha256:eb792235a3350f4d09b9eb8d6bee8870c796108cf33e81cd5339fc4c59ac3557
#27 writing image sha256:eb792235a3350f4d09b9eb8d6bee8870c796108cf33e81cd5339fc4c59ac3557 done
#27 naming to gcr.io/apache-beam-testing/beam-sdk/beam_python3.10_sdk:2.48.0.dev done
#27 DONE 21.3s
> Task :sdks:python:container:py310:dockerTag2.48.0-SNAPSHOT
> Task :sdks:python:container:py38:docker
#27 exporting layers 21.3s done
#27 writing image sha256:e1410c39a5f2e17203c7c11c54d2966cc0d995eb5c645d1fbb1c93e855633294 0.0s done
#27 naming to gcr.io/apache-beam-testing/beam-sdk/beam_python3.8_sdk:2.48.0.dev
#27 naming to gcr.io/apache-beam-testing/beam-sdk/beam_python3.8_sdk:2.48.0.dev done
#27 DONE 21.4s
> Task :sdks:python:container:py38:dockerTag2.48.0-SNAPSHOT
> Task :sdks:python:container:py39:docker
#27 exporting layers 20.7s done
#27 writing image sha256:dda5b14a981a81e3424ed26ff0872b6e45d2f12500cfb90fd737031ac925134b done
#27 naming to gcr.io/apache-beam-testing/beam-sdk/beam_python3.9_sdk:2.48.0.dev done
#27 DONE 20.8s
> Task :sdks:python:container:py39:dockerTag2.48.0-SNAPSHOT
> Task :sdks:python:container:py37:dockerPush2.48.0-SNAPSHOT
> Task :sdks:python:container:py311:dockerPush2.48.0-SNAPSHOT
> Task :sdks:python:container:py310:dockerPush2.48.0-SNAPSHOT
> Task :sdks:python:container:py38:dockerPush2.48.0-SNAPSHOT
> Task :sdks:python:container:py39:dockerPush2.48.0-SNAPSHOT
> Task :sdks:python:container:py37:dockerTag7a2c22d10e344b3e7e7741074027cc4fb8c13165
> Task :sdks:python:container:py37:dockerPush7a2c22d10e344b3e7e7741074027cc4fb8c13165
> Task :sdks:python:container:py311:dockerTag7a2c22d10e344b3e7e7741074027cc4fb8c13165
> Task :sdks:python:container:py37:dockerTagLatest
> Task :sdks:python:container:py311:dockerPush7a2c22d10e344b3e7e7741074027cc4fb8c13165
> Task :sdks:python:container:py311:dockerTagLatest
> Task :sdks:python:container:py37:dockerPushLatest
> Task :sdks:python:container:py37:dockerTagsPush
> Task :sdks:python:container:py311:dockerPushLatest
> Task :sdks:python:container:py311:dockerTagsPush
> Task :sdks:python:container:py310:dockerTag7a2c22d10e344b3e7e7741074027cc4fb8c13165
> Task :sdks:python:container:py310:dockerPush7a2c22d10e344b3e7e7741074027cc4fb8c13165
> Task :sdks:python:container:py310:dockerTagLatest
> Task :sdks:python:container:py310:dockerPushLatest
> Task :sdks:python:container:py310:dockerTagsPush
> Task :sdks:python:container:py38:dockerTag7a2c22d10e344b3e7e7741074027cc4fb8c13165
> Task :sdks:python:container:py38:dockerPush7a2c22d10e344b3e7e7741074027cc4fb8c13165
> Task :sdks:python:container:py38:dockerTagLatest
> Task :sdks:python:container:py38:dockerPushLatest
> Task :sdks:python:container:py38:dockerTagsPush
> Task :sdks:python:container:py39:dockerTag7a2c22d10e344b3e7e7741074027cc4fb8c13165
> Task :sdks:python:container:py39:dockerPush7a2c22d10e344b3e7e7741074027cc4fb8c13165
> Task :sdks:python:container:py39:dockerTagLatest
> Task :sdks:python:container:py39:dockerPushLatest
> Task :sdks:python:container:py39:dockerTagsPush
FAILURE: Build failed with an exception.
* What went wrong:
Execution failed for task ':sdks:java:container:java8:docker'.
> Process 'command 'docker'' finished with non-zero exit value 1
* Try:
> Run with --stacktrace option to get the stack trace.
> Run with --info or --debug option to get more log output.
* Get more help at https://help.gradle.org
Deprecated Gradle features were used in this build, making it incompatible with Gradle 8.0.
You can use '--warning-mode all' to show the individual deprecation warnings and determine if they come from your own scripts or plugins.
See https://docs.gradle.org/7.5.1/userguide/command_line_interface.html#sec:command_line_warnings
Execution optimizations have been disabled for 3 invalid unit(s) of work during this build to ensure correctness.
Please consult deprecation warnings for more details.
BUILD FAILED in 20m 1s
200 actionable tasks: 188 executed, 12 up-to-date
Publishing build scan...
https://ge.apache.org/s/k4bpvz6mn3ew2
Build step 'Invoke Gradle script' changed build result to FAILURE
Build step 'Invoke Gradle script' marked build as failure
---------------------------------------------------------------------
To unsubscribe, e-mail: builds-unsubscribe@beam.apache.org
For additional commands, e-mail: builds-help@beam.apache.org
Jenkins build is back to normal : beam_Publish_Beam_SDK_Snapshots #5375
Posted by Apache Jenkins Server <je...@builds.apache.org>.
See <https://ci-beam.apache.org/job/beam_Publish_Beam_SDK_Snapshots/5375/display/redirect>
---------------------------------------------------------------------
To unsubscribe, e-mail: builds-unsubscribe@beam.apache.org
For additional commands, e-mail: builds-help@beam.apache.org
Build failed in Jenkins: beam_Publish_Beam_SDK_Snapshots #5374
Posted by Apache Jenkins Server <je...@builds.apache.org>.
See <https://ci-beam.apache.org/job/beam_Publish_Beam_SDK_Snapshots/5374/display/redirect>
Changes:
------------------------------------------
[...truncated 2.47 MB...]
#16 1.336 google-cloud-videointelligence==2.11.1
#16 1.336 google-cloud-vision==3.4.1
#16 1.336 google-crc32c==1.5.0
#16 1.336 google-pasta==0.2.0
#16 1.336 google-resumable-media==2.5.0
#16 1.336 googleapis-common-protos==1.59.0
#16 1.336 greenlet==2.0.2
#16 1.336 grpc-google-iam-v1==0.12.6
#16 1.336 grpcio==1.54.2
#16 1.336 grpcio-status==1.54.2
#16 1.336 guppy3==3.1.3
#16 1.336 h5py==3.8.0
#16 1.336 hdfs==2.7.0
#16 1.336 httplib2==0.22.0
#16 1.336 hypothesis==6.75.3
#16 1.336 idna==3.4
#16 1.336 importlib-metadata==6.6.0
#16 1.336 iniconfig==2.0.0
#16 1.336 jax==0.4.10
#16 1.336 joblib==1.2.0
#16 1.336 keras==2.12.0
#16 1.336 libclang==16.0.0
#16 1.336 Markdown==3.4.3
#16 1.336 MarkupSafe==2.1.2
#16 1.336 ml-dtypes==0.1.0
#16 1.336 mmh3==3.1.0
#16 1.336 mock==5.0.2
#16 1.336 nltk==3.8.1
#16 1.336 nose==1.3.7
#16 1.336 numpy==1.23.5
#16 1.336 oauth2client==4.1.3
#16 1.336 oauthlib==3.2.2
#16 1.336 objsize==0.6.1
#16 1.336 opt-einsum==3.3.0
#16 1.336 orjson==3.8.12
#16 1.336 overrides==6.5.0
#16 1.336 packaging==23.1
#16 1.336 pandas==1.5.3
#16 1.336 parameterized==0.9.0
#16 1.336 pip==23.1.2
#16 1.336 pluggy==1.0.0
#16 1.336 proto-plus==1.22.2
#16 1.336 protobuf==4.22.5
#16 1.336 psycopg2-binary==2.9.6
#16 1.336 pyarrow==11.0.0
#16 1.336 pyasn1==0.5.0
#16 1.336 pyasn1-modules==0.3.0
#16 1.336 pycparser==2.21
#16 1.336 pydot==1.4.2
#16 1.336 PyHamcrest==2.0.4
#16 1.336 pymongo==4.3.3
#16 1.336 PyMySQL==1.0.3
#16 1.336 pyparsing==3.0.9
#16 1.336 pytest==7.3.1
#16 1.336 pytest-timeout==2.1.0
#16 1.336 pytest-xdist==3.3.0
#16 1.336 python-dateutil==2.8.2
#16 1.336 python-snappy==0.6.1
#16 1.336 pytz==2023.3
#16 1.336 PyYAML==6.0
#16 1.336 regex==2023.5.5
#16 1.336 requests==2.30.0
#16 1.336 requests-mock==1.10.0
#16 1.336 requests-oauthlib==1.3.1
#16 1.336 rsa==4.9
#16 1.336 scikit-learn==1.2.2
#16 1.336 scipy==1.10.1
#16 1.336 setuptools==67.7.2
#16 1.336 six==1.16.0
#16 1.336 sortedcontainers==2.4.0
#16 1.336 soupsieve==2.4.1
#16 1.336 SQLAlchemy==1.4.48
#16 1.336 sqlparse==0.4.4
#16 1.336 tenacity==8.2.2
#16 1.336 tensorboard==2.12.3
#16 1.336 tensorboard-data-server==0.7.0
#16 1.336 tensorflow==2.12.0
#16 1.336 tensorflow-estimator==2.12.0
#16 1.336 tensorflow-io-gcs-filesystem==0.32.0
#16 1.336 termcolor==2.3.0
#16 1.336 testcontainers==3.7.1
#16 1.336 threadpoolctl==3.1.0
#16 1.336 tomli==2.0.1
#16 1.336 tqdm==4.65.0
#16 1.336 typing_extensions==4.5.0
#16 1.336 uritemplate==4.1.1
#16 1.336 urllib3==1.26.15
#16 1.336 websocket-client==1.5.1
#16 1.336 Werkzeug==2.3.4
#16 1.336 wheel==0.40.0
#16 1.336 wrapt==1.14.1
#16 1.336 zipp==3.15.0
#16 1.336 zstandard==0.21.0
#16 DONE 1.5s
#17 [beam 13/16] COPY target/LICENSE /opt/apache/beam/
#17 DONE 0.0s
#18 [beam 14/16] COPY target/LICENSE.python /opt/apache/beam/
#18 DONE 0.1s
#19 [beam 15/16] COPY target/NOTICE /opt/apache/beam/
#19 DONE 0.1s
#20 [beam 16/16] COPY target/launcher/linux_amd64/boot /opt/apache/beam/
#20 DONE 0.2s
#21 [third_party_licenses 1/4] COPY target/license_scripts /tmp/license_scripts/
#21 DONE 0.1s
#22 [third_party_licenses 2/4] COPY target/go-licenses/* /opt/apache/beam/third_party_licenses/golang/
#22 DONE 0.1s
#23 [third_party_licenses 3/4] COPY target/license_scripts /tmp/license_scripts/
#23 DONE 0.2s
#24 [third_party_licenses 4/4] RUN if [ "true" = "true" ] ; then pip install 'pip-licenses<5' pyyaml tenacity && python /tmp/license_scripts/pull_licenses_py.py ; fi
#24 1.434 Collecting pip-licenses<5
#24 1.499 Downloading pip_licenses-4.3.1-py3-none-any.whl (19 kB)
#24 1.518 Requirement already satisfied: pyyaml in /usr/local/lib/python3.9/site-packages (6.0)
#24 1.519 Requirement already satisfied: tenacity in /usr/local/lib/python3.9/site-packages (8.2.2)
#24 1.603 Collecting prettytable>=2.3.0 (from pip-licenses<5)
#24 1.620 Downloading prettytable-3.7.0-py3-none-any.whl (27 kB)
#24 1.699 Collecting wcwidth (from prettytable>=2.3.0->pip-licenses<5)
#24 1.714 Downloading wcwidth-0.2.6-py2.py3-none-any.whl (29 kB)
#24 3.168 Installing collected packages: wcwidth, prettytable, pip-licenses
#24 3.415 Successfully installed pip-licenses-4.3.1 prettytable-3.7.0 wcwidth-0.2.6
#24 3.416 WARNING: Running pip as the 'root' user can result in broken permissions and conflicting behaviour with the system package manager. It is recommended to use a virtual environment instead: https://pip.pypa.io/warnings/venv
#24 10.16 INFO:root:Successfully pulled licenses for 135 dependencies
#24 10.16 Skip pulling license for bs4
#24 DONE 10.3s
#25 [stage-2 1/2] COPY --from=third_party_licenses /opt/apache/beam/third_party_licenses /opt/apache/beam/third_party_licenses
#25 DONE 0.1s
#26 [stage-2 2/2] RUN if [ "true" != "true" ] ; then rm -rf /opt/apache/beam/third_party_licenses ; fi
#26 DONE 0.3s
#27 exporting to image
#27 exporting layers
> Task :sdks:python:container:py311:docker
#27 exporting layers 17.8s done
#27 writing image sha256:29d59720ac50222f896861d615352067dab8783a0bcad16ba3be46f808dda86f done
#27 naming to gcr.io/apache-beam-testing/beam-sdk/beam_python3.11_sdk:2.48.0.dev done
#27 DONE 17.8s
> Task :sdks:python:container:py38:docker
#24 10.10 INFO:root:Successfully pulled licenses for 135 dependencies
#24 10.10 Skip pulling license for bs4
#24 DONE 10.2s
#25 [stage-2 1/2] COPY --from=third_party_licenses /opt/apache/beam/third_party_licenses /opt/apache/beam/third_party_licenses
#25 DONE 0.2s
#26 [stage-2 2/2] RUN if [ "true" != "true" ] ; then rm -rf /opt/apache/beam/third_party_licenses ; fi
#26 DONE 0.5s
#27 exporting to image
#27 exporting layers
> Task :sdks:python:container:py311:dockerTag2.48.0-SNAPSHOT
> Task :sdks:python:container:py310:docker
#27 exporting layers 18.7s done
#27 writing image sha256:ce68759c99e4b13d6b85b17a1448175e65faeff29b50a29b5074a46d65fda019
#27 writing image sha256:ce68759c99e4b13d6b85b17a1448175e65faeff29b50a29b5074a46d65fda019 0.0s done
#27 naming to gcr.io/apache-beam-testing/beam-sdk/beam_python3.10_sdk:2.48.0.dev done
#27 DONE 18.7s
> Task :sdks:python:container:py310:dockerTag2.48.0-SNAPSHOT
> Task :sdks:python:container:py39:docker
#27 exporting layers 18.1s done
#27 writing image sha256:80bb809e0d3366f8fa70f64c69713b8f0c4f7d962dfe30ca77f80262bf308c4a 0.0s done
#27 naming to gcr.io/apache-beam-testing/beam-sdk/beam_python3.9_sdk:2.48.0.dev
#27 naming to gcr.io/apache-beam-testing/beam-sdk/beam_python3.9_sdk:2.48.0.dev done
#27 DONE 18.1s
> Task :sdks:python:container:py39:dockerTag2.48.0-SNAPSHOT
> Task :sdks:python:container:py38:docker
#27 exporting layers 18.1s done
#27 writing image sha256:bd6ee56d7fec1efbd8b7e125815a60cb57c03ce824c13598d3c93df1f212b531
#27 writing image sha256:bd6ee56d7fec1efbd8b7e125815a60cb57c03ce824c13598d3c93df1f212b531 0.0s done
#27 naming to gcr.io/apache-beam-testing/beam-sdk/beam_python3.8_sdk:2.48.0.dev done
#27 DONE 18.1s
> Task :sdks:python:container:py38:dockerTag2.48.0-SNAPSHOT
> Task :sdks:python:container:py37:dockerPush2.48.0-SNAPSHOT
> Task :sdks:python:container:py311:dockerPush2.48.0-SNAPSHOT
> Task :sdks:python:container:py310:dockerPush2.48.0-SNAPSHOT
> Task :sdks:python:container:py39:dockerPush2.48.0-SNAPSHOT
> Task :sdks:python:container:py38:dockerPush2.48.0-SNAPSHOT
> Task :sdks:python:container:py37:dockerTag457a9e1511bada6d2a3ffc9ec5429c1c20552310
> Task :sdks:python:container:py37:dockerPush457a9e1511bada6d2a3ffc9ec5429c1c20552310
> Task :sdks:python:container:py37:dockerTagLatest
> Task :sdks:python:container:py311:dockerTag457a9e1511bada6d2a3ffc9ec5429c1c20552310
> Task :sdks:python:container:py37:dockerPushLatest
> Task :sdks:python:container:py37:dockerTagsPush
> Task :sdks:python:container:py311:dockerPush457a9e1511bada6d2a3ffc9ec5429c1c20552310
> Task :sdks:python:container:py311:dockerTagLatest
> Task :sdks:python:container:py311:dockerPushLatest
> Task :sdks:python:container:py311:dockerTagsPush
> Task :sdks:python:container:py310:dockerTag457a9e1511bada6d2a3ffc9ec5429c1c20552310
> Task :sdks:python:container:py310:dockerPush457a9e1511bada6d2a3ffc9ec5429c1c20552310
> Task :sdks:python:container:py310:dockerTagLatest
> Task :sdks:python:container:py310:dockerPushLatest
> Task :sdks:python:container:py310:dockerTagsPush
> Task :sdks:python:container:py39:dockerTag457a9e1511bada6d2a3ffc9ec5429c1c20552310
> Task :sdks:python:container:py39:dockerPush457a9e1511bada6d2a3ffc9ec5429c1c20552310
> Task :sdks:python:container:py39:dockerTagLatest
> Task :sdks:python:container:py39:dockerPushLatest
> Task :sdks:python:container:py39:dockerTagsPush
> Task :sdks:python:container:py38:dockerTag457a9e1511bada6d2a3ffc9ec5429c1c20552310
> Task :sdks:python:container:py38:dockerPush457a9e1511bada6d2a3ffc9ec5429c1c20552310
> Task :sdks:python:container:py38:dockerTagLatest
> Task :sdks:python:container:py38:dockerPushLatest
> Task :sdks:python:container:py38:dockerTagsPush
FAILURE: Build failed with an exception.
* What went wrong:
Execution failed for task ':sdks:java:container:java8:docker'.
> Process 'command 'docker'' finished with non-zero exit value 1
* Try:
> Run with --stacktrace option to get the stack trace.
> Run with --info or --debug option to get more log output.
* Get more help at https://help.gradle.org
Deprecated Gradle features were used in this build, making it incompatible with Gradle 8.0.
You can use '--warning-mode all' to show the individual deprecation warnings and determine if they come from your own scripts or plugins.
See https://docs.gradle.org/7.5.1/userguide/command_line_interface.html#sec:command_line_warnings
Execution optimizations have been disabled for 3 invalid unit(s) of work during this build to ensure correctness.
Please consult deprecation warnings for more details.
BUILD FAILED in 31m 55s
200 actionable tasks: 188 executed, 12 up-to-date
Publishing build scan...
https://ge.apache.org/s/7l3qnw2qp4siq
Build step 'Invoke Gradle script' changed build result to FAILURE
Build step 'Invoke Gradle script' marked build as failure
---------------------------------------------------------------------
To unsubscribe, e-mail: builds-unsubscribe@beam.apache.org
For additional commands, e-mail: builds-help@beam.apache.org